{"text_format":"1","workbook":"xlsx","n_sheets":8,"sheets":["Title III Budget","Transferability","Title III Program","IY","Private Schools","GEPA","Prefills","Sheet2"],"not_rendered":{"charts":0,"images":2,"macros":1,"external_links":1,"defined_names":35,"comments":2,"pivot_tables":0},"unopened":[],"bounds":{"document_bytes":16777216,"sheet_cells":100000,"rows_first":2000,"rows_last":500,"rows_between":2000,"halvings":0,"cell_chars":16384,"cell_head_chars":4096},"cells_cut":0,"cells_raw":0,"read":"whole","date_system":"1900"}

{"sheet":"Title III Budget","index":0,"n_rows":356,"n_cols":21,"rows_kept":356,"cut":false,"hidden":false,"merged":[[292,11,292,12],[289,13,289,15],[284,0,284,7],[284,8,284,10],[287,0,287,7],[285,8,285,10],[288,11,288,12],[289,11,289,12],[290,0,290,7],[289,0,289,7],[290,8,290,10],[291,11,291,12],[291,0,291,7],[292,0,292,7],[285,13,285,15],[288,0,288,7],[287,13,287,15],[286,8,286,10],[285,0,285,7],[286,0,286,7],[235,0,235,9],[235,10,235,12],[235,13,235,15],[241,10,241,12],[244,0,244,15],[247,13,247,15],[246,0,246,15],[248,13,248,15],[256,0,256,9],[256,10,256,12],[232,0,232,9],[232,10,232,12],[232,13,232,15],[233,0,233,9],[233,10,233,12],[233,13,233,15],[234,0,234,9],[234,10,234,12],[234,13,234,15],[187,0,187,9],[185,0,185,15],[188,0,188,9],[188,10,188,12],[188,13,188,15],[192,13,192,15],[215,13,215,15],[216,0,216,9],[216,10,216,12],[216,13,216,15],[202,0,202,15],[209,13,209,15],[209,0,209,9],[207,10,207,12],[208,10,208,12],[209,10,209,12],[206,0,206,9],[208,0,208,9],[206,13,206,15],[207,13,207,15],[208,13,208,15],[199,0,199,9],[193,0,193,9],[199,13,199,15],[189,0,189,9],[189,10,189,12],[189,13,189,15],[194,13,194,15],[193,10,193,12],[194,10,194,12],[190,0,190,9],[190,10,190,12],[190,13,190,15],[191,0,191,9],[191,10,191,12],[191,13,191,15],[192,0,192,9],[192,10,192,12],[193,13,193,15],[175,0,175,7],[175,8,175,10],[175,11,175,12],[175,13,175,15],[186,13,186,15],[182,0,182,15],[187,13,187,15],[178,11,178,12],[187,10,187,12],[178,8,178,10],[184,0,184,15],[183,0,183,15],[180,0,180,15],[176,0,176,7],[177,0,177,7],[176,11,176,12],[177,11,177,12],[178,13,178,15],[186,0,186,9],[186,10,186,12],[176,13,176,15],[177,13,177,15],[176,8,176,10],[177,8,177,10],[172,0,172,7],[172,8,172,10],[172,11,172,12],[172,13,172,15],[173,0,173,7],[173,8,173,10],[173,11,173,12],[173,13,173,15],[174,0,174,7],[174,8,174,10],[174,11,174,12],[174,13,174,15],[169,0,169,7],[169,8,169,10],[169,11,169,12],[169,13,169,15],[170,0,170,7],[170,8,170,10],[170,11,170,12],[170,13,170,15],[171,0,171,7],[171,8,171,10],[171,11,171,12],[171,13,171,15],[118,14,121,15],[132,14,132,15],[138,1,138,15],[132,10,132,13],[130,14,131,15],[132,6,132,9],[164,0,164,7],[132,1,132,5],[161,0,161,7],[161,8,161,10],[161,11,161,12],[166,8,166,10],[166,11,166,12],[166,13,166,15],[167,0,167,7],[167,8,167,10],[167,11,167,12],[167,13,167,15],[168,0,168,7],[168,8,168,10],[168,11,168,12],[168,13,168,15],[117,1,117,5],[101,6,101,9],[109,10,109,13],[108,10,108,13],[102,1,102,5],[107,14,111,15],[105,1,105,5],[106,14,106,15],[113,0,117,0],[116,1,116,5],[129,14,129,15],[42,16,42,19],[20,6,20,8],[20,11,20,13],[11,2,11,11],[14,0,14,6],[14,9,14,15],[16,7,16,8],[16,0,16,6],[14,7,14,8],[15,7,15,8],[25,0,25,15],[19,5,19,6],[15,0,15,6],[29,1,29,3],[39,0,39,15],[33,7,33,14],[35,0,35,5],[19,9,19,10],[20,0,20,3],[20,9,20,10],[17,0,18,6],[18,7,18,15],[16,9,16,11],[45,10,45,12],[31,7,31,14],[43,2,43,3],[31,0,31,5],[41,0,41,15],[43,0,43,1],[37,0,37,15],[38,0,38,15],[42,2,42,3],[42,13,42,15],[42,4,42,12],[33,0,33,5],[42,0,42,1],[251,0,251,9],[252,0,252,9],[239,10,239,12],[286,11,286,12],[271,8,271,10],[98,1,98,5],[101,1,101,5],[230,10,230,12],[125,1,125,5],[109,1,109,5],[108,1,108,5],[119,6,119,9],[117,6,117,9],[112,10,112,13],[114,1,114,5],[113,1,113,5],[113,10,113,13],[96,0,101,0],[194,0,194,9],[129,1,129,5],[269,0,269,15],[270,0,270,7],[164,8,164,10],[164,11,164,12],[122,1,122,5],[57,5,57,12],[56,5,56,9],[106,10,106,13],[106,6,106,9],[111,10,111,13],[111,6,111,9],[105,10,105,13],[117,10,117,13],[97,1,97,5],[102,6,102,9],[109,6,109,9],[107,6,107,9],[105,6,105,9],[120,1,120,5],[60,5,60,9],[96,1,96,5],[89,0,89,15],[62,0,62,15],[102,10,102,13],[115,1,115,5],[117,14,117,15],[112,1,112,5],[101,10,101,13],[127,10,127,13],[118,1,118,5],[107,10,107,13],[106,1,106,5],[355,0,355,15],[354,1,354,15],[329,0,329,15],[336,0,336,15],[350,1,350,15],[335,0,335,15],[338,1,338,15],[340,1,340,15],[342,1,342,15],[331,0,331,15],[333,0,333,15],[351,1,351,15],[353,1,353,15],[346,0,346,15],[349,0,349,15],[352,0,352,15],[345,1,345,15],[347,1,347,15],[126,1,126,5],[123,1,123,5],[343,1,343,15],[348,1,348,15],[341,0,341,15],[161,13,161,15],[162,0,162,7],[162,8,162,10],[162,11,162,12],[162,13,162,15],[163,0,163,7],[163,8,163,10],[163,11,163,12],[163,13,163,15],[210,10,210,12],[236,10,236,12],[195,10,195,12],[196,10,196,12],[203,0,203,15],[206,10,206,12],[204,0,204,15],[205,0,205,15],[198,0,198,9],[197,13,197,15],[195,13,195,15],[196,13,196,15],[151,8,151,10],[126,10,126,13],[122,10,122,13],[130,10,130,13],[114,6,114,9],[114,10,114,13],[129,10,129,13],[131,1,131,5],[130,1,130,5],[124,1,124,5],[124,6,124,9],[124,10,124,13],[123,6,123,9],[123,10,123,13],[125,6,125,9],[125,10,125,13],[120,6,120,9],[120,10,120,13],[131,6,131,9],[131,10,131,13],[129,6,129,9],[128,6,128,9],[127,1,127,5],[127,6,127,9],[128,10,128,13],[121,6,121,9],[119,1,119,5],[122,14,122,15],[108,6,108,9],[154,0,154,7],[152,0,152,7],[153,0,153,7],[151,0,151,7],[118,6,118,9],[154,11,154,12],[153,11,153,12],[118,10,118,13],[133,6,133,9],[123,0,129,0],[121,1,121,5],[128,1,128,5],[154,8,154,10],[122,6,122,9],[119,10,119,13],[121,10,121,13],[118,0,122,0],[126,6,126,9],[150,13,150,15],[151,13,151,15],[130,6,130,9],[123,14,128,15],[135,6,135,9],[135,10,135,13],[135,14,135,15],[133,14,133,15],[148,0,148,15],[149,0,149,15],[134,1,134,5],[134,6,134,9],[134,10,134,13],[133,1,133,5],[147,0,147,15],[143,0,143,15],[146,0,146,15],[135,1,135,5],[139,1,139,15],[134,14,134,15],[141,0,141,15],[133,10,133,13],[150,11,150,12],[151,11,151,12],[130,0,132,0],[197,10,197,12],[197,0,197,9],[195,0,195,9],[196,0,196,9],[198,13,198,15],[198,10,198,12],[210,0,210,9],[210,13,210,15],[207,0,207,9],[200,13,200,15],[199,10,199,12],[217,13,217,15],[219,0,219,9],[211,13,211,15],[217,0,217,9],[217,10,217,12],[239,13,239,15],[250,10,250,12],[270,13,270,15],[241,13,241,15],[240,10,240,12],[247,10,247,12],[253,10,253,12],[251,10,251,12],[252,10,252,12],[212,13,212,15],[213,0,213,9],[213,10,213,12],[218,10,218,12],[220,10,220,12],[257,10,257,12],[257,13,257,15],[258,0,258,9],[258,10,258,12],[258,13,258,15],[278,11,278,12],[274,0,274,7],[273,0,273,7],[273,8,273,10],[273,11,273,12],[277,0,277,7],[277,8,277,10],[277,11,277,12],[278,0,278,7],[275,0,275,7],[243,0,243,15],[282,8,282,10],[236,0,236,9],[239,0,239,9],[240,0,240,9],[236,13,236,15],[222,0,222,15],[225,0,225,15],[229,0,229,9],[229,10,229,12],[229,13,229,15],[231,0,231,9],[230,0,230,9],[231,10,231,12],[231,13,231,15],[227,0,227,15],[224,0,224,15],[230,13,230,15],[279,11,279,12],[280,0,280,7],[281,0,281,7],[282,11,282,12],[271,0,271,7],[278,8,278,10],[324,0,324,7],[323,0,323,7],[310,0,310,7],[315,0,315,7],[315,8,315,10],[301,0,301,15],[311,11,311,12],[311,13,311,15],[310,13,310,15],[311,0,311,7],[311,8,311,10],[307,11,307,12],[308,11,308,12],[312,0,312,7],[313,0,313,7],[314,0,314,7],[310,8,310,10],[320,13,320,15],[318,13,318,15],[319,8,319,10],[322,13,322,15],[319,13,319,15],[318,0,318,7],[43,13,43,15],[44,10,44,12],[58,5,58,12],[59,5,59,9],[322,0,322,7],[308,8,308,10],[317,8,317,10],[153,13,153,15],[156,13,156,15],[157,13,157,15],[156,8,156,10],[157,8,157,10],[156,0,156,7],[157,0,157,7],[156,11,156,12],[157,11,157,12],[155,13,155,15],[238,0,238,9],[281,11,281,12],[281,8,281,10],[248,0,248,9],[155,11,155,12],[245,0,245,15],[285,11,285,12],[317,13,317,15],[312,11,312,12],[313,8,313,10],[313,11,313,12],[237,13,237,15],[240,13,240,15],[255,0,255,9],[255,10,255,12],[255,13,255,15],[249,10,249,12],[253,0,253,9],[254,0,254,9],[254,10,254,12],[254,13,254,15],[248,10,248,12],[252,13,252,15],[253,13,253,15],[249,0,249,9],[250,0,250,9],[282,13,282,15],[292,13,292,15],[1,13,1,14],[3,13,3,14],[7,13,7,14],[15,9,15,15],[5,14,5,15],[9,14,9,15],[19,13,19,15],[1,2,1,11],[2,2,2,11],[3,2,3,11],[4,2,4,11],[6,2,6,11],[7,2,7,11],[8,2,8,11],[9,2,9,11],[10,2,10,11],[17,7,17,15],[47,4,47,12],[47,13,47,15],[48,4,48,12],[48,13,48,15],[103,1,103,5],[103,6,103,9],[103,10,103,13],[58,0,58,3],[98,10,98,13],[97,6,97,9],[54,13,54,15],[95,10,95,13],[95,6,95,9],[101,14,101,15],[55,0,55,3],[54,5,54,12],[55,5,55,12],[55,13,55,15],[52,0,52,15],[152,11,152,12],[153,8,153,10],[260,0,260,9],[237,0,237,9],[247,0,247,9],[237,10,237,12],[154,13,154,15],[273,13,273,15],[104,6,104,9],[104,10,104,13],[152,13,152,15],[270,11,270,12],[262,0,262,15],[228,10,228,12],[211,0,211,9],[219,13,219,15],[220,13,220,15],[228,13,228,15],[219,10,219,12],[212,0,212,9],[218,0,218,9],[212,10,212,12],[211,10,211,12],[268,0,268,15],[107,0,112,0],[112,14,112,15],[95,1,95,5],[97,10,97,13],[98,6,98,9],[99,1,99,5],[99,6,99,9],[99,10,99,13],[107,1,107,5],[102,0,106,0],[110,1,110,5],[104,1,104,5],[111,1,111,5],[96,14,100,15],[100,1,100,5],[110,6,110,9],[110,10,110,13],[165,13,165,15],[158,11,158,12],[158,13,158,15],[159,0,159,7],[159,8,159,10],[159,11,159,12],[159,13,159,15],[160,0,160,7],[160,8,160,10],[160,11,160,12],[160,13,160,15],[158,0,158,7],[158,8,158,10],[164,13,164,15],[165,0,165,7],[165,8,165,10],[165,11,165,12],[166,0,166,7],[213,13,213,15],[214,0,214,9],[214,10,214,12],[214,13,214,15],[215,0,215,9],[215,10,215,12],[218,13,218,15],[317,0,317,7],[316,0,316,7],[287,11,287,12],[316,8,316,10],[316,11,316,12],[316,13,316,15],[291,13,291,15],[312,8,312,10],[309,0,309,7],[309,11,309,12],[309,13,309,15],[288,13,288,15],[294,11,294,12],[295,8,295,10],[293,0,293,7],[294,0,294,7],[308,0,308,7],[317,11,317,12],[315,11,315,12],[292,8,292,10],[290,11,290,12],[287,8,287,10],[288,8,288,10],[293,8,293,10],[294,8,294,10],[306,0,306,15],[298,0,298,7],[305,0,305,15],[315,13,315,15],[300,11,300,12],[300,8,300,10],[313,13,313,15],[298,11,298,12],[312,13,312,15],[314,8,314,10],[314,11,314,12],[314,13,314,15],[300,13,300,15],[298,8,298,10],[289,8,289,10],[282,0,282,7],[280,8,280,10],[280,11,280,12],[278,13,278,15],[280,13,280,15],[290,13,290,15],[297,8,297,10],[291,8,291,10],[293,11,293,12],[293,13,293,15],[294,13,294,15],[283,0,283,7],[283,8,283,10],[283,11,283,12],[283,13,283,15],[284,11,284,12],[284,13,284,15],[281,13,281,15],[286,13,286,15],[295,13,295,15],[295,11,295,12],[295,0,295,7],[279,0,279,7],[279,8,279,10],[261,13,261,15],[271,13,271,15],[274,13,274,15],[272,13,272,15],[271,11,271,12],[259,0,259,9],[259,13,259,15],[260,10,260,12],[260,13,260,15],[272,11,272,12],[267,0,267,15],[274,11,274,12],[272,8,272,10],[266,0,266,15],[272,0,272,7],[0,12,0,15],[35,7,35,14],[24,0,24,15],[28,0,28,15],[22,2,22,15],[93,0,93,15],[83,7,84,15],[26,0,26,15],[64,0,64,15],[66,0,66,15],[43,4,43,12],[45,4,45,8],[44,4,44,8],[92,0,92,15],[57,13,57,15],[58,13,58,15],[20,14,20,15],[20,4,20,5],[91,0,91,15],[19,1,19,2],[16,13,16,15],[54,0,54,3],[57,0,57,3],[46,13,46,15],[256,13,256,15],[113,6,113,9],[276,13,276,15],[277,13,277,15],[238,10,238,12],[270,8,270,10],[276,0,276,7],[275,11,275,12],[238,13,238,15],[251,13,251,15],[261,10,261,12],[150,8,150,10],[152,8,152,10],[276,8,276,10],[276,11,276,12],[155,8,155,10],[155,0,155,7],[200,10,200,12],[228,0,228,9],[226,0,226,15],[275,8,275,10],[259,10,259,12],[274,8,274,10],[257,0,257,9],[325,0,325,7],[249,13,249,15],[326,13,326,15],[323,13,323,15],[296,0,296,7],[297,0,297,7],[250,13,250,15],[323,11,323,12],[321,8,321,10],[322,8,322,10],[321,11,321,12],[322,11,322,12],[320,8,320,10],[325,8,325,10],[299,0,299,7],[324,8,324,10],[319,0,319,7],[320,0,320,7],[321,0,321,7],[279,13,279,15],[325,13,325,15],[325,11,325,12],[275,13,275,15],[309,8,309,10],[299,8,299,10],[310,11,310,12],[43,16,43,21],[86,7,87,15],[68,7,69,15],[71,7,72,15],[74,7,75,15],[116,10,116,13],[95,14,95,15],[96,6,96,9],[96,10,96,13],[112,6,112,9],[100,6,100,9],[100,10,100,13],[80,7,81,15],[77,7,78,15],[102,14,105,15],[115,6,115,9],[115,10,115,13],[113,14,116,15],[116,6,116,9],[46,4,46,12],[50,0,50,15],[51,0,51,15],[326,11,326,12],[320,11,320,12],[318,8,318,10],[324,11,324,12],[319,11,319,12],[296,8,296,10],[297,11,297,12],[304,0,304,15],[307,13,307,15],[308,13,308,15],[307,0,307,7],[307,8,307,10],[299,11,299,12],[296,11,296,12],[297,13,297,15],[298,13,298,15],[299,13,299,15],[326,8,326,10],[324,13,324,15],[323,8,323,10],[303,0,303,15],[296,13,296,15],[318,11,318,12],[321,13,321,15]]}
[null,null,null,null,null,null,null,null,null,null,null,null,"Place an \"X\" by the applicable response."]
[null,null,"Virginia Department of Education",null,null,null,null,null,null,null,null,null,"X"," Original "]
[null,null,"Office of ESEA Programs"]
[null,null,"P. O. Box 2120",null,null,null,null,null,null,null,null,null,null,"Revision:   "]
[null,null,"Richmond, Virginia 23218-2120",null,null,null,null,null,null,null,null,null,null,"Revision #"]
[null,null,null,null,null,null,null,null,null,null,null,null,null,"Date:"]
[null,null,"A.  COVER PAGE",null,null,null,null,null,null,null,null,null,null,"Explain"]
[null,null,"Title III, Part A, Language Instruction for English Learners and Immigrant Students ",null,null,null,null,null,null,null,null,null,null,"Amendment:"]
[null,null,"2019-2020 Individual Program Application ",null,null,null,null,null,null,null,null,null,null,"Amendment # "]
[null,null,"Due by July 1, 2019",null,null,null,null,null,null,null,null,null,null,"Date:       "]
[null,null,"Elementary and Secondary Education Act of 1965 (ESEA), as amended by",null,null,null,null,null,null,null,null,null,null,"Explain"]
[null,null,"the Every Student Succeeds Act of 2015 (ESSA), Public Law 114-95 "]
[]
["To be Completed by School Division"]
["Applicant  (Legal Name of Agency)",null,null,null,null,null,null,"Division Number",null,"Title III Coordinator"]
["ALBEMARLE COUNTY PUBLIC SCHOOLS",null,null,null,null,null,null,{"$f":"IF(ISBLANK(A16),\" \",VLOOKUP(A16,Prefills!A2:B148,2))","v":2},null,"Cyndi Wells"]
["Mailing Address (Street, City or Town, Zip Code)",null,null,null,null,null,null,"Phone:",null,"434-296-6517",null,null,"Ext:"]
["401 McIntire Road\nCharlottesville, VA  22902",null,null,null,null,null,null,"Email:"]
[null,null,null,null,null,null,null,"cwells@k12albemarle.org"]
[]
["2019-2020 Title III, Part A Allocation",null,null,null,{"$f":"SUM(J21)+SUM(O21)","v":108746},null,"    EL Award Amount",null,null,108746,null,"   I/Y Award Amount:"]
[]
[null,null,"If checked, divisions must complete the \"Immigrant Children and Youth\" tab, in red, to describe the Immigrant Children and Youth (IY) Program, after allocations are released."]
["LOCAL EDUCATIONAL AGENCY CERTIFICATION"]
["Use of Funds:  The applicant designated above applies for an allocation of federal assistance as appropriated under ESEA.  Funds are available to support local education reform efforts that are consistent with statewide education reform efforts to: 1) provide funding to implement promising education reform programs and school improvement programs based on evidence-based research;  2) provide a continuing source of innovative and educational improvement;  3) meet the educational needs of all students; and 4) develop and implement education programs to improve student achievement and teacher performance. \n\nSpecific uses of funds for this application are found in the \"Guidelines, Instructions, and Assurances\" document."]
[]
["Assurances:  The local educational agency assures that the Title III, Part A, program will be administered and implemented in compliance with all applicable statutes, regulations, policies, program plans, and applications.  Additionally, the local educational agency agrees by signing below to implement the general and program specific assurances located in the “Application Guidelines, Instructions, and Assurances” document.  The assurances and signed cover page are to be retained at the division level.  "]
[]
["Certification:  We hereby certify that, to the best of our knowledge, the information contained in this application is correct.  The agency named above has authorized us as its representatives to file this application, and such action is recorded in the minutes of the School Board meeting held "]
["on","2019-05-23",null,null,"."]
[]
[]
["Superintendent’s Signature",null,null,null,null,null,null,"Board Chairperson’s Signature"]
["Dr. Matthew Haas",null,null,null,null,null,null,"Jonno Alcaro"]
["Superintendent’s Name",null,null,null,null,null,null,"Board Chairperson’s Name"]
["2019-06-13",null,null,null,null,null,null,"2019-06-13"]
["Date",null,null,null,null,null,null,"Date"]
["Application Submission, Approval, and LEA Expenditure of Funds: Applications for Federal Funds are due by July 1, 2019.  Revisions and Amendments should be submitted in a timely manner.  Please note, in order for the funds to be expendable by July 1, 2019, the electronic application must be received at the Virginia Department of Education by July 1, 2019, through the file submission process of the Online Management of Education Grant Awards (OMEGA) system.  "]
[]
["Page 1"]
[null,null,null,null,"School Division:",null,{"$f":"$A$16","v":"ALBEMARLE COUNTY PUBLIC SCHOOLS"},null,null,null,null,null,"Division Number:",null,null,{"$f":"$H$16","v":2}]
["APPLICATION INFORMATION"]
["2018 - 2019 Allocation",null,"2018-2019\nConsolidated\nYes or No",null,"Program",null,null,null,null,null,null,null,null,"2019-2020\nAllocation Total",null,null,"Does allocation total match total in Cell E21?"]
[{"$f":"IF(ISBLANK($A$16),\" \",VLOOKUP($H$16,Prefills!$AT$3:$AW$142,4))","v":119387},null,"No",null,"Title III, Part A, English Learners:  \n(Total  of: a + b; only a; or only b)",null,null,null,null,null,null,null,null,{"$f":"SUM(K45:M46)","v":108746},null,null,{"$f":"IF(SUM(N44)=SUM(E21),\"Yes\",\"No, check subtotals in this section\")","v":"Yes"}]
[null,null,null,null,"a.  EL Subgrant",null,null,null,null,"Subtotal ",108746,null,null,null,null,null,null,null,null,"Yes","No"]
[null,null,null,null,"b.  Immigrant Children and Youth  Subgrant",null,null,null,null,"Subtotal "]
[null,null,null,null,"Title II, Part A Transferability",null,null,null,null,null,null,null,null,{"$f":"N56","v":0}]
[null,null,null,null,"Title IV, Part A Transferability",null,null,null,null,null,null,null,null,{"$f":"N59","v":0}]
[null,null,null,null,"Total Allocation",null,null,null,null,null,null,null,null,{"$f":"SUM(N44+N47+N48)","v":108746}]
[]
["TRANSFERABILITY"]
["Section 5103(b)(2) of the Every Student Succeeds Act allows LEAs to transfer funds between certain qualifying federal programs. If funds are transferred into or out of the Title II, Part A, program, PRIOR APPROVAL IS REQUIRED, and a separate Transferability approval form must be submitted. The transfer request form is available at "]
["Transfer Request Form"]
[]
["Program from which funds will be transferred",null,null,null,null,"Select program(s) TO which funds will be transferred:",null,null,null,null,null,null,null,"Amount"]
["Title II, Part A",null,null,null,"TO","Title III, Part A, English Learners (EL Subgrant)"]
[null,null,null,null,null,"a.  EL Subgrant: ",null,null,null,null,"Subtotal "]
["Program from which funds will be transferred",null,null,null,null,"Select program(s) TO which funds will be transferred:",null,null,null,null,null,null,null,"Amount"]
["Title IV, Part A",null,null,null,"TO","Title III, Part A, English Learners (EL Subgrant) "]
[null,null,null,null,null,"a.  EL Subgrant",null,null,null,null,"Subtotal "]
[]
[]
["Page 2"]
[null,null,null,null,"School Division:",null,{"$f":"$A$16","v":"ALBEMARLE COUNTY PUBLIC SCHOOLS"},null,null,null,null,null,"Division Number:",null,null,{"$f":"$H$16","v":2}]
["REVISIONS AND AMENDMENTS"]
[]
["Place an \"X\" in the first box indicating whether it is a revision or amendment. Enter the date of the revision or amendment.  Indicate the tab(s) that have been changed. Provide a concise description of changes (for example, \"Programmatic Changes--purchase of additional reading materials, object code 6000; Budget Changes--decreased travel budget in object code 5000 and increased materials to purchase additional reading materials in object code 6000\"). When completing an amendment, changes to the program overview may be reflected as additions at the end of the narrative.\n\nNOTE: Any changes to the program budget should first be reflected in an amended application, followed by a budget transfer within 7 business days of approval of the amended application. Budget transfers will not be accepted without an approved amended application reflecting budget changes."]
[]
["1.","Revision",null,null,null,"Date:"]
[null,"Amendment",null,null,null,"Date:"]
[]
["2.","Revision",null,null,null,"Date:"]
[null,"Amendment",null,null,null,"Date:"]
[]
["3.","Revision",null,null,null,"Date:"]
[null,"Amendment",null,null,null,"Date:"]
[]
["4.","Revision",null,null,null,"Date:"]
[null,"Amendment",null,null,null,"Date:"]
[]
["5.","Revision",null,null,null,"Date:"]
[null,"Amendment",null,null,null,"Date:"]
[]
["6.","Revision",null,null,null,"Date:"]
[null,"Amendment",null,null,null,"Date:"]
[]
["7.","Revision",null,null,null,"Date:"]
[null,"Amendment",null,null,null,"Date:"]
[]
["Page 3"]
[null,null,null,null,"School Division:",null,{"$f":"$A$16","v":"ALBEMARLE COUNTY PUBLIC SCHOOLS"},null,null,null,null,null,"Division Number:",null,null,{"$f":"$H$16","v":2}]
["B.  BUDGET SUMMARY"]
["Title III, Part A"]
["Title III funds may be used to provide supplemental services that improve the English language proficiency and academic achievement of English Learners (ELs), including the provision of language instruction educational programs (LIEPs) and activities that increase the knowledge and skills of teachers who serve ELs. All services provided to ELs using Title III funds must supplement, and not supplant, the services that must be provided to ELs under Title VI of the Civil Rights Act of 1964 (Title VI), the Equal Educational Opportunities Act of 1974 (EEOA), and other federal requirements, as well as those under State or local laws."]
[]
["OBJECT CODE","EXPENDITURE",null,null,null,null,"EL SUBGRANT",null,null,null,"IMMIGRANT CHILDREN & YOUTH\n(IY) SUBGRANT",null,null,null,"DOES BUDGET SUMMARY MATCH DETAIL BUDGET?"]
["1000 -\n Personal Services","Administration"]
[null,"Teachers",null,null,null,null,24910]
[null,"Paraprofessionals",null,null,null,null,1850]
[null,"Private School Set-Aside"]
[null,"Other",null,null,null,null,32115]
[null,"Total Personal Services",null,null,null,null,{"$f":"SUM(G97:J101)","v":58875},null,null,null,{"$f":"SUM(K97:N101)","v":0},null,null,null,{"$f":"IF(SUM(N179)=SUM(G102:N102),\"Yes\", \"No, please review your entries.\")","v":"Yes"}]
["2000 -\nEmployee Benefits","Fixed Charges (Administrative)"]
[null,"Fixed Charges (Instruction)",null,null,null,null,7983]
[null,"Private School Set-Aside"]
[null,"Other",null,null,null,null,12759]
[null,"Total Employee Benefits",null,null,null,null,{"$f":"SUM(G103:J106)","v":20742},null,null,null,{"$f":"SUM(K103:N106)","v":0},null,null,null,{"$f":"IF(SUM(N201)=SUM(G107:N107),\"Yes\",\"No-please review your entries.\")","v":"Yes"}]
["3000 - \nPurchased/\nContracted Services","Evaluation Services"]
[null,"Parent and Family Engagement",null,null,null,null,1000]
[null,"Private School Set-Aside"]
[null,"Professional Development",null,null,null,null,5000]
[null,"Other",null,null,null,null,17500]
[null,"Total Purchased/Contracted Services",null,null,null,null,{"$f":"SUM(G108:J112)","v":23500},null,null,null,{"$f":"SUM(K108:N112)","v":0},null,null,null,{"$f":"IF(SUM(N221)=SUM(G113:N113),\"Yes\",\"No-please review your entries.\")","v":"Yes"}]
["4000 - \nInternal Services","Pupil Transportation",null,null,null,null,500]
[null,"Food Services"]
[null,"Private School Set-Aside"]
[null,"Other"]
[null,"Total Internal Services",null,null,null,null,{"$f":"SUM(G114:J117)","v":500},null,null,null,{"$f":"SUM(K114:N117)","v":0},null,null,null,{"$f":"IF(SUM(N242)=SUM(G118:N118),\"Yes\",\"No-please review your entries.\")","v":"Yes"}]
["5000 - \nOther  \nCharges","Travel (Staff/Administrative)",null,null,null,null,2000]
[null,"Indirect Cost"]
[null,"Private School Set-Asides"]
[null,"Other"]
[null,"Total Other Charges",null,null,null,null,{"$f":"SUM(G119:J122)","v":2000},null,null,null,{"$f":"SUM(K119:N122)","v":0},null,null,null,{"$f":"IF(SUM(N262)=SUM(G123:N123),\"Yes\",\"No-please review your entries.\")","v":"Yes"}]
["6000 - \nMaterials\n and Supplies","Administrative"]
[null,"Instructional",null,null,null,null,2629]
[null,"Private School Set-Aside"]
[null,"Professional Development"]
[null,"Parent and Family Engagement",null,null,null,null,500]
[null,"Other"]
[null,"Total Materials and Supplies",null,null,null,null,{"$f":"SUM(G124:J129)","v":3129},null,null,null,{"$f":"SUM(K124:N129)","v":0},null,null,null,{"$f":"IF(SUM(N301)=SUM(G130:N130),\"Yes\",\"No-please review your entries.\")","v":"Yes"}]
["8000 - \nCapital\nOutlay","Equipment for Instruction"]
[null,"All Other Equipment"]
[null,"Total Capital Outlay",null,null,null,null,{"$f":"SUM(G131:J132)","v":0},null,null,null,{"$f":"SUM(K131:N132)","v":0},null,null,null,{"$f":"IF(SUM(N327)=SUM(G133:N133),\"Yes\",\"No-please review your entries.\")","v":"Yes"}]
[null,"TOTAL SUBGRANT BUDGET",null,null,null,null,{"$f":"SUM(G133,G130,G123,G118,G113,G107,G102)","v":108746},null,null,null,{"$f":"SUM(K133,K130,K123,K118,K113,K107,K102)","v":0}]
[null,"TOTAL ALLOCATION",null,null,null,null,{"$f":"SUM(G134:N134)","v":108746},null,null,null,"Does the Total Allocation Equal Sum of Detailed Budget?",null,null,null,{"$f":"IF(SUM(G135)=SUM(N179+N201+N221+N242+N262+N301+N327),\"Yes\",\"No -please review your entries.\")","v":"Yes"}]
[null,"TOTAL PRIVATE SCHOOL SET-ASIDE",null,null,null,null,{"$f":"SUM(G100+G105+G110+G116+G121+G126)","v":0}]
[]
[]
["Note:","Object codes 7000 and 9000 are not used in application budgets or in requests for reimbursements for this federal grant."]
["Note:","Expenses for parental involvement programs are to be incorporated into the appropriate object code(s) based on the category of the related charges."]
[]
["Page 5"]
[null,null,null,null,"School Division:",null,{"$f":"$A$16","v":"ALBEMARLE COUNTY PUBLIC SCHOOLS"},null,null,null,null,null,"Division Number:",null,null,{"$f":"$H$16","v":2}]
["C.  DETAILED BUDGET BREAKDOWN"]
["Include a detailed breakdown of the budget categories for Object Codes 1000-6000 and 8000, as shown on pages 4-5."]
[]
["DETAILED BUDGET DESCRIPTION OF OBJECT CODE 1000"]
["If applicable, indicate the positions and FTEs supported with funds from this program."]
["The ESOL Data Specialist runs a variety of diagnostic reports on English Learner (EL) data (academic achievement indicators by grade span or content area, graduation rates, Dually Identified ELs, Long-Term ELs, and Formerly ELs) in order to identify areas of improvement and/or professional development needs. The ESOL Data Specialist analyzes data to inform staffing, target parent engagement activities, and determine needs for new materials. The ESOL Family Engagement Liaison partners with school personnel to implement activities for increasing EL family engagement, by organizing EL-specific family events. ESOL family engagement activities are specific to each  school’s ESOL families interests and needs. \n"]
["The ESOL Coach works with instructional coaches, as well as one-on-one with ESOL and content teachers to improve instruction that combines language and content objectives. Additionally, the coach supports teachers in adapting instruction to meet the language acquisition needs of students, while still maintaining high academic standards. Tutors and teachers provide supplementary support to ELs as needed after school and during the summer. A part-time summer administrator will be hired to provide oversight and organization of the Summer Immersion Excursion Program, as described in the IY section of the application.  Substitutes will be provided so that ESOL teachers may attend PD opportunities. \n\n\n\n"]
["Item Description",null,null,null,null,null,null,null,"Funding Source",null,null,"FTEs",null,"Total Cost"]
["ESOL Data Specialist",null,null,null,null,null,null,null,"EL Subgrant",null,null,0.3,null,12997]
["ESOL Family Engagement Liaison",null,null,null,null,null,null,null,"EL Subgrant",null,null,0.5,null,19118]
["ESOL Coach",null,null,null,null,null,null,null,"EL Subgrant",null,null,0.3,null,17910]
["ESOL Tutors [$25 per hour]",null,null,null,null,null,null,null,"EL Subgrant",null,null,"NA",null,1000]
["ESOL Substitutes",null,null,null,null,null,null,null,"EL Subgrant",null,null,"NA",null,850]
["Hourly Teacher Wages, after contract hours: Tutoring, Instruction,"]
["Family Engagement, in summer & after school ",null,null,null,null,null,null,null,"EL Subgrant",null,null,"NA",null,5000]
["Summer Administrator",null,null,null,null,null,null,null,"EL Subgrant",null,null,"NA",null,2000]
[]
[]
[]
[]
[]
[]
[]
[]
[]
[]
[]
[]
[]
[]
[]
[]
[]
[]
[]
[null,null,null,null,"      ",null,null,null,"Total for Object Code:",null,null,{"$f":"SUM(L152:M178)","v":1.1000000000000001},null,{"$f":"SUM(N152:P178)","v":58875}]
[]
["Page 6"]
[null,null,null,null,"School Division:",null,{"$f":"$A$16","v":"ALBEMARLE COUNTY PUBLIC SCHOOLS"},null,null,null,null,null,"Division Number:",null,null,{"$f":"$H$16","v":2}]
["DETAILED BUDGET DESCRIPTION OF OBJECT CODE 2000"]
["Indicate the fixed charge categories (such as FICA, health, etc.) and specify the amount of each."]
["Fringe benefits--which consist of FICA, VSRS, Group Life, Health Insurance, and Dental Insurance--will be paid on the FTE positions, where applicable. FICA will be paid for tutors, subs, and part-time staff.\n"]
[]
["Item Description",null,null,null,null,null,null,null,null,null,"Funding Source",null,null,"Total Cost"]
["FICA",null,null,null,null,null,null,null,null,null,"EL Subgrant",null,null,4504]
["Health Insurance [8,615 for 1.0 FTE]",null,null,null,null,null,null,null,null,null,"EL Subgrant",null,null,6891]
["Dental Insurance [311 for 1.0 FTE]",null,null,null,null,null,null,null,null,null,"EL Subgrant",null,null,248]
["VRS Retirement",null,null,null,null,null,null,null,null,null,"EL Subgrant",null,null,8444]
["Group Life Insurance",null,null,null,null,null,null,null,null,null,"EL Subgrant",null,null,655]
[]
[]
[]
[]
[]
[]
[]
[]
[null,null,null,null,"      ",null,null,null,null,null,"Total for Object Code:",null,null,{"$f":"SUM(N188:P200)","v":20742}]
[]
["DETAILED BUDGET DESCRIPTION OF OBJECT CODE 3000"]
["Provide a description of evaluation services or other expenses related to purchased or contracted services.  If proposed expenditure is for professional development, justify such expenditures by demonstrating a relationship between proposed expenditure for professional development and the program services and activities described in the application. "]
["Professional Development: The ESOL program supports PD opportunities for teachers of ELs in the Tier I classroom. We will continue to expand the number of ACPS teachers who implement Sheltered Instruction Observation Protocol (SIOP) and What’s Different About Teaching Reading to Students Learning English? strategies with fidelity. We plan to expand division-level and school-based “train-the-trainer” models by sending committed ESOL and content teams to SIOP, VATESOL, TESOL, VESA, WIDA, Family Reunification training, La Cosecha, and Parents as Educational Partners (PEP)."]
["In the areas of contracted/licensed services, a committee of ESOL teachers has developed a rubric by which we evaluate resources. Imagine Learning is the supplementary material chosen for purchase. It has interactive, targeted exercises with a student account system that allows teachers to track a student’s progress. Family engagement activities will be supported by food purchases from local restaurants, since this has proven to increase participation in these events.\n\n"]
["Item Description",null,null,null,null,null,null,null,null,null,"Funding Source",null,null,"Total Cost"]
["Professional Development Programs",null,null,null,null,null,null,null,null,null,"EL Subgrant",null,null,5000]
["Imagine Learning Digital Learning Licenses",null,null,null,null,null,null,null,null,null,"EL Subgrant",null,null,17500]
["Meals for Family Engagement Events",null,null,null,null,null,null,null,null,null,"EL Subgrant",null,null,1000]
[]
[]
[]
[]
[]
[]
[]
[]
[]
[]
[null,null,null,null,"      ",null,null,null,null,null,"Total for Object Code:",null,null,{"$f":"SUM(N208:P220)","v":23500}]
[]
["Page 7"]
[null,null,null,null,"School Division:",null,{"$f":"$A$16","v":"ALBEMARLE COUNTY PUBLIC SCHOOLS"},null,null,null,null,null,"Division Number:",null,null,{"$f":"$H$16","v":2}]
["DETAILED BUDGET DESCRIPTION OF OBJECT CODE 4000"]
["Provide a description of charges from an Internal Service Fund to other functions/activities/elements of the local government for the use of intragovernmental services.  "]
["Some schools provide supplemental after-school and summer tutoring for ELs. We are able to increase student participation by providing bus transportation for ELs in both tutoring and summer enrichment excursions. Additionally, we may provide transportation for EL families to attend ESOL-specific activities and parent conferences.  \n\n"]
[]
["Item Description",null,null,null,null,null,null,null,null,null,"Funding Source",null,null,"Total Cost"]
["Bus transportation costs for school tutoring programs, transportation assistance for "]
["Parental Engagement activities, and field trips during the summer",null,null,null,null,null,null,null,null,null,"EL Subgrant",null,null,500]
[]
[]
[]
[]
[]
[]
[]
[]
[]
[]
[null,null,null,null,"      ",null,null,null,null,null,"Total for Object Code:",null,null,{"$f":"SUM(N230:P241)","v":500}]
[]
["DETAILED BUDGET DESCRIPTION OF OBJECT CODE 5000"]
["Provide a description for expenses related to object code 5000.  Include expenditures that support the use of programs. Includes expenditures that support the program, including utilities (maintenance and operation of plant), staff/administrative/consultant travel, office phone charges, training, leases/rental, indirect cost, and other."]
["The professional development activities described in OC 3000 will require reimbursement of travel costs for participants to attend these courses, conferences, and training programs.  In addition, attendance at professional association meetings such as VESA Board Meetings will support keeping abreast of current program requirements, collaborating with other ESOL professionals, and enhancing program services such as Family Engagement. We will pay expenses associated with travel to these meetings. "]
[]
["Item Description",null,null,null,null,null,null,null,null,null,"Funding Source",null,null,"Total Cost"]
["Expenses for Travel to Conferences, Training and Professional Meetings",null,null,null,null,null,null,null,null,null,"EL Subgrant",null,null,2000]
[]
[]
[]
[]
[]
[]
[]
[]
[]
[]
[]
[]
[null,null,null,null,"      ",null,null,null,null,null,"Total for Object Code:",null,null,{"$f":"SUM(N249:P261)","v":2000}]
["Page 8"]
[null,null,null,null,"School Division:",null,{"$f":"$A$16","v":"ALBEMARLE COUNTY PUBLIC SCHOOLS"},null,null,null,null,null,"Division Number:",null,null,{"$f":"$H$16","v":2}]
[]
[]
["DETAILED BUDGET DESCRIPTION OF OBJECT CODE 6000"]
["Provide a description of materials, supplies, and all equipment less $5,000 per unit.  Indicate the estimated quantity of each item."]
["The ESOL program supports Family Engagement activities specifically targeted to EL families. These funds will allow us to purchase take-home instructional materials and supplies, such as books and educational games. Snacks and grocery items may also be needed to support Family Engagement activities.  \n\n"]
[" Instructional materials and books to enhance student instruction, including newcomer materials, will be funded. These will be purchased through varying vendors, such as Saddleback Publishing. Additional purchases may include iPads to support EL instruction, Praxis Study Guides for teachers seeking an ESL endorsement, and Fountas & Pinnell LLI Kits for EL instruction.\n"]
["Item Description",null,null,null,null,null,null,null,"Funding Source",null,null,"Quantities",null,"Total Cost"]
["Parent Outreach Instruction materials, food, and other supplies",null,null,null,null,null,null,null,"EL Subgrant",null,null,"TBD",null,500]
["Instructional books, materials, equipment such as iPads",null,null,null,null,null,null,null,"EL Subgrant",null,null,"TBD",null,2629]
[]
[]
[]
[]
[]
[]
[]
[]
[]
[]
[]
[]
[]
[]
[]
[]
[]
[]
[]
[]
[]
[]
[]
[]
[]
[]
[]
[null,null,null,null,"      ",null,null,null,"Total for Object Code:",null,null,{"$f":"SUM(L272:M300)","v":0},null,{"$f":"SUM(N272:P300)","v":3129}]
["Page 9"]
[null,null,null,null,"School Division:",null,{"$f":"$A$16","v":"ALBEMARLE COUNTY PUBLIC SCHOOLS"},null,null,null,null,null,"Division Number:",null,null,{"$f":"$H$16","v":2}]
["DETAILED BUDGET DESCRIPTION OF OBJECT CODE 8000"]
["Provide a description for expenses related to object code 8000 not included in the justification above.  All capital outlay expenditures over $5,000 per unit must be approved in advance by the Department of Education. If the school division has established a threshold of a lesser amount, items equal to that amount or greater must also receive prior approval by the Department of Education.  Equipment quantities must be specified."]
[]
[]
["Item Description",null,null,null,null,null,null,null,"Funding Source",null,null,"Quantities",null,"Total Cost"]
[]
[]
[]
[]
[]
[]
[]
[]
[]
[]
[]
[]
[]
[]
[]
[]
[]
[]
[null,null,null,null,"      ",null,null,null,"Total for Object Code:",null,null,{"$f":"SUM(L309:M326)","v":0},null,{"$f":"SUM(N309:P326)","v":0}]
[]
[]
["Page 10"]
[null,null,null,null,"School Division:",null,{"$f":"$A$16","v":"ALBEMARLE COUNTY PUBLIC SCHOOLS"},null,null,null,null,null,"Division Number:",null,null,{"$f":"$H$16","v":2}]
["EXPENDITURE ACCOUNTS DESCRIPTIONS"]
[]
["These accounts are for budgeting and recording expenditures of the educational agency for activities under its control.  Below are definitions of the major expenditure categories.  The descriptions provided are examples only.   For further clarification on the proper expenditures of funds, contact your school division budget or finance office, the grant specialist in the Virginia Department of Education, or refer to the appropriate federal act."]
[]
["OBJECT CODE DEFINITIONS:"]
["(revised 5/16/17)"]
[]
[1000,"PERSONAL SERVICES - Includes all compensation for the direct labor of persons in the employment of the local government.  Salaries and wages paid to employees for full‐ and part‐time work, including overtime, shift differential, and similar compensation. Includes payments for time not worked, including sick leave, vacation, holidays, jury duty, military leave, and other paid absences that are earned during the reporting period.  \n\nFor the purposes of this report, the term “salaries” means all compensation including base wage.  This also includes amounts paid through salary reduction plans, such as tax‐sheltered annuities and flexible benefit plans.  Do not confuse this definition with the Virginia Retirement System (VRS) definition, which excludes supplements for retirement calculation purposes in some circumstances.\n"]
[]
[2000,"EMPLOYEE BENEFITS - Job related benefits provided to employees as part of their total compensation.  Fringe benefits include the employer’s portion of FICA, pensions, insurance (life, health, disability income, etc.) and employee allowances.  \n\nNOTE:  Fringe Benefits are a significant component of employee compensation and, like salaries and wages, are charged to the appropriate object of expenditure within each program.  If possible, fringe benefit costs should be charged to the applicable educational program or activity on an ongoing basis.  An alternative is to charge all fringe benefits to various benefit accounts.  As part of the year‐end closing process, these accounts are closed, and all costs are allocated to the appropriate educational program or activity.  The following methods are suggested for allocating such cost at year‐end.  If these methods do not provide reasonable allocations based on circumstances within the school division, then the school division should use another reasonable allocation method.  Consistency in application should be maintained at all times.\n\n• Allocation by percentage of payroll dollars\n• Allocation by Head Count\n• Direct to Program or Activity\n"]
["Page 11"]
[3000,"PURCHASED/CONTRACTUAL SERVICES - Services acquired from outside sources (i.e., private vendors, public authorities, or other governmental entities).  Purchase of the service is on a fee basis or fixed time contract basis.  Payments for rentals and utilities are not included in this account description.  Allowable payments would be to individual or firms that are independent contractors and not employees of the grantee or sub‐grantee organization.  The word honorarium is sometimes used to characterize such payments; the term “fee” is preferred.\n\n• Food Purchases – Prepared meals, working meals, and/or catered services purchased through a vendor are included in this object code.  Reimbursement is capped at the per diem rate for the meal listed according to the state travel regulations.  Examples for this object code include meals provided during day‐long professional development sessions, or meals provided to support attendance at family engagement activities.  Food purchased from catering services and restaurants such as Pizza Hut, Panera Bread, and Subway is included in this object code.\n\n• Transportation Services Public Carriers – Payments to public carriers for transportation of pupils on vehicles that are used by the public. Include payments for pupils transported in intra‐city transit buses, taxicabs, airplanes, and intercity/interstate passenger buses.\n\n• Transportation Services Private Carriers – Payments (either cash or tokens) to parents for transportation of pupils in lieu of providing transportation on school buses. Include allowable payments to parents for pupils attending public, private, and non‐sectarian schools. Include costs associated with transporting special education students in school board‐owned vehicles to and from school.\n\n• Transportation Services by Contract – Payments to private owners of school buses who contract with the school board to transport pupils to and from public schools. Include payments to owners of private vehicles that contract with the school board to transport pupils to and from designated public and private schools.\n\n"]
[null,"• Purchase of Service from Other Governmental Entities – Payments for services purchased from other governmental entities (i.e., other local governments, public authorities, state agencies, and other LEAs) on a contract/fee basis. Tuition payments to other local governments for a jointly operated center are not included here but are reported under “Payments to Joint Operations” (object code 7000).\n\n• Tuition Paid – Other Divisions In‐State, Tuition Paid – Other Divisions Out‐of‐State, and Tuition Paid – Private Schools are included in this object code.\n"]
[]
[4000,"INTERNAL SERVICES - Charges from an Internal Service Fund to other functions/activities/elements of the local government for the use of intergovernmental services, such as data processing, automotive/motor pool, central purchasing/central stores, print shop, and risk management. These services are provided by internal services within the School District and possibly the county but not a vendor.  \n\n• Food Purchases – Food purchased from the food services department of a school division or subgrantee equivalent to support professional development or family engagement events is included in this object code.  For example, internal expenses for school cafeterias to provide meals to support attendance at family engagement activities are included in this object code.\n"]
["Page 12"]
[5000,"OTHER CHARGES - Include expenditures that support the use of programs. Includes expenditures that support the program, including utilities (maintenance and operation of plant), staff/administrative/consultant travel, office phone charges, training, leases/rental, indirect cost, and other.\n\n• Food Purchases – Food Purchases under this object code are restricted to food purchases related to travel reimbursement for meals only (see Travel below). If the sub‐recipient’s internal travel policies conform to state travel regulations, reimbursement is allowable at per diem meals rates according to state travel regulations. If the sub‐recipient’s internal travel policies require reimbursement for the cost of each meal, reimbursement is capped at the per diem rate for the meal listed according to the state travel regulations. Sub‐recipients must elect either meals per diem or per meals costs as their internal travel policy.\n\n• Telecommunications – Include expenditures for recurring telecommunications services for the use of on‐line computer technology (e.g., telephone/telecommunications line charges).  Telephone charges for line service for Internet connectivity and the Electronic Classroom program.\n\n• Utilities – Payments for heat, electricity, water, and sewer services regardless of whether the service is provided by a private enterprise authority or an enterprise fund operated by a local government.\n\n• Communications – Payments for postal, messenger, and telecommunications services, typically office voice telephone charges.  (Telecommunication costs directly related to technology uses should be coded under 6000.) In addition, office telephone charges would be coded under this code.\n\n• Insurance – Payments for insurance except those that relate to personal services (i.e., hospitalization, group life, worker’s compensation, unemployment)\n\n• Leases and Rentals – Includes payments for leases that are not capitalized and rental of land, structures, and equipment. Do not include payments made under a lease‐purchase agreement.\n\n"]
[null,"• Travel – includes payments for travel reimbursement for staff/administrative/consultant travel. These are travel costs that are being reimbursed directly to travelers.  These costs may include lodging, mileage, meals, and incidentals as allowable according to state travel regulations or documented subrecipient internal travel policies. If the sub‐recipient does not have documented internal travel policies, state travel regulations will prevail.\n\n• Contributions to Other Entities – Includes payments to other governmental entities or community organizations that are not related to the direct purchase of a service on a fee basis (which is reported under object code 3000) or payments to joint operations (which are reflected under object code 7000).\n\n• Public Assistance Payments – Payments to individuals for public assistance programs (general government use only).\n\n• Miscellaneous Other Charges – Includes expenditures that support the program, including indirect costs and other costs.\n"]
["Page 13"]
[6000,"MATERIALS AND SUPPLIES - Includes articles and commodities that are consumed or materially altered when used and minor equipment that is not capitalized.  This includes any equipment purchased under $5,000, unless the LEA has set a lower capitalization threshold.  Therefore, computer equipment under $5,000 would be reported in “materials and supplies.”\n\n• Food Purchases – Food items purchased from a grocery store or its equivalent for snacks or breaks is included in this object code.  Examples include bottled water, granola bars, cookies, and fruit purchased from a store such as Wal‐Mart, Food Lion, Costco, etc.  Prepared meals is not included in this object code; see object code 3000 for prepared/working/catered meals as purchased/contracted services.\n\n• Vehicle and Powered Equipment Fuels – Gasoline, lubricating oils, or such other fuel used in the operation of vehicles and powered equipment (e.g., lawnmowers) purchased from private sources or governmental agencies.\n\n• Vehicle and Powered Equipment Supplies – Tires, spark plugs, batteries, and chains used in the operation of vehicles and powered equipment purchased from private sources or governmental agencies.\n\n• Textbooks – All textbooks and workbooks purchased to be used in the classroom.\n\n• Instructional Materials – Books (not textbooks) and other materials.\n\n"]
[null,"• Technology Software/On‐line Content – Include expenditures for videodiscs and computer programs used in the classroom for instructional purposes, operating system software (i.e., standalone software, not software that is pre‐installed and included in hardware costs), application software, and on‐line or downloadable software and content. Include expenditures for both additions and replacement.\n\n• Non‐Capitalized Technology Hardware – Include expenditures for hardware or classroom technology equipment that is not capitalized.\n\n• Non‐Capitalized Technology Infrastructure – Include expenditures for technology infrastructure that is not capitalized.\n"]
["Page 14"]
[8000,"CAPITAL OUTLAY - Note: Indirect cost cannot be claimed against capital outlay and equipment.\nOutlays that result in the acquisition of or additions to fixed assets.  Capital Outlay includes the purchase\nof fixed assets both replacement and/or additional.\n\nCapital Outlay Replacement\n\n• Technology – Hardware Replacements – Include capital outlay for replacement of hardware or classroom technology equipment. (For further clarification on which expenditures should be included in this object code, see the “Special Note” below.)\n\n• Technology – Infrastructure Replacements – Include capital outlay for replacement of technology infrastructure. (For further clarification on which expenditures should be included in this object code, see the “Special Note” below.)\n\n• Capital Outlay Additions – Include machinery, equipment, furniture, fixtures, communications equipment, motor vehicles, etc. that are capitalized.\n\n• Technology – Hardware Additions – Include capital outlay for additional hardware or classroom technology equipment. (For further clarification on which expenditures should be included in this object code, see the “Special Note” below.)  \n\n• Technology – Infrastructure Additions – Include capital outlay for additional technology infrastructure. (For further clarification on which expenditures should be included in this object code, see the “Special Note” below.)\n\n"]
[null,"• Special Note ‐ Classification of Hardware and Infrastructure Expenditures: \n\nReport expenditures under technology “hardware” for computers, associated peripheral equipment, and other specialized technology equipment. Computers include desktop and laptop machines, handheld computers (i.e., Personal Digital Assistants or PDAs), and mainframe machines. Peripheral equipment includes devices attached to computers, such as monitors, keyboards, disk drives, modems, printers, scanners, cameras and speakers, etc.\n\nReport other specialized computer devices under technology “hardware” such as fax‐back and voicemail resources; videoconferencing and other distance education tools, including satellite transmitters and receivers; cable‐based receivers; and modem or codec‐based video equipment; projection devices, from transparent and opaque projectors to video monitors; and graphing calculators and other specialized computational aids.\n\nReport expenditures under technology “infrastructure” for equipment and devices that enable the linking of computers or video hardware to networks (such as routers, hubs, switches, access servers, modems, or codecs). Infrastructure also refers to cabling installations, whether wire, fiber optic, or coaxial, as well as electrical capacity expansion or HVAC upgrades to support networks. In wireless networking systems, include receivers and transmitters under infrastructure."]
["Page 15"]

{"sheet":"Transferability","index":1,"n_rows":192,"n_cols":15,"rows_kept":192,"cut":false,"hidden":false,"merged":[[191,0,191,14],[117,0,117,12],[17,0,17,2],[12,0,12,2],[15,0,15,2],[16,0,16,2],[14,0,14,2],[13,0,13,2],[1,0,1,14],[8,3,8,14],[9,3,10,4],[9,5,10,6],[9,7,10,8],[9,9,10,9],[9,13,10,14],[3,0,3,14],[9,12,10,12],[9,10,10,11],[5,0,5,12],[6,0,6,16383],[24,0,24,2],[25,0,25,2],[27,0,27,2],[28,0,28,2],[29,0,29,2],[30,0,30,2],[31,0,31,2],[26,0,26,2],[18,0,18,2],[19,0,19,2],[20,0,20,2],[22,0,22,2],[21,0,21,2],[23,0,23,2],[37,0,37,2],[38,0,38,2],[39,0,39,2],[41,0,41,2],[40,0,40,2],[42,0,42,2],[32,0,32,2],[33,0,33,2],[35,0,35,2],[36,0,36,2],[34,0,34,2],[43,0,43,2],[46,0,46,2],[48,0,48,2],[49,0,49,2],[64,0,64,12],[66,0,66,12],[70,8,70,9],[70,10,70,11],[57,0,57,2],[58,0,58,2],[56,0,56,2],[50,0,50,2],[51,0,51,2],[52,0,52,2],[55,0,55,2],[53,0,53,2],[54,0,54,2],[47,0,47,2],[44,0,44,2],[45,0,45,2],[71,0,71,7],[71,8,71,9],[71,10,71,11],[62,0,62,14],[60,0,60,2],[59,0,59,2],[68,0,68,12],[69,0,69,12],[72,0,72,7],[72,8,72,9],[72,10,72,11],[73,0,73,7],[73,8,73,9],[73,10,73,11],[74,0,74,7],[74,8,74,9],[74,10,74,11],[75,0,75,7],[75,8,75,9],[75,10,75,11],[76,0,76,7],[76,8,76,9],[76,10,76,11],[77,0,77,7],[77,8,77,9],[77,10,77,11],[78,0,78,7],[78,8,78,9],[78,10,78,11],[79,0,79,7],[79,8,79,9],[79,10,79,11],[80,10,80,11],[80,8,80,9],[83,0,83,12],[87,0,87,9],[87,10,87,11],[88,0,88,9],[88,10,88,11],[85,0,85,12],[86,0,86,12],[89,0,89,9],[89,10,89,11],[90,0,90,9],[90,10,90,11],[91,0,91,9],[91,10,91,11],[92,0,92,9],[92,10,92,11],[93,0,93,9],[93,10,93,11],[94,0,94,9],[94,10,94,11],[97,0,97,14],[95,0,95,9],[95,10,95,11],[96,10,96,11],[101,0,101,12],[102,0,102,12],[105,0,105,9],[105,10,105,11],[106,0,106,9],[106,10,106,11],[103,0,103,12],[104,0,104,12],[107,0,107,9],[107,10,107,11],[108,0,108,9],[108,10,108,11],[109,0,109,9],[109,10,109,11],[110,0,110,9],[110,10,110,11],[113,0,113,9],[113,10,113,11],[111,0,111,9],[111,10,111,11],[112,0,112,9],[112,10,112,11],[114,10,114,11],[121,0,121,9],[121,10,121,11],[122,0,122,9],[122,10,122,11],[123,0,123,9],[123,10,123,11],[124,0,124,9],[124,10,124,11],[116,0,116,12],[120,0,120,9],[120,10,120,11],[118,0,118,12],[119,0,119,12],[125,0,125,9],[125,10,125,11],[126,0,126,9],[126,10,126,11],[133,0,133,12],[137,0,137,9],[137,10,137,11],[132,0,132,12],[136,0,136,9],[136,10,136,11],[127,10,127,11],[138,0,138,9],[138,10,138,11],[130,0,130,13],[139,0,139,9],[139,10,139,11],[153,0,153,7],[153,8,153,9],[153,10,153,11],[144,0,144,9],[144,10,144,11],[148,0,148,12],[149,0,149,12],[142,0,142,9],[152,0,152,7],[152,8,152,9],[152,10,152,11],[145,10,145,11],[143,0,143,9],[143,10,143,11],[154,0,154,7],[154,8,154,9],[154,10,154,11],[155,0,155,7],[155,8,155,9],[155,10,155,11],[156,0,156,7],[156,8,156,9],[156,10,156,11],[157,0,157,7],[157,8,157,9],[157,10,157,11],[158,0,158,7],[158,8,158,9],[158,10,158,11],[159,0,159,7],[159,8,159,9],[159,10,159,11],[160,0,160,7],[160,8,160,9],[160,10,160,11],[161,0,161,7],[161,8,161,9],[161,10,161,11],[162,0,162,7],[162,8,162,9],[162,10,162,11],[163,0,163,7],[163,8,163,9],[163,10,163,11],[164,0,164,7],[164,8,164,9],[164,10,164,11],[165,0,165,7],[165,8,165,9],[165,10,165,11],[178,0,178,7],[178,8,178,9],[178,10,178,11],[179,0,179,7],[179,8,179,9],[179,10,179,11],[166,0,166,7],[166,8,166,9],[166,10,166,11],[167,0,167,7],[167,8,167,9],[167,10,167,11],[173,0,173,12],[174,0,174,12],[177,0,177,7],[168,0,168,7],[168,8,168,9],[168,10,168,11],[169,8,169,9],[169,10,169,11],[177,8,177,9],[177,10,177,11],[171,0,171,14],[182,10,182,11],[183,0,183,7],[184,0,184,7],[184,8,184,9],[184,10,184,11],[183,8,183,9],[183,10,183,11],[180,0,180,7],[180,8,180,9],[180,10,180,11],[181,0,181,7],[181,8,181,9],[181,10,181,11],[187,10,187,11],[186,0,186,7],[186,8,186,9],[188,10,188,11],[188,8,188,9],[134,0,134,12],[135,0,135,12],[186,10,186,11],[187,0,187,7],[187,8,187,9],[140,0,140,9],[140,10,140,11],[141,10,141,11],[175,0,175,12],[176,0,176,12],[150,0,150,12],[151,0,151,12],[142,10,142,11],[141,0,141,9],[185,0,185,7],[185,8,185,9],[185,10,185,11],[182,0,182,7],[182,8,182,9]]}
[null,null,null,null,"School Division:",null,{"$f":"'Title III Budget'!$A$16","v":"ALBEMARLE COUNTY PUBLIC SCHOOLS"},null,null,null,null,null,"Division Number:",null,{"$f":"'Title III Budget'!$H$16","v":2}]
["D.  TRANSFERABILITY"]
[]
["Section 5103(b)(2) of ESSA allows divisions to transfer all or a portion of the funds received from Title II, Part A, or Title IV, Part A, into: Title I, Part A; Title I, Part C; Title I, Part D; Title II, Part A; Title III, Part A; Title IV, Part A; or Title V, Part B.  "]
[]
["Complete the tab below if funds will be transferred under Section 5103(b)(2). Please note that prior approval is required to transfer funds. The transfer request form is provided at "]
["Transfer Request Form"]
[]
[null,null,null,"Amount Budgeted"]
[null,null,null,"Title I, Part A",null,"Title I, Part C",null,"Title I, Part D",null,"Title II, Part A","Title III, Part A",null,"Title IV, Part A","Title V, Part B"]
[]
[null,null,null,"Title II, Part A, Transferability","Title IV, Part A, Transferability","Title II, Part A, Transferability","Title IV, Part A, Transferability","Title II, Part A, Transferability","Title IV, Part A, Transferability","Title IV, Part A, Transferability","Title II, Part A, Transferability\nAward S367A190044\nProject Code APE60016\n","Title IV, Part A, Transferability\nAward S424A190048\nProject Code APE60023\n","Title II, Part A, Transferability","Title II, Part A, Transferability","Title IV, Part A, Transferability"]
["Amount Transferred to Program",null,null,null,null,null,null,null,null,null,{"$f":"'Title III Budget'!N56","v":0},{"$f":"'Title III Budget'!N59","v":0}]
["OBJECT CODE - EXPENDITURE TYPE"]
["1000 -  Personal Services"]
["Administration",null,null,null,null,null,null,null,null,null,0,0]
["Teachers",null,null,null,null,null,null,null,null,null,0,0]
["Paraprofessionals",null,null,null,null,null,null,null,null,null,0,0]
["Private School Set-Aside ",null,null,null,null,null,null,null,null,null,0,0]
["Other",null,null,null,null,null,null,null,null,null,0,0]
["Total Personal Services",null,null,null,null,null,null,null,null,null,{"$f":"SUM(K16:K20)","v":0},{"$f":"SUM(L16:L20)","v":0}]
["2000 - Employee Benefits"]
["Fixed Charges (Administrative)",null,null,null,null,null,null,null,null,null,0,0]
["Fixed Charges (Instruction)",null,null,null,null,null,null,null,null,null,0,0]
["Private School Set-Aside ",null,null,null,null,null,null,null,null,null,0,0]
["Other",null,null,null,null,null,null,null,null,null,0,0]
["Total Employee Benefits",null,null,null,null,null,null,null,null,null,{"$f":"SUM(K23:K26)","v":0},{"$f":"SUM(L23:L26)","v":0}]
["3000 - Purchased/Contracted Services"]
["Evaluation Services",null,null,null,null,null,null,null,null,null,0,0]
["Parent and Family Engagement",null,null,null,null,null,null,null,null,null,0,0]
["Private School Set-Aside ",null,null,null,null,null,null,null,null,null,0,0]
["Professional Development",null,null,null,null,null,null,null,null,null,0,0]
["Other",null,null,null,null,null,null,null,null,null,0,0]
["Total Purchased/Contracted Services",null,null,null,null,null,null,null,null,null,{"$f":"SUM(K29:K33)","v":0},{"$f":"SUM(L29:L33)","v":0}]
["4000 - Internal Services"]
["Pupil Transportation",null,null,null,null,null,null,null,null,null,0,0]
["Food Services",null,null,null,null,null,null,null,null,null,0,0]
["Private School Set-Aside ",null,null,null,null,null,null,null,null,null,0,0]
["Other",null,null,null,null,null,null,null,null,null,0,0]
["Total Internal Services",null,null,null,null,null,null,null,null,null,{"$f":"SUM(K36:K39)","v":0},{"$f":"SUM(L36:L39)","v":0}]
["5000 - Other Charges"]
["Travel (Staff/Administrative)",null,null,null,null,null,null,null,null,null,0,0]
["Indirect Cost",null,null,null,null,null,null,null,null,null,0,0]
["Private School Set-Aside ",null,null,null,null,null,null,null,null,null,0,0]
["Other",null,null,null,null,null,null,null,null,null,0,0]
["Total Other Charges",null,null,null,null,null,null,null,null,null,{"$f":"SUM(K42:K45)","v":0},{"$f":"SUM(L42:L45)","v":0}]
["6000 - Materials and Supplies"]
["Administrative",null,null,null,null,null,null,null,null,null,0,0]
["Instructional",null,null,null,null,null,null,null,null,null,0,0]
["Private School Set-Aside ",null,null,null,null,null,null,null,null,null,0,0]
["Professional Development",null,null,null,null,null,null,null,null,null,0,0]
["Parent and Family Engagement",null,null,null,null,null,null,null,null,null,0,0]
["Other",null,null,null,null,null,null,null,null,null,0,0]
["Total Materials and Supplies",null,null,null,null,null,null,null,null,null,{"$f":"SUM(K48:K53)","v":0},{"$f":"SUM(L48:L53)","v":0}]
["8000 - Capital Outlay"]
["Equipment for Instruction",null,null,null,null,null,null,null,null,null,0,0]
["All Other Equipment",null,null,null,null,null,null,null,null,null,0,0]
["Total Capital Outlay",null,null,null,null,null,null,null,null,null,{"$f":"SUM(K56:K57)","v":0},{"$f":"SUM(L56:L57)","v":0}]
["Total Budget",null,null,null,null,null,null,null,null,null,{"$f":"SUM(K21,K27,K34,K40,K46,K54,K58)","v":0},{"$f":"SUM(L21,L27,L34,L40,L46,L54,L58)","v":0}]
["Total Private School Set-Aside",null,null,null,null,null,null,null,null,null,{"$f":"SUM(K19+K25+K31+K38+K44+K50)","v":0},{"$f":"SUM(L19+L25+L31+L38+L44+L50)","v":0}]
["Does the Total Budget Match the Amount Transferred into Program?",null,null,null,null,null,null,null,null,null,{"$f":"IF(K59=K13,\"Yes\",\"No\")","v":"Yes"},{"$f":"IF(L59=L13,\"Yes\",\"No\")","v":"Yes"}]
[]
["Page 16"]
[null,null,null,null,"School Division:",null,{"$f":"'Title III Budget'!A16","v":"ALBEMARLE COUNTY PUBLIC SCHOOLS"},null,null,null,null,"Division Number:",{"$f":"'Title III Budget'!H16","v":2}]
["DETAILED BUDGET BREAKDOWN"]
["Include a detailed breakdown of the budget categories for Object Codes 1000-6000 and 8000, as shown on pages 16-17."]
["DETAILED BUDGET DESCRIPTION OF OBJECT CODE 1000"]
["If applicable, indicate the positions and FTEs supported with funds from this program."]
[]
[]
["Item Description",null,null,null,null,null,null,null,"Funding Source",null,"FTEs",null,"Total Cost"]
[]
[]
[]
[]
[]
[]
[]
[]
[]
[null,null,null,null,"      ",null,null,null,"Total for Object Code:",null,{"$f":"SUM(K72:L80)","v":0},null,{"$f":"SUM(M72:M80)","v":0}]
[]
[]
["DETAILED BUDGET DESCRIPTION OF OBJECT CODE 2000"]
["Indicate the fixed charge categories (such as FICA, health, etc.) and specify the amount of each."]
[]
[]
["Item Description",null,null,null,null,null,null,null,null,null,"Funding Source",null,"Total Cost"]
[]
[]
[]
[]
[]
[]
[]
[]
[null,null,null,null,"      ",null,null,null,null,null,"Total for Object Code:",null,{"$f":"SUM(M89:M96)","v":0}]
["Page 17"]
[null,null,null,null,"School Division:",null,{"$f":"'Title III Budget'!A16","v":"ALBEMARLE COUNTY PUBLIC SCHOOLS"},null,null,null,null,"Division Number:",{"$f":"'Title III Budget'!H16","v":2}]
[]
[]
["DETAILED BUDGET DESCRIPTION OF OBJECT CODE 3000"]
["Provide a description of evaluation services or other expenses related to purchased or contracted services.  If proposed expenditure is for professional development, justify such expenditures by demonstrating a relationship between proposed expenditure for professional development and the program services and activities described in the application. "]
[]
[]
["Item Description",null,null,null,null,null,null,null,null,null,"Funding Source",null,"Total Cost"]
[]
[]
[]
[]
[]
[]
[]
[]
[null,null,null,null,"      ",null,null,null,null,null,"Total for Object Code:",null,{"$f":"SUM(M107:M114)","v":0}]
[]
["DETAILED BUDGET DESCRIPTION OF OBJECT CODE 4000"]
["Provide a description of charges from an Internal Service Fund to other functions/activities/elements of the local government for the use of intragovernmental services.  "]
[]
[]
["Item Description",null,null,null,null,null,null,null,null,null,"Funding Source",null,"Total Cost"]
[]
[]
[]
[]
[]
[]
[null,null,null,null,"      ",null,null,null,null,null,"Total for Object Code:",null,{"$f":"SUM(M122:M127)","v":0}]
[]
[]
["Page 18"]
[null,null,null,null,"School Division:",null,{"$f":"'Title III Budget'!A16","v":"ALBEMARLE COUNTY PUBLIC SCHOOLS"},null,null,null,null,"Division Number:",{"$f":"'Title III Budget'!H16","v":2}]
["DETAILED BUDGET DESCRIPTION OF OBJECT CODE 5000"]
["Provide a description for expenses related to object code 5000.  Include expenditures that support the use of programs. Includes expenditures that support the program, including utilities (maintenance and operation of plant), staff/administrative/consultant travel, office phone charges, training, leases/rental, indirect cost, and other."]
[]
[]
["Item Description",null,null,null,null,null,null,null,null,null,"Funding Source",null,"Total Cost"]
[]
[]
[]
[]
[]
[]
[]
[]
[null,null,null,null,"      ",null,null,null,null,null,"Total for Object Code:",null,{"$f":"SUM(M138:M145)","v":0}]
[]
[]
["DETAILED BUDGET DESCRIPTION OF OBJECT CODE 6000"]
["Provide a description of materials, supplies, and all equipment less $5,000 per unit.  Indicate the estimated quantity of each item."]
[]
[]
["Item Description",null,null,null,null,null,null,null,"Funding Source",null,"Quantities",null,"Total Cost"]
[]
[]
[]
[]
[]
[]
[]
[]
[]
[]
[]
[]
[]
[]
[]
[]
[null,null,null,null,"      ",null,null,null,"Total for Object Code:",null,{"$f":"SUM(K154:L169)","v":0},null,{"$f":"SUM(M154:M169)","v":0}]
[]
["Page 19"]
[null,null,null,null,"School Division:",null,{"$f":"'Title III Budget'!A16","v":"ALBEMARLE COUNTY PUBLIC SCHOOLS"},null,null,null,null,"Division Number:",{"$f":"'Title III Budget'!H16","v":2}]
["DETAILED BUDGET DESCRIPTION OF OBJECT CODE 8000"]
["Provide a description for expenses related to object code 8000 not included in the justification above.  All capital outlay expenditures over $5,000 per unit must be approved in advance by the Department of Education. If the school division has established a threshold of a lesser amount, items equal to that amount or greater must also receive prior approval by the Department of Education.  Equipment quantities must be specified."]
[]
[]
["Item Description",null,null,null,null,null,null,null,"Funding Source",null,"Quantities",null,"Total Cost"]
[]
[]
[]
[]
[]
[]
[]
[]
[]
[]
[null,null,null,null,"      ",null,null,null,"Total for Object Code:",null,{"$f":"SUM(K179:L188)","v":0},null,{"$f":"SUM(M179:M188)","v":0}]
[]
[]
["Page 20"]

{"sheet":"Title III Program","index":2,"n_rows":141,"n_cols":16369,"rows_kept":141,"cut":false,"hidden":false,"merged":[[48,16320,48,16335],[48,16336,48,16351],[48,16352,48,16367],[48,16368,48,16383],[27,0,27,15],[48,16176,48,16191],[48,16192,48,16207],[48,16208,48,16223],[48,16224,48,16239],[48,16240,48,16255],[48,16256,48,16271],[48,16272,48,16287],[48,16288,48,16303],[48,16304,48,16319],[48,16032,48,16047],[48,16048,48,16063],[48,16064,48,16079],[48,16080,48,16095],[48,16096,48,16111],[48,16112,48,16127],[48,16128,48,16143],[48,16144,48,16159],[48,16160,48,16175],[48,15888,48,15903],[48,15904,48,15919],[48,15920,48,15935],[48,15936,48,15951],[48,15952,48,15967],[48,15968,48,15983],[48,15984,48,15999],[48,16000,48,16015],[48,16016,48,16031],[48,15744,48,15759],[48,15760,48,15775],[48,15776,48,15791],[48,15792,48,15807],[48,15808,48,15823],[48,15824,48,15839],[48,15840,48,15855],[48,15856,48,15871],[48,15872,48,15887],[48,15600,48,15615],[48,15616,48,15631],[48,15632,48,15647],[48,15648,48,15663],[48,15664,48,15679],[48,15680,48,15695],[48,15696,48,15711],[48,15712,48,15727],[48,15728,48,15743],[48,15456,48,15471],[48,15472,48,15487],[48,15488,48,15503],[48,15504,48,15519],[48,15520,48,15535],[48,15536,48,15551],[48,15552,48,15567],[48,15568,48,15583],[48,15584,48,15599],[48,15312,48,15327],[48,15328,48,15343],[48,15344,48,15359],[48,15360,48,15375],[48,15376,48,15391],[48,15392,48,15407],[48,15408,48,15423],[48,15424,48,15439],[48,15440,48,15455],[48,15168,48,15183],[48,15184,48,15199],[48,15200,48,15215],[48,15216,48,15231],[48,15232,48,15247],[48,15248,48,15263],[48,15264,48,15279],[48,15280,48,15295],[48,15296,48,15311],[48,15024,48,15039],[48,15040,48,15055],[48,15056,48,15071],[48,15072,48,15087],[48,15088,48,15103],[48,15104,48,15119],[48,15120,48,15135],[48,15136,48,15151],[48,15152,48,15167],[48,14880,48,14895],[48,14896,48,14911],[48,14912,48,14927],[48,14928,48,14943],[48,14944,48,14959],[48,14960,48,14975],[48,14976,48,14991],[48,14992,48,15007],[48,15008,48,15023],[48,14736,48,14751],[48,14752,48,14767],[48,14768,48,14783],[48,14784,48,14799],[48,14800,48,14815],[48,14816,48,14831],[48,14832,48,14847],[48,14848,48,14863],[48,14864,48,14879],[48,14592,48,14607],[48,14608,48,14623],[48,14624,48,14639],[48,14640,48,14655],[48,14656,48,14671],[48,14672,48,14687],[48,14688,48,14703],[48,14704,48,14719],[48,14720,48,14735],[48,14448,48,14463],[48,14464,48,14479],[48,14480,48,14495],[48,14496,48,14511],[48,14512,48,14527],[48,14528,48,14543],[48,14544,48,14559],[48,14560,48,14575],[48,14576,48,14591],[48,14304,48,14319],[48,14320,48,14335],[48,14336,48,14351],[48,14352,48,14367],[48,14368,48,14383],[48,14384,48,14399],[48,14400,48,14415],[48,14416,48,14431],[48,14432,48,14447],[48,14160,48,14175],[48,14176,48,14191],[48,14192,48,14207],[48,14208,48,14223],[48,14224,48,14239],[48,14240,48,14255],[48,14256,48,14271],[48,14272,48,14287],[48,14288,48,14303],[48,14016,48,14031],[48,14032,48,14047],[48,14048,48,14063],[48,14064,48,14079],[48,14080,48,14095],[48,14096,48,14111],[48,14112,48,14127],[48,14128,48,14143],[48,14144,48,14159],[48,13872,48,13887],[48,13888,48,13903],[48,13904,48,13919],[48,13920,48,13935],[48,13936,48,13951],[48,13952,48,13967],[48,13968,48,13983],[48,13984,48,13999],[48,14000,48,14015],[48,13728,48,13743],[48,13744,48,13759],[48,13760,48,13775],[48,13776,48,13791],[48,13792,48,13807],[48,13808,48,13823],[48,13824,48,13839],[48,13840,48,13855],[48,13856,48,13871],[48,13584,48,13599],[48,13600,48,13615],[48,13616,48,13631],[48,13632,48,13647],[48,13648,48,13663],[48,13664,48,13679],[48,13680,48,13695],[48,13696,48,13711],[48,13712,48,13727],[48,13440,48,13455],[48,13456,48,13471],[48,13472,48,13487],[48,13488,48,13503],[48,13504,48,13519],[48,13520,48,13535],[48,13536,48,13551],[48,13552,48,13567],[48,13568,48,13583],[48,13296,48,13311],[48,13312,48,13327],[48,13328,48,13343],[48,13344,48,13359],[48,13360,48,13375],[48,13376,48,13391],[48,13392,48,13407],[48,13408,48,13423],[48,13424,48,13439],[48,13152,48,13167],[48,13168,48,13183],[48,13184,48,13199],[48,13200,48,13215],[48,13216,48,13231],[48,13232,48,13247],[48,13248,48,13263],[48,13264,48,13279],[48,13280,48,13295],[48,13008,48,13023],[48,13024,48,13039],[48,13040,48,13055],[48,13056,48,13071],[48,13072,48,13087],[48,13088,48,13103],[48,13104,48,13119],[48,13120,48,13135],[48,13136,48,13151],[48,12864,48,12879],[48,12880,48,12895],[48,12896,48,12911],[48,12912,48,12927],[48,12928,48,12943],[48,12944,48,12959],[48,12960,48,12975],[48,12976,48,12991],[48,12992,48,13007],[48,12720,48,12735],[48,12736,48,12751],[48,12752,48,12767],[48,12768,48,12783],[48,12784,48,12799],[48,12800,48,12815],[48,12816,48,12831],[48,12832,48,12847],[48,12848,48,12863],[48,12576,48,12591],[48,12592,48,12607],[48,12608,48,12623],[48,12624,48,12639],[48,12640,48,12655],[48,12656,48,12671],[48,12672,48,12687],[48,12688,48,12703],[48,12704,48,12719],[48,12432,48,12447],[48,12448,48,12463],[48,12464,48,12479],[48,12480,48,12495],[48,12496,48,12511],[48,12512,48,12527],[48,12528,48,12543],[48,12544,48,12559],[48,12560,48,12575],[48,12288,48,12303],[48,12304,48,12319],[48,12320,48,12335],[48,12336,48,12351],[48,12352,48,12367],[48,12368,48,12383],[48,12384,48,12399],[48,12400,48,12415],[48,12416,48,12431],[48,12144,48,12159],[48,12160,48,12175],[48,12176,48,12191],[48,12192,48,12207],[48,12208,48,12223],[48,12224,48,12239],[48,12240,48,12255],[48,12256,48,12271],[48,12272,48,12287],[48,12000,48,12015],[48,12016,48,12031],[48,12032,48,12047],[48,12048,48,12063],[48,12064,48,12079],[48,12080,48,12095],[48,12096,48,12111],[48,12112,48,12127],[48,12128,48,12143],[48,11856,48,11871],[48,11872,48,11887],[48,11888,48,11903],[48,11904,48,11919],[48,11920,48,11935],[48,11936,48,11951],[48,11952,48,11967],[48,11968,48,11983],[48,11984,48,11999],[48,11712,48,11727],[48,11728,48,11743],[48,11744,48,11759],[48,11760,48,11775],[48,11776,48,11791],[48,11792,48,11807],[48,11808,48,11823],[48,11824,48,11839],[48,11840,48,11855],[48,11568,48,11583],[48,11584,48,11599],[48,11600,48,11615],[48,11616,48,11631],[48,11632,48,11647],[48,11648,48,11663],[48,11664,48,11679],[48,11680,48,11695],[48,11696,48,11711],[48,11424,48,11439],[48,11440,48,11455],[48,11456,48,11471],[48,11472,48,11487],[48,11488,48,11503],[48,11504,48,11519],[48,11520,48,11535],[48,11536,48,11551],[48,11552,48,11567],[48,11280,48,11295],[48,11296,48,11311],[48,11312,48,11327],[48,11328,48,11343],[48,11344,48,11359],[48,11360,48,11375],[48,11376,48,11391],[48,11392,48,11407],[48,11408,48,11423],[48,11136,48,11151],[48,11152,48,11167],[48,11168,48,11183],[48,11184,48,11199],[48,11200,48,11215],[48,11216,48,11231],[48,11232,48,11247],[48,11248,48,11263],[48,11264,48,11279],[48,10992,48,11007],[48,11008,48,11023],[48,11024,48,11039],[48,11040,48,11055],[48,11056,48,11071],[48,11072,48,11087],[48,11088,48,11103],[48,11104,48,11119],[48,11120,48,11135],[48,10848,48,10863],[48,10864,48,10879],[48,10880,48,10895],[48,10896,48,10911],[48,10912,48,10927],[48,10928,48,10943],[48,10944,48,10959],[48,10960,48,10975],[48,10976,48,10991],[48,10704,48,10719],[48,10720,48,10735],[48,10736,48,10751],[48,10752,48,10767],[48,10768,48,10783],[48,10784,48,10799],[48,10800,48,10815],[48,10816,48,10831],[48,10832,48,10847],[48,10560,48,10575],[48,10576,48,10591],[48,10592,48,10607],[48,10608,48,10623],[48,10624,48,10639],[48,10640,48,10655],[48,10656,48,10671],[48,10672,48,10687],[48,10688,48,10703],[48,10416,48,10431],[48,10432,48,10447],[48,10448,48,10463],[48,10464,48,10479],[48,10480,48,10495],[48,10496,48,10511],[48,10512,48,10527],[48,10528,48,10543],[48,10544,48,10559],[48,10272,48,10287],[48,10288,48,10303],[48,10304,48,10319],[48,10320,48,10335],[48,10336,48,10351],[48,10352,48,10367],[48,10368,48,10383],[48,10384,48,10399],[48,10400,48,10415],[48,10128,48,10143],[48,10144,48,10159],[48,10160,48,10175],[48,10176,48,10191],[48,10192,48,10207],[48,10208,48,10223],[48,10224,48,10239],[48,10240,48,10255],[48,10256,48,10271],[48,9984,48,9999],[48,10000,48,10015],[48,10016,48,10031],[48,10032,48,10047],[48,10048,48,10063],[48,10064,48,10079],[48,10080,48,10095],[48,10096,48,10111],[48,10112,48,10127],[48,9840,48,9855],[48,9856,48,9871],[48,9872,48,9887],[48,9888,48,9903],[48,9904,48,9919],[48,9920,48,9935],[48,9936,48,9951],[48,9952,48,9967],[48,9968,48,9983],[48,9696,48,9711],[48,9712,48,9727],[48,9728,48,9743],[48,9744,48,9759],[48,9760,48,9775],[48,9776,48,9791],[48,9792,48,9807],[48,9808,48,9823],[48,9824,48,9839],[48,9552,48,9567],[48,9568,48,9583],[48,9584,48,9599],[48,9600,48,9615],[48,9616,48,9631],[48,9632,48,9647],[48,9648,48,9663],[48,9664,48,9679],[48,9680,48,9695],[48,9408,48,9423],[48,9424,48,9439],[48,9440,48,9455],[48,9456,48,9471],[48,9472,48,9487],[48,9488,48,9503],[48,9504,48,9519],[48,9520,48,9535],[48,9536,48,9551],[48,9264,48,9279],[48,9280,48,9295],[48,9296,48,9311],[48,9312,48,9327],[48,9328,48,9343],[48,9344,48,9359],[48,9360,48,9375],[48,9376,48,9391],[48,9392,48,9407],[48,9120,48,9135],[48,9136,48,9151],[48,9152,48,9167],[48,9168,48,9183],[48,9184,48,9199],[48,9200,48,9215],[48,9216,48,9231],[48,9232,48,9247],[48,9248,48,9263],[48,8976,48,8991],[48,8992,48,9007],[48,9008,48,9023],[48,9024,48,9039],[48,9040,48,9055],[48,9056,48,9071],[48,9072,48,9087],[48,9088,48,9103],[48,9104,48,9119],[48,8832,48,8847],[48,8848,48,8863],[48,8864,48,8879],[48,8880,48,8895],[48,8896,48,8911],[48,8912,48,8927],[48,8928,48,8943],[48,8944,48,8959],[48,8960,48,8975],[48,8688,48,8703],[48,8704,48,8719],[48,8720,48,8735],[48,8736,48,8751],[48,8752,48,8767],[48,8768,48,8783],[48,8784,48,8799],[48,8800,48,8815],[48,8816,48,8831],[48,8544,48,8559],[48,8560,48,8575],[48,8576,48,8591],[48,8592,48,8607],[48,8608,48,8623],[48,8624,48,8639],[48,8640,48,8655],[48,8656,48,8671],[48,8672,48,8687],[48,8400,48,8415],[48,8416,48,8431],[48,8432,48,8447],[48,8448,48,8463],[48,8464,48,8479],[48,8480,48,8495],[48,8496,48,8511],[48,8512,48,8527],[48,8528,48,8543],[48,8256,48,8271],[48,8272,48,8287],[48,8288,48,8303],[48,8304,48,8319],[48,8320,48,8335],[48,8336,48,8351],[48,8352,48,8367],[48,8368,48,8383],[48,8384,48,8399],[48,8112,48,8127],[48,8128,48,8143],[48,8144,48,8159],[48,8160,48,8175],[48,8176,48,8191],[48,8192,48,8207],[48,8208,48,8223],[48,8224,48,8239],[48,8240,48,8255],[48,7968,48,7983],[48,7984,48,7999],[48,8000,48,8015],[48,8016,48,8031],[48,8032,48,8047],[48,8048,48,8063],[48,8064,48,8079],[48,8080,48,8095],[48,8096,48,8111],[48,7824,48,7839],[48,7840,48,7855],[48,7856,48,7871],[48,7872,48,7887],[48,7888,48,7903],[48,7904,48,7919],[48,7920,48,7935],[48,7936,48,7951],[48,7952,48,7967],[48,7680,48,7695],[48,7696,48,7711],[48,7712,48,7727],[48,7728,48,7743],[48,7744,48,7759],[48,7760,48,7775],[48,7776,48,7791],[48,7792,48,7807],[48,7808,48,7823],[48,7536,48,7551],[48,7552,48,7567],[48,7568,48,7583],[48,7584,48,7599],[48,7600,48,7615],[48,7616,48,7631],[48,7632,48,7647],[48,7648,48,7663],[48,7664,48,7679],[48,7392,48,7407],[48,7408,48,7423],[48,7424,48,7439],[48,7440,48,7455],[48,7456,48,7471],[48,7472,48,7487],[48,7488,48,7503],[48,7504,48,7519],[48,7520,48,7535],[48,7248,48,7263],[48,7264,48,7279],[48,7280,48,7295],[48,7296,48,7311],[48,7312,48,7327],[48,7328,48,7343],[48,7344,48,7359],[48,7360,48,7375],[48,7376,48,7391],[48,7104,48,7119],[48,7120,48,7135],[48,7136,48,7151],[48,7152,48,7167],[48,7168,48,7183],[48,7184,48,7199],[48,7200,48,7215],[48,7216,48,7231],[48,7232,48,7247],[48,6960,48,6975],[48,6976,48,6991],[48,6992,48,7007],[48,7008,48,7023],[48,7024,48,7039],[48,7040,48,7055],[48,7056,48,7071],[48,7072,48,7087],[48,7088,48,7103],[48,6816,48,6831],[48,6832,48,6847],[48,6848,48,6863],[48,6864,48,6879],[48,6880,48,6895],[48,6896,48,6911],[48,6912,48,6927],[48,6928,48,6943],[48,6944,48,6959],[48,6672,48,6687],[48,6688,48,6703],[48,6704,48,6719],[48,6720,48,6735],[48,6736,48,6751],[48,6752,48,6767],[48,6768,48,6783],[48,6784,48,6799],[48,6800,48,6815],[48,6528,48,6543],[48,6544,48,6559],[48,6560,48,6575],[48,6576,48,6591],[48,6592,48,6607],[48,6608,48,6623],[48,6624,48,6639],[48,6640,48,6655],[48,6656,48,6671],[48,6384,48,6399],[48,6400,48,6415],[48,6416,48,6431],[48,6432,48,6447],[48,6448,48,6463],[48,6464,48,6479],[48,6480,48,6495],[48,6496,48,6511],[48,6512,48,6527],[48,6240,48,6255],[48,6256,48,6271],[48,6272,48,6287],[48,6288,48,6303],[48,6304,48,6319],[48,6320,48,6335],[48,6336,48,6351],[48,6352,48,6367],[48,6368,48,6383],[48,6096,48,6111],[48,6112,48,6127],[48,6128,48,6143],[48,6144,48,6159],[48,6160,48,6175],[48,6176,48,6191],[48,6192,48,6207],[48,6208,48,6223],[48,6224,48,6239],[48,5952,48,5967],[48,5968,48,5983],[48,5984,48,5999],[48,6000,48,6015],[48,6016,48,6031],[48,6032,48,6047],[48,6048,48,6063],[48,6064,48,6079],[48,6080,48,6095],[48,5808,48,5823],[48,5824,48,5839],[48,5840,48,5855],[48,5856,48,5871],[48,5872,48,5887],[48,5888,48,5903],[48,5904,48,5919],[48,5920,48,5935],[48,5936,48,5951],[48,5664,48,5679],[48,5680,48,5695],[48,5696,48,5711],[48,5712,48,5727],[48,5728,48,5743],[48,5744,48,5759],[48,5760,48,5775],[48,5776,48,5791],[48,5792,48,5807],[48,5520,48,5535],[48,5536,48,5551],[48,5552,48,5567],[48,5568,48,5583],[48,5584,48,5599],[48,5600,48,5615],[48,5616,48,5631],[48,5632,48,5647],[48,5648,48,5663],[48,5376,48,5391],[48,5392,48,5407],[48,5408,48,5423],[48,5424,48,5439],[48,5440,48,5455],[48,5456,48,5471],[48,5472,48,5487],[48,5488,48,5503],[48,5504,48,5519],[48,5232,48,5247],[48,5248,48,5263],[48,5264,48,5279],[48,5280,48,5295],[48,5296,48,5311],[48,5312,48,5327],[48,5328,48,5343],[48,5344,48,5359],[48,5360,48,5375],[48,5088,48,5103],[48,5104,48,5119],[48,5120,48,5135],[48,5136,48,5151],[48,5152,48,5167],[48,5168,48,5183],[48,5184,48,5199],[48,5200,48,5215],[48,5216,48,5231],[48,4944,48,4959],[48,4960,48,4975],[48,4976,48,4991],[48,4992,48,5007],[48,5008,48,5023],[48,5024,48,5039],[48,5040,48,5055],[48,5056,48,5071],[48,5072,48,5087],[48,4800,48,4815],[48,4816,48,4831],[48,4832,48,4847],[48,4848,48,4863],[48,4864,48,4879],[48,4880,48,4895],[48,4896,48,4911],[48,4912,48,4927],[48,4928,48,4943],[48,4656,48,4671],[48,4672,48,4687],[48,4688,48,4703],[48,4704,48,4719],[48,4720,48,4735],[48,4736,48,4751],[48,4752,48,4767],[48,4768,48,4783],[48,4784,48,4799],[48,4512,48,4527],[48,4528,48,4543],[48,4544,48,4559],[48,4560,48,4575],[48,4576,48,4591],[48,4592,48,4607],[48,4608,48,4623],[48,4624,48,4639],[48,4640,48,4655],[48,4368,48,4383],[48,4384,48,4399],[48,4400,48,4415],[48,4416,48,4431],[48,4432,48,4447],[48,4448,48,4463],[48,4464,48,4479],[48,4480,48,4495],[48,4496,48,4511],[48,4224,48,4239],[48,4240,48,4255],[48,4256,48,4271],[48,4272,48,4287],[48,4288,48,4303],[48,4304,48,4319],[48,4320,48,4335],[48,4336,48,4351],[48,4352,48,4367],[48,4080,48,4095],[48,4096,48,4111],[48,4112,48,4127],[48,4128,48,4143],[48,4144,48,4159],[48,4160,48,4175],[48,4176,48,4191],[48,4192,48,4207],[48,4208,48,4223],[48,3936,48,3951],[48,3952,48,3967],[48,3968,48,3983],[48,3984,48,3999],[48,4000,48,4015],[48,4016,48,4031],[48,4032,48,4047],[48,4048,48,4063],[48,4064,48,4079],[48,3792,48,3807],[48,3808,48,3823],[48,3824,48,3839],[48,3840,48,3855],[48,3856,48,3871],[48,3872,48,3887],[48,3888,48,3903],[48,3904,48,3919],[48,3920,48,3935],[48,3648,48,3663],[48,3664,48,3679],[48,3680,48,3695],[48,3696,48,3711],[48,3712,48,3727],[48,3728,48,3743],[48,3744,48,3759],[48,3760,48,3775],[48,3776,48,3791],[48,3504,48,3519],[48,3520,48,3535],[48,3536,48,3551],[48,3552,48,3567],[48,3568,48,3583],[48,3584,48,3599],[48,3600,48,3615],[48,3616,48,3631],[48,3632,48,3647],[48,3360,48,3375],[48,3376,48,3391],[48,3392,48,3407],[48,3408,48,3423],[48,3424,48,3439],[48,3440,48,3455],[48,3456,48,3471],[48,3472,48,3487],[48,3488,48,3503],[48,3216,48,3231],[48,3232,48,3247],[48,3248,48,3263],[48,3264,48,3279],[48,3280,48,3295],[48,3296,48,3311],[48,3312,48,3327],[48,3328,48,3343],[48,3344,48,3359],[48,3072,48,3087],[48,3088,48,3103],[48,3104,48,3119],[48,3120,48,3135],[48,3136,48,3151],[48,3152,48,3167],[48,3168,48,3183],[48,3184,48,3199],[48,3200,48,3215],[48,2928,48,2943],[48,2944,48,2959],[48,2960,48,2975],[48,2976,48,2991],[48,2992,48,3007],[48,3008,48,3023],[48,3024,48,3039],[48,3040,48,3055],[48,3056,48,3071],[48,2784,48,2799],[48,2800,48,2815],[48,2816,48,2831],[48,2832,48,2847],[48,2848,48,2863],[48,2864,48,2879],[48,2880,48,2895],[48,2896,48,2911],[48,2912,48,2927],[48,2640,48,2655],[48,2656,48,2671],[48,2672,48,2687],[48,2688,48,2703],[48,2704,48,2719],[48,2720,48,2735],[48,2736,48,2751],[48,2752,48,2767],[48,2768,48,2783],[48,2496,48,2511],[48,2512,48,2527],[48,2528,48,2543],[48,2544,48,2559],[48,2560,48,2575],[48,2576,48,2591],[48,2592,48,2607],[48,2608,48,2623],[48,2624,48,2639],[48,2352,48,2367],[48,2368,48,2383],[48,2384,48,2399],[48,2400,48,2415],[48,2416,48,2431],[48,2432,48,2447],[48,2448,48,2463],[48,2464,48,2479],[48,2480,48,2495],[48,2208,48,2223],[48,2224,48,2239],[48,2240,48,2255],[48,2256,48,2271],[48,2272,48,2287],[48,2288,48,2303],[48,2304,48,2319],[48,2320,48,2335],[48,2336,48,2351],[48,2064,48,2079],[48,2080,48,2095],[48,2096,48,2111],[48,2112,48,2127],[48,2128,48,2143],[48,2144,48,2159],[48,2160,48,2175],[48,2176,48,2191],[48,2192,48,2207],[48,1920,48,1935],[48,1936,48,1951],[48,1952,48,1967],[48,1968,48,1983],[48,1984,48,1999],[48,2000,48,2015],[48,2016,48,2031],[48,2032,48,2047],[48,2048,48,2063],[48,1776,48,1791],[48,1792,48,1807],[48,1808,48,1823],[48,1824,48,1839],[48,1840,48,1855],[48,1856,48,1871],[48,1872,48,1887],[48,1888,48,1903],[48,1904,48,1919],[48,1632,48,1647],[48,1648,48,1663],[48,1664,48,1679],[48,1680,48,1695],[48,1696,48,1711],[48,1712,48,1727],[48,1728,48,1743],[48,1744,48,1759],[48,1760,48,1775],[48,1488,48,1503],[48,1504,48,1519],[48,1520,48,1535],[48,1536,48,1551],[48,1552,48,1567],[48,1568,48,1583],[48,1584,48,1599],[48,1600,48,1615],[48,1616,48,1631],[48,1344,48,1359],[48,1360,48,1375],[48,1376,48,1391],[48,1392,48,1407],[48,1408,48,1423],[48,1424,48,1439],[48,1440,48,1455],[48,1456,48,1471],[48,1472,48,1487],[48,1200,48,1215],[48,1216,48,1231],[48,1232,48,1247],[48,1248,48,1263],[48,1264,48,1279],[48,1280,48,1295],[48,1296,48,1311],[48,1312,48,1327],[48,1328,48,1343],[48,1056,48,1071],[48,1072,48,1087],[48,1088,48,1103],[48,1104,48,1119],[48,1120,48,1135],[48,1136,48,1151],[48,1152,48,1167],[48,1168,48,1183],[48,1184,48,1199],[48,912,48,927],[48,928,48,943],[48,944,48,959],[48,960,48,975],[48,976,48,991],[48,992,48,1007],[48,1008,48,1023],[48,1024,48,1039],[48,1040,48,1055],[48,768,48,783],[48,784,48,799],[48,800,48,815],[48,816,48,831],[48,832,48,847],[48,848,48,863],[48,864,48,879],[48,880,48,895],[48,896,48,911],[48,624,48,639],[48,640,48,655],[48,656,48,671],[48,672,48,687],[48,688,48,703],[48,704,48,719],[48,720,48,735],[48,736,48,751],[48,752,48,767],[48,480,48,495],[48,496,48,511],[48,512,48,527],[48,528,48,543],[48,544,48,559],[48,560,48,575],[48,576,48,591],[48,592,48,607],[48,608,48,623],[48,336,48,351],[48,352,48,367],[48,368,48,383],[48,384,48,399],[48,400,48,415]],"merged_total":3225,"flags":["merged_cut"]}
[null,null,null,null,"School Division:",null,{"$f":"'Title III Budget'!$A$16","v":"ALBEMARLE COUNTY PUBLIC SCHOOLS"},null,null,null,null,null,"Division Number:",null,null,{"$f":"'Title III Budget'!$H$16","v":2}]
["E.  PROGRAMS AND SERVICES FOR ELs AND THEIR FAMILIES"]
[]
["Federal Civil Rights Requirements\nDivisions must provide programs and services for the education of English Learners (ELs) under Title VI of the Civil Rights Act of 1964, the Equal Educational Opportunities Act of 1974 (EEOA), Lau v Nichols (1974), Castañeda v Pickard (1981) and other civil rights laws and federal statutes and guidance.  Federal funds, including Title III, cannot be used to meet the federal requirements for ELs. Under the Castañeda standards, programs and services for ELs should: 1) be based on effective education theory and/or research recognized by legitimate experts in the field; 2) be implemented with fidelity and adequate resources to ensure a realistic chance of success within a reasonable timeframe; and 3) lead to improved academic outcomes within this reasonable timeframe.  \n"]
[]
["Description of an Effective LIEP Supported by Local and/or State Funds: The division must implement an effective language instruction educational program (LIEP) in order to meet the needs of ELs and demonstrate success in increasing their English language proficiency and student academic achievement."]
[]
["Narrative Boxes:"]
["Box 1:  Using Local and/or State Funds: Describe how instruction is delivered to ELs at varying proficiency levels and grade span levels to develop their English language skills and increase their ability to meet challenging State academic standards. Include specialized programs for newcomer ELs, “opt-out” ELs, dually-identified ELs, ELs at higher proficiency levels, long-term ELs, and EL students with limited or interrupted formal education (SLIFE), if applicable.  "]
["Students in the ACPS ESOL program receive customized, targeted instruction and feedback so that they can become fully proficient in English while learning the same rigorous academic content as others. ACPS does not subscribe to a single instructional model as no single approach is appropriate for all ELs. ACPS ESOL teachers respond to students’ needs by implementing research-based practices for interactive instruction; and advocating for language and content objectives and appropriate scaffolds to be included in ELs’ daily lessons. We believe in a case manager approach, where ESOL teachers are the advocate for any supports/services needed by students beyond the LIEPs of (1) ESL, which includes “Advisory” for LTELs, (2) Content Classes with integrated ESL support which typically includes dually-identified ELs, (3) Newcomer Program which is differentiated for SLIFE students, or (4) Dual Language. Our case manager approach allows students to remain in content/honors classes with their peers, thus minimizing the number of opt-out ELs. Last but not least, ESOL teachers monitor the academic progress of Formerly ELs and support them in selecting and utilizing their classroom/testing accommodations as needed. \n\n"]
[]
["Box 2:  Describe the division’s plan to provide effective professional development that specifically relates to the teaching of ELs as identified in Box 1.  "]
["The Title III Coordinator works closely with the Director of Professional Learning for ACPS to address areas of need related to teaching of ELs. These needs are based on the results of the ongoing ESOL Program Evaluation Process that includes:\nclassroom walkthroughs with school administrators; conversations with teachers of ELs during ESOL classes; interactions with families and educational partners at family and community engagement events or in our office; and teacher discussions during Professional Learning Communities (PLCs) and Professional Development (PD) workshops. \nOnce areas of focus are identified, ESOL and content teacher teams collaborate to build professional learning sessions for colleagues. Additional PD workshops are offered as ACPS Opportunities Courses to all teachers across the division. An intentional effort is made to include PD workshops that support best instructional practices for teachers of ELs. With this mindset, we hope all teachers will see themselves as an ESOL teacher in that they have the skills and understandings to meet the needs of ELs.\nWe use the Title III application process to formally synthesize and summarize all quantitative and quantitative data in order to make programmatic decisions for the upcoming academic year, including coordination with the ACPS PD department. For example, based on trends noticed across schools, we designed and delivered PD sessions on interpretation and translation, supporting Dually Identified ELs, Culturally Responsive Teaching, accelerating ELs’ language acquisition in the content areas, and academic language strategies.\n\n\n"]
["Page 21"]
[null,null,null,null,"School Division:",null,{"$f":"'Title III Budget'!$A$16","v":"ALBEMARLE COUNTY PUBLIC SCHOOLS"},null,null,null,null,null,"Division Number:",null,null,{"$f":"'Title III Budget'!$H$16","v":2}]
[]
["E.  PROGRAMS AND SERVICES FOR ELs AND THEIR FAMILIES (CONTINUED)",null,null,null,null,null,null,null,null,null,null,null,null,null,null,null,null,null,null,null,null,null,null,null,null,null,null,null,null,null,null,null,"E.  PROGRAMS AND SERVICES FOR ELs AND THEIR FAMILIES (CONTINUED)",null,null,null,null,null,null,null,null,null,null,null,null,null,null,null,"E.  PROGRAMS AND SERVICES FOR ELs AND THEIR FAMILIES (CONTINUED)",null,null,null,null,null,null,null,null,null,null,null,null,null,null,null,"E.  PROGRAMS AND SERVICES FOR ELs AND THEIR FAMILIES (CONTINUED)",null,null,null,null,null,null,null,null,null,null,null,null,null,null,null,"E.  PROGRAMS AND SERVICES FOR ELs AND THEIR FAMILIES (CONTINUED)",null,null,null,null,null,null,null,null,null,null,null,null,null,null,null,"E.  PROGRAMS AND SERVICES FOR ELs AND THEIR FAMILIES (CONTINUED)",null,null,null,null,null,null,null,null,null,null,null,null,null,null,null,"E.  PROGRAMS AND SERVICES FOR ELs AND THEIR FAMILIES (CONTINUED)",null,null,null,null,null,null,null,null,null,null,null,null,null,null,null,"E.  PROGRAMS AND SERVICES FOR ELs AND THEIR FAMILIES (CONTINUED)",null,null,null,null,null,null,null,null,null,null,null,null,null,null,null,"E.  PROGRAMS AND SERVICES FOR ELs AND THEIR FAMILIES (CONTINUED)",null,null,null,null,null,null,null,null,null,null,null,null,null,null,null,"E.  PROGRAMS AND SERVICES FOR ELs AND THEIR FAMILIES (CONTINUED)",null,null,null,null,null,null,null,null,null,null,null,null,null,null,null,"E.  PROGRAMS AND SERVICES FOR ELs AND THEIR FAMILIES (CONTINUED)",null,null,null,null,null,null,null,null,null,null,null,null,null,null,null,"E.  PROGRAMS AND SERVICES FOR ELs AND THEIR FAMILIES (CONTINUED)",null,null,null,null,null,null,null,null,null,null,null,null,null,null,null,"E.  PROGRAMS AND SERVICES FOR ELs AND THEIR FAMILIES (CONTINUED)",null,null,null,null,null,null,null,null,null,null,null,null,null,null,null,"E.  PROGRAMS AND SERVICES FOR ELs AND THEIR FAMILIES (CONTINUED)",null,null,null,null,null,null,null,null,null,null,null,null,null,null,null,"E.  PROGRAMS AND SERVICES FOR ELs AND THEIR FAMILIES (CONTINUED)",null,null,null,null,null,null,null,null,null,null,null,null,null,null,null,"E.  PROGRAMS AND SERVICES FOR ELs AND THEIR FAMILIES (CONTINUED)",null,null,null,null,null,null,null,null,null,null,null,null,null,null,null,"E.  PROGRAMS AND SERVICES FOR ELs AND THEIR FAMILIES (CONTINUED)",null,null,null,null,null,null,null,null,null,null,null,null,null,null,null,"E.  PROGRAMS AND SERVICES FOR ELs AND THEIR FAMILIES (CONTINUED)",null,null,null,null,null,null,null,null,null,null,null,null,null,null,null,"E.  PROGRAMS AND SERVICES FOR ELs AND THEIR FAMILIES (CONTINUED)",null,null,null,null,null,null,null,null,null,null,null,null,null,null,null,"E.  PROGRAMS AND SERVICES FOR ELs AND THEIR FAMILIES (CONTINUED)",null,null,null,null,null,null,null,null,null,null,null,null,null,null,null,"E.  PROGRAMS AND SERVICES FOR ELs AND THEIR FAMILIES (CONTINUED)",null,null,null,null,null,null,null,null,null,null,null,null,null,null,null,"E.  PROGRAMS AND SERVICES FOR ELs AND THEIR FAMILIES (CONTINUED)",null,null,null,null,null,null,null,null,null,null,null,null,null,null,null,"E.  PROGRAMS AND SERVICES FOR ELs AND THEIR FAMILIES (CONTINUED)",null,null,null,null,null,null,null,null,null,null,null,null,null,null,null,"E.  PROGRAMS AND SERVICES FOR ELs AND THEIR FAMILIES (CONTINUED)",null,null,null,null,null,null,null,null,null,null,null,null,null,null,null,"E.  PROGRAMS AND SERVICES FOR ELs AND THEIR FAMILIES (CONTINUED)",null,null,null,null,null,null,null,null,null,null,null,null,null,null,null,"E.  PROGRAMS AND SERVICES FOR ELs AND THEIR FAMILIES (CONTINUED)",null,null,null,null,null,null,null,null,null,null,null,null,null,null,null,"E.  PROGRAMS AND SERVICES FOR ELs AND THEIR FAMILIES (CONTINUED)",null,null,null,null,null,null,null,null,null,null,null,null,null,null,null,"E.  PROGRAMS AND SERVICES FOR ELs AND THEIR FAMILIES (CONTINUED)",null,null,null,null,null,null,null,null,null,null,null,null,null,null,null,"E.  PROGRAMS AND SERVICES FOR ELs AND THEIR FAMILIES (CONTINUED)",null,null,null,null,null,null,null,null,null,null,null,null,null,null,null,"E.  PROGRAMS AND SERVICES FOR ELs AND THEIR FAMILIES (CONTINUED)",null,null,null,null,null,null,null,null,null,null,null,null,null,null,null,"E.  PROGRAMS AND SERVICES FOR ELs AND THEIR FAMILIES (CONTINUED)",null,null,null,null,null,null,null,null,null,null,null,null,null,null,null,"E.  PROGRAMS AND SERVICES FOR ELs AND THEIR FAMILIES (CONTINUED)",null,null,null,null,null,null,null,null,null,null,null,null,null,null,null,"E.  PROGRAMS AND SERVICES FOR ELs AND THEIR FAMILIES (CONTINUED)",null,null,null,null,null,null,null,null,null,null,null,null,null,null,null,"E.  PROGRAMS AND SERVICES FOR ELs AND THEIR FAMILIES (CONTINUED)",null,null,null,null,null,null,null,null,null,null,null,null,null,null,null,"E.  PROGRAMS AND SERVICES FOR ELs AND THEIR FAMILIES (CONTINUED)",null,null,null,null,null,null,null,null,null,null,null,null,null,null,null,"E.  PROGRAMS AND SERVICES FOR ELs AND THEIR FAMILIES (CONTINUED)",null,null,null,null,null,null,null,null,null,null,null,null,null,null,null,"E.  PROGRAMS AND SERVICES FOR ELs AND THEIR FAMILIES (CONTINUED)",null,null,null,null,null,null,null,null,null,null,null,null,null,null,null,"E.  PROGRAMS AND SERVICES FOR ELs AND THEIR FAMILIES (CONTINUED)",null,null,null,null,null,null,null,null,null,null,null,null,null,null,null,"E.  PROGRAMS AND SERVICES FOR ELs AND THEIR FAMILIES (CONTINUED)",null,null,null,null,null,null,null,null,null,null,null,null,null,null,null,"E.  PROGRAMS AND SERVICES FOR ELs AND THEIR FAMILIES (CONTINUED)",null,null,null,null,null,null,null,null,null,null,null,null,null,null,null,"E.  PROGRAMS AND SERVICES FOR ELs AND THEIR FAMILIES (CONTINUED)",null,null,null,null,null,null,null,null,null,null,null,null,null,null,null,"E.  PROGRAMS AND SERVICES FOR ELs AND THEIR FAMILIES (CONTINUED)",null,null,null,null,null,null,null,null,null,null,null,null,null,null,null,"E.  PROGRAMS AND SERVICES FOR ELs AND THEIR FAMILIES (CONTINUED)",null,null,null,null,null,null,null,null,null,null,null,null,null,null,null,"E.  PROGRAMS AND SERVICES FOR ELs AND THEIR FAMILIES (CONTINUED)",null,null,null,null,null,null,null,null,null,null,null,null,null,null,null,"E.  PROGRAMS AND SERVICES FOR ELs AND THEIR FAMILIES (CONTINUED)",null,null,null,null,null,null,null,null,null,null,null,null,null,null,null,"E.  PROGRAMS AND SERVICES FOR ELs AND THEIR FAMILIES (CONTINUED)",null,null,null,null,null,null,null,null,null,null,null,null,null,null,null,"E.  PROGRAMS AND SERVICES FOR ELs AND THEIR FAMILIES (CONTINUED)",null,null,null,null,null,null,null,null,null,null,null,null,null,null,null,"E.  PROGRAMS AND SERVICES FOR ELs AND THEIR FAMILIES (CONTINUED)",null,null,null,null,null,null,null,null,null,null,null,null,null,null,null,"E.  PROGRAMS AND SERVICES FOR ELs AND THEIR FAMILIES (CONTINUED)",null,null,null,null,null,null,null,null,null,null,null,null,null,null,null,"E.  PROGRAMS AND SERVICES FOR ELs AND THEIR FAMILIES (CONTINUED)",null,null,null,null,null,null,null,null,null,null,null,null,null,null,null,"E.  PROGRAMS AND SERVICES FOR ELs AND THEIR FAMILIES (CONTINUED)",null,null,null,null,null,null,null,null,null,null,null,null,null,null,null,"E.  PROGRAMS AND SERVICES FOR ELs AND THEIR FAMILIES (CONTINUED)",null,null,null,null,null,null,null,null,null,null,null,null,null,null,null,"E.  PROGRAMS AND SERVICES FOR ELs AND THEIR FAMILIES (CONTINUED)",null,null,null,null,null,null,null,null,null,null,null,null,null,null,null,"E.  PROGRAMS AND SERVICES FOR ELs AND THEIR FAMILIES (CONTINUED)",null,null,null,null,null,null,null,null,null,null,null,null,null,null,null,"E.  PROGRAMS AND SERVICES FOR ELs AND THEIR FAMILIES (CONTINUED)",null,null,null,null,null,null,null,null,null,null,null,null,null,null,null,"E.  PROGRAMS AND SERVICES FOR ELs AND THEIR FAMILIES (CONTINUED)",null,null,null,null,null,null,null,null,null,null,null,null,null,null,null,"E.  PROGRAMS AND SERVICES FOR ELs AND THEIR FAMILIES (CONTINUED)",null,null,null,null,null,null,null,null,null,null,null,null,null,null,null,"E.  PROGRAMS AND SERVICES FOR ELs AND THEIR FAMILIES (CONTINUED)",null,null,null,null,null,null,null,null,null,null,null,null,null,null,null,"E.  PROGRAMS AND SERVICES FOR ELs AND THEIR FAMILIES (CONTINUED)",null,null,null,null,null,null,null,null,null,null,null,null,null,null,null,"E.  PROGRAMS AND SERVICES FOR ELs AND THEIR FAMILIES (CONTINUED)",null,null,null,null,null,null,null,null,null,null,null,null,null,null,null,"E.  PROGRAMS AND SERVICES FOR ELs AND THEIR FAMILIES (CONTINUED)",null,null,null,null,null,null,null,null,null,null,null,null,null,null,null,"E.  PROGRAMS AND SERVICES FOR ELs AND THEIR FAMILIES (CONTINUED)",null,null,null,null,null,null,null,null,null,null,null,null,null,null,null,"E.  PROGRAMS AND SERVICES FOR ELs AND THEIR FAMILIES (CONTINUED)",null,null,null,null,null,null,null,null,null,null,null,null,null,null,null,"E.  PROGRAMS AND SERVICES FOR ELs AND THEIR FAMILIES (CONTINUED)",null,null,null,null,null,null,null,null,null,null,null,null,null,null,null,"E.  PROGRAMS AND SERVICES FOR ELs AND THEIR FAMILIES (CONTINUED)",null,null,null,null,null,null,null,null,null,null,null,null,null,null,null,"E.  PROGRAMS AND SERVICES FOR ELs AND THEIR FAMILIES (CONTINUED)",null,null,null,null,null,null,null,null,null,null,null,null,null,null,null,"E.  PROGRAMS AND SERVICES FOR ELs AND THEIR FAMILIES (CONTINUED)",null,null,null,null,null,null,null,null,null,null,null,null,null,null,null,"E.  PROGRAMS AND SERVICES FOR ELs AND THEIR FAMILIES (CONTINUED)",null,null,null,null,null,null,null,null,null,null,null,null,null,null,null,"E.  PROGRAMS AND SERVICES FOR ELs AND THEIR FAMILIES (CONTINUED)",null,null,null,null,null,null,null,null,null,null,null,null,null,null,null,"E.  PROGRAMS AND SERVICES FOR ELs AND THEIR FAMILIES (CONTINUED)",null,null,null,null,null,null,null,null,null,null,null,null,null,null,null,"E.  PROGRAMS AND SERVICES FOR ELs AND THEIR FAMILIES (CONTINUED)",null,null,null,null,null,null,null,null,null,null,null,null,null,null,null,"E.  PROGRAMS AND SERVICES FOR ELs AND THEIR FAMILIES (CONTINUED)",null,null,null,null,null,null,null,null,null,null,null,null,null,null,null,"E.  PROGRAMS AND SERVICES FOR ELs AND THEIR FAMILIES (CONTINUED)",null,null,null,null,null,null,null,null,null,null,null,null,null,null,null,"E.  PROGRAMS AND SERVICES FOR ELs AND THEIR FAMILIES (CONTINUED)",null,null,null,null,null,null,null,null,null,null,null,null,null,null,null,"E.  PROGRAMS AND SERVICES FOR ELs AND THEIR FAMILIES (CONTINUED)",null,null,null,null,null,null,null,null,null,null,null,null,null,null,null,"E.  PROGRAMS AND SERVICES FOR ELs AND THEIR FAMILIES (CONTINUED)",null,null,null,null,null,null,null,null,null,null,null,null,null,null,null,"E.  PROGRAMS AND SERVICES FOR ELs AND THEIR FAMILIES (CONTINUED)",null,null,null,null,null,null,null,null,null,null,null,null,null,null,null,"E.  PROGRAMS AND SERVICES FOR ELs AND THEIR FAMILIES (CONTINUED)",null,null,null,null,null,null,null,null,null,null,null,null,null,null,null,"E.  PROGRAMS AND SERVICES FOR ELs AND THEIR FAMILIES (CONTINUED)",null,null,null,null,null,null,null,null,null,null,null,null,null,null,null,"E.  PROGRAMS AND SERVICES FOR ELs AND THEIR FAMILIES (CONTINUED)",null,null,null,null,null,null,null,null,null,null,null,null,null,null,null,"E.  PROGRAMS AND SERVICES FOR ELs AND THEIR FAMILIES (CONTINUED)",null,null,null,null,null,null,null,null,null,null,null,null,null,null,null,"E.  PROGRAMS AND SERVICES FOR ELs AND THEIR FAMILIES (CONTINUED)",null,null,null,null,null,null,null,null,null,null,null,null,null,null,null,"E.  PROGRAMS AND SERVICES FOR ELs AND THEIR FAMILIES (CONTINUED)",null,null,null,null,null,null,null,null,null,null,null,null,null,null,null,"E.  PROGRAMS AND SERVICES FOR ELs AND THEIR FAMILIES (CONTINUED)",null,null,null,null,null,null,null,null,null,null,null,null,null,null,null,"E.  PROGRAMS AND SERVICES FOR ELs AND THEIR FAMILIES (CONTINUED)",null,null,null,null,null,null,null,null,null,null,null,null,null,null,null,"E.  PROGRAMS AND SERVICES FOR ELs AND THEIR FAMILIES (CONTINUED)",null,null,null,null,null,null,null,null,null,null,null,null,null,null,null,"E.  PROGRAMS AND SERVICES FOR ELs AND THEIR FAMILIES (CONTINUED)",null,null,null,null,null,null,null,null,null,null,null,null,null,null,null,"E.  PROGRAMS AND SERVICES FOR ELs AND THEIR FAMILIES (CONTINUED)",null,null,null,null,null,null,null,null,null,null,null,null,null,null,null,"E.  PROGRAMS AND SERVICES FOR ELs AND THEIR FAMILIES (CONTINUED)",null,null,null,null,null,null,null,null,null,null,null,null,null,null,null,"E.  PROGRAMS AND SERVICES FOR ELs AND THEIR FAMILIES (CONTINUED)",null,null,null,null,null,null,null,null,null,null,null,null,null,null,null,"E.  PROGRAMS AND SERVICES FOR ELs AND THEIR FAMILIES (CONTINUED)",null,null,null,null,null,null,null,null,null,null,null,null,null,null,null,"E.  PROGRAMS AND SERVICES FOR ELs AND THEIR FAMILIES (CONTINUED)",null,null,null,null,null,null,null,null,null,null,null,null,null,null,null,"E.  PROGRAMS AND SERVICES FOR ELs AND THEIR FAMILIES (CONTINUED)",null,null,null,null,null,null,null,null,null,null,null,null,null,null,null,"E.  PROGRAMS AND SERVICES FOR ELs AND THEIR FAMILIES (CONTINUED)",null,null,null,null,null,null,null,null,null,null,null,null,null,null,null,"E.  PROGRAMS AND SERVICES FOR ELs AND THEIR FAMILIES (CONTINUED)",null,null,null,null,null,null,null,null,null,null,null,null,null,null,null,"E.  PROGRAMS AND SERVICES FOR ELs AND THEIR FAMILIES (CONTINUED)",null,null,null,null,null,null,null,null,null,null,null,null,null,null,null,"E.  PROGRAMS AND SERVICES FOR ELs AND THEIR FAMILIES (CONTINUED)",null,null,null,null,null,null,null,null,null,null,null,null,null,null,null,"E.  PROGRAMS AND SERVICES FOR ELs AND THEIR FAMILIES (CONTINUED)",null,null,null,null,null,null,null,null,null,null,null,null,null,null,null,"E.  PROGRAMS AND SERVICES FOR ELs AND THEIR FAMILIES (CONTINUED)",null,null,null,null,null,null,null,null,null,null,null,null,null,null,null,"E.  PROGRAMS AND SERVICES FOR ELs AND THEIR FAMILIES (CONTINUED)",null,null,null,null,null,null,null,null,null,null,null,null,null,null,null,"E.  PROGRAMS AND SERVICES FOR ELs AND THEIR FAMILIES (CONTINUED)",null,null,null,null,null,null,null,null,null,null,null,null,null,null,null,"E.  PROGRAMS AND SERVICES FOR ELs AND THEIR FAMILIES (CONTINUED)",null,null,null,null,null,null,null,null,null,null,null,null,null,null,null,"E.  PROGRAMS AND SERVICES FOR ELs AND THEIR FAMILIES (CONTINUED)",null,null,null,null,null,null,null,null,null,null,null,null,null,null,null,"E.  PROGRAMS AND SERVICES FOR ELs AND THEIR FAMILIES (CONTINUED)",null,null,null,null,null,null,null,null,null,null,null,null,null,null,null,"E.  PROGRAMS AND SERVICES FOR ELs AND THEIR FAMILIES (CONTINUED)",null,null,null,null,null,null,null,null,null,null,null,null,null,null,null,"E.  PROGRAMS AND SERVICES FOR ELs AND THEIR FAMILIES (CONTINUED)",null,null,null,null,null,null,null,null,null,null,null,null,null,null,null,"E.  PROGRAMS AND SERVICES FOR ELs AND THEIR FAMILIES (CONTINUED)",null,null,null,null,null,null,null,null,null,null,null,null,null,null,null,"E.  PROGRAMS AND SERVICES FOR ELs AND THEIR FAMILIES (CONTINUED)",null,null,null,null,null,null,null,null,null,null,null,null,null,null,null,"E.  PROGRAMS AND SERVICES FOR ELs AND THEIR FAMILIES (CONTINUED)",null,null,null,null,null,null,null,null,null,null,null,null,null,null,null,"E.  PROGRAMS AND SERVICES FOR ELs AND THEIR FAMILIES (CONTINUED)",null,null,null,null,null,null,null,null,null,null,null,null,null,null,null,"E.  PROGRAMS AND SERVICES FOR ELs AND THEIR FAMILIES (CONTINUED)",null,null,null,null,null,null,null,null,null,null,null,null,null,null,null,"E.  PROGRAMS AND SERVICES FOR ELs AND THEIR FAMILIES (CONTINUED)",null,null,null,null,null,null,null,null,null,null,null,null,null,null,null,"E.  PROGRAMS AND SERVICES FOR ELs AND THEIR FAMILIES (CONTINUED)",null,null,null,null,null,null,null,null,null,null,null,null,null,null,null,"E.  PROGRAMS AND SERVICES FOR ELs AND THEIR FAMILIES (CONTINUED)",null,null,null,null,null,null,null,null,null,null,null,null,null,null,null,"E.  PROGRAMS AND SERVICES FOR ELs AND THEIR FAMILIES (CONTINUED)",null,null,null,null,null,null,null,null,null,null,null,null,null,null,null,"E.  PROGRAMS AND SERVICES FOR ELs AND THEIR FAMILIES (CONTINUED)",null,null,null,null,null,null,null,null,null,null,null,null,null,null,null,"E.  PROGRAMS AND SERVICES FOR ELs AND THEIR FAMILIES (CONTINUED)",null,null,null,null,null,null,null,null,null,null,null,null,null,null,null,"E.  PROGRAMS AND SERVICES FOR ELs AND THEIR FAMILIES (CONTINUED)",null,null,null,null,null,null,null,null,null,null,null,null,null,null,null,"E.  PROGRAMS AND SERVICES FOR ELs AND THEIR FAMILIES (CONTINUED)",null,null,null,null,null,null,null,null,null,null,null,null,null,null,null,"E.  PROGRAMS AND SERVICES FOR ELs AND THEIR FAMILIES (CONTINUED)",null,null,null,null,null,null,null,null,null,null,null,null,null,null,null,"E.  PROGRAMS AND SERVICES FOR ELs AND THEIR FAMILIES (CONTINUED)",null,null,null,null,null,null,null,null,null,null,null,null,null,null,null,"E.  PROGRAMS AND SERVICES FOR ELs AND THEIR FAMILIES (CONTINUED)",null,null,null,null,null,null,null,null,null,null,null,null,null,null,null,"E.  PROGRAMS AND SERVICES FOR ELs AND THEIR FAMILIES (CONTINUED)",null,null,null,null,null,null,null,null,null,null,null,null,null,null,null,"E.  PROGRAMS AND SERVICES FOR ELs AND THEIR FAMILIES (CONTINUED)",null,null,null,null,null,null,null,null,null,null,null,null,null,null,null,"E.  PROGRAMS AND SERVICES FOR ELs AND THEIR FAMILIES (CONTINUED)",null,null,null,null,null,null,null,null,null,null,null,null,null,null,null,"E.  PROGRAMS AND SERVICES FOR ELs AND THEIR FAMILIES (CONTINUED)",null,null,null,null,null,null,null,null,null,null,null,null,null,null,null,"E.  PROGRAMS AND SERVICES FOR ELs AND THEIR FAMILIES (CONTINUED)",null,null,null,null,null,null,null,null,null,null,null,null,null,null,null,"E.  PROGRAMS AND SERVICES FOR ELs AND THEIR FAMILIES (CONTINUED)",null,null,null,null,null,null,null,null,null,null,null,null,null,null,null,"E.  PROGRAMS AND SERVICES FOR ELs AND THEIR FAMILIES (CONTINUED)",null,null,null,null,null,null,null,null,null,null,null,null,null,null,null,"E.  PROGRAMS AND SERVICES FOR ELs AND THEIR FAMILIES (CONTINUED)",null,null,null,null,null,null,null,null,null,null,null,null,null,null,null,"E.  PROGRAMS AND SERVICES FOR ELs AND THEIR FAMILIES (CONTINUED)",null,null,null,null,null,null,null,null,null,null,null,null,null,null,null,"E.  PROGRAMS AND SERVICES FOR ELs AND THEIR FAMILIES (CONTINUED)",null,null,null,null,null,null,null,null,null,null,null,null,null,null,null,"E.  PROGRAMS AND SERVICES FOR ELs AND THEIR FAMILIES (CONTINUED)",null,null,null,null,null,null,null,null,null,null,null,null,null,null,null,"E.  PROGRAMS AND SERVICES FOR ELs AND THEIR FAMILIES (CONTINUED)",null,null,null,null,null,null,null,null,null,null,null,null,null,null,null,"E.  PROGRAMS AND SERVICES FOR ELs AND THEIR FAMILIES (CONTINUED)",null,null,null,null,null,null,null,null,null,null,null,null,null,null,null,"E.  PROGRAMS AND SERVICES FOR ELs AND THEIR FAMILIES (CONTINUED)",null,null,null,null,null,null,null,null,null,null,null,null,null,null,null,"E.  PROGRAMS AND SERVICES FOR ELs AND THEIR FAMILIES (CONTINUED)",null,null,null,null,null,null,null,null,null,null,null,null,null,null,null,"E.  PROGRAMS AND SERVICES FOR ELs AND THEIR FAMILIES (CONTINUED)",null,null,null,null,null,null,null,null,null,null,null,null,null,null,null,"E.  PROGRAMS AND SERVICES FOR ELs AND THEIR FAMILIES (CONTINUED)",null,null,null,null,null,null,null,null,null,null,null,null,null,null,null,"E.  PROGRAMS AND SERVICES FOR ELs AND THEIR FAMILIES (CONTINUED)",null,null,null,null,null,null,null,null,null,null,null,null,null,null,null,"E.  PROGRAMS AND SERVICES FOR ELs AND THEIR FAMILIES (CONTINUED)",null,null,null,null,null,null,null,null,null,null,null,null,null,null,null,"E.  PROGRAMS AND SERVICES FOR ELs AND THEIR FAMILIES (CONTINUED)",null,null,null,null,null,null,null,null,null,null,null,null,null,null,null,"E.  PROGRAMS AND SERVICES FOR ELs AND THEIR FAMILIES (CONTINUED)",null,null,null,null,null,null,null,null,null,null,null,null,null,null,null,"E.  PROGRAMS AND SERVICES FOR ELs AND THEIR FAMILIES (CONTINUED)",null,null,null,null,null,null,null,null,null,null,null,null,null,null,null,"E.  PROGRAMS AND SERVICES FOR ELs AND THEIR FAMILIES (CONTINUED)",null,null,null,null,null,null,null,null,null,null,null,null,null,null,null,"E.  PROGRAMS AND SERVICES FOR ELs AND THEIR FAMILIES (CONTINUED)",null,null,null,null,null,null,null,null,null,null,null,null,null,null,null,"E.  PROGRAMS AND SERVICES FOR ELs AND THEIR FAMILIES (CONTINUED)",null,null,null,null,null,null,null,null,null,null,null,null,null,null,null,"E.  PROGRAMS AND SERVICES FOR ELs AND THEIR FAMILIES (CONTINUED)",null,null,null,null,null,null,null,null,null,null,null,null,null,null,null,"E.  PROGRAMS AND SERVICES FOR ELs AND THEIR FAMILIES (CONTINUED)",null,null,null,null,null,null,null,null,null,null,null,null,null,null,null,"E.  PROGRAMS AND SERVICES FOR ELs AND THEIR FAMILIES (CONTINUED)",null,null,null,null,null,null,null,null,null,null,null,null,null,null,null,"E.  PROGRAMS AND SERVICES FOR ELs AND THEIR FAMILIES (CONTINUED)",null,null,null,null,null,null,null,null,null,null,null,null,null,null,null,"E.  PROGRAMS AND SERVICES FOR ELs AND THEIR FAMILIES (CONTINUED)",null,null,null,null,null,null,null,null,null,null,null,null,null,null,null,"E.  PROGRAMS AND SERVICES FOR ELs AND THEIR FAMILIES (CONTINUED)",null,null,null,null,null,null,null,null,null,null,null,null,null,null,null,"E.  PROGRAMS AND SERVICES FOR ELs AND THEIR FAMILIES (CONTINUED)",null,null,null,null,null,null,null,null,null,null,null,null,null,null,null,"E.  PROGRAMS AND SERVICES FOR ELs AND THEIR FAMILIES (CONTINUED)",null,null,null,null,null,null,null,null,null,null,null,null,null,null,null,"E.  PROGRAMS AND SERVICES FOR ELs AND THEIR FAMILIES (CONTINUED)",null,null,null,null,null,null,null,null,null,null,null,null,null,null,null,"E.  PROGRAMS AND SERVICES FOR ELs AND THEIR FAMILIES (CONTINUED)",null,null,null,null,null,null,null,null,null,null,null,null,null,null,null,"E.  PROGRAMS AND SERVICES FOR ELs AND THEIR FAMILIES (CONTINUED)",null,null,null,null,null,null,null,null,null,null,null,null,null,null,null,"E.  PROGRAMS AND SERVICES FOR ELs AND THEIR FAMILIES (CONTINUED)",null,null,null,null,null,null,null,null,null,null,null,null,null,null,null,"E.  PROGRAMS AND SERVICES FOR ELs AND THEIR FAMILIES (CONTINUED)",null,null,null,null,null,null,null,null,null,null,null,null,null,null,null,"E.  PROGRAMS AND SERVICES FOR ELs AND THEIR FAMILIES (CONTINUED)",null,null,null,null,null,null,null,null,null,null,null,null,null,null,null,"E.  PROGRAMS AND SERVICES FOR ELs AND THEIR FAMILIES (CONTINUED)",null,null,null,null,null,null,null,null,null,null,null,null,null,null,null,"E.  PROGRAMS AND SERVICES FOR ELs AND THEIR FAMILIES (CONTINUED)",null,null,null,null,null,null,null,null,null,null,null,null,null,null,null,"E.  PROGRAMS AND SERVICES FOR ELs AND THEIR FAMILIES (CONTINUED)",null,null,null,null,null,null,null,null,null,null,null,null,null,null,null,"E.  PROGRAMS AND SERVICES FOR ELs AND THEIR FAMILIES (CONTINUED)",null,null,null,null,null,null,null,null,null,null,null,null,null,null,null,"E.  PROGRAMS AND SERVICES FOR ELs AND THEIR FAMILIES (CONTINUED)",null,null,null,null,null,null,null,null,null,null,null,null,null,null,null,"E.  PROGRAMS AND SERVICES FOR ELs AND THEIR FAMILIES (CONTINUED)",null,null,null,null,null,null,null,null,null,null,null,null,null,null,null,"E.  PROGRAMS AND SERVICES FOR ELs AND THEIR FAMILIES (CONTINUED)",null,null,null,null,null,null,null,null,null,null,null,null,null,null,null,"E.  PROGRAMS AND SERVICES FOR ELs AND THEIR FAMILIES (CONTINUED)",null,null,null,null,null,null,null,null,null,null,null,null,null,null,null,"E.  PROGRAMS AND SERVICES FOR ELs AND THEIR FAMILIES (CONTINUED)",null,null,null,null,null,null,null,null,null,null,null,null,null,null,null,"E.  PROGRAMS AND SERVICES FOR ELs AND THEIR FAMILIES (CONTINUED)",null,null,null,null,null,null,null,null,null,null,null,null,null,null,null,"E.  PROGRAMS AND SERVICES FOR ELs AND THEIR FAMILIES (CONTINUED)",null,null,null,null,null,null,null,null,null,null,null,null,null,null,null,"E.  PROGRAMS AND SERVICES FOR ELs AND THEIR FAMILIES (CONTINUED)",null,null,null,null,null,null,null,null,null,null,null,null,null,null,null,"E.  PROGRAMS AND SERVICES FOR ELs AND THEIR FAMILIES (CONTINUED)",null,null,null,null,null,null,null,null,null,null,null,null,null,null,null,"E.  PROGRAMS AND SERVICES FOR ELs AND THEIR FAMILIES (CONTINUED)",null,null,null,null,null,null,null,null,null,null,null,null,null,null,null,"E.  PROGRAMS AND SERVICES FOR ELs AND THEIR FAMILIES (CONTINUED)",null,null,null,null,null,null,null,null,null,null,null,null,null,null,null,"E.  PROGRAMS AND SERVICES FOR ELs AND THEIR FAMILIES (CONTINUED)",null,null,null,null,null,null,null,null,null,null,null,null,null,null,null,"E.  PROGRAMS AND SERVICES FOR ELs AND THEIR FAMILIES (CONTINUED)",null,null,null,null,null,null,null,null,null,null,null,null,null,null,null,"E.  PROGRAMS AND SERVICES FOR ELs AND THEIR FAMILIES (CONTINUED)",null,null,null,null,null,null,null,null,null,null,null,null,null,null,null,"E.  PROGRAMS AND SERVICES FOR ELs AND THEIR FAMILIES (CONTINUED)",null,null,null,null,null,null,null,null,null,null,null,null,null,null,null,"E.  PROGRAMS AND SERVICES FOR ELs AND THEIR FAMILIES (CONTINUED)",null,null,null,null,null,null,null,null,null,null,null,null,null,null,null,"E.  PROGRAMS AND SERVICES FOR ELs AND THEIR FAMILIES (CONTINUED)",null,null,null,null,null,null,null,null,null,null,null,null,null,null,null,"E.  PROGRAMS AND SERVICES FOR ELs AND THEIR FAMILIES (CONTINUED)",null,null,null,null,null,null,null,null,null,null,null,null,null,null,null,"E.  PROGRAMS AND SERVICES FOR ELs AND THEIR FAMILIES (CONTINUED)",null,null,null,null,null,null,null,null,null,null,null,null,null,null,null,"E.  PROGRAMS AND SERVICES FOR ELs AND THEIR FAMILIES (CONTINUED)",null,null,null,null,null,null,null,null,null,null,null,null,null,null,null,"E.  PROGRAMS AND SERVICES FOR ELs AND THEIR FAMILIES (CONTINUED)",null,null,null,null,null,null,null,null,null,null,null,null,null,null,null,"E.  PROGRAMS AND SERVICES FOR ELs AND THEIR FAMILIES (CONTINUED)",null,null,null,null,null,null,null,null,null,null,null,null,null,null,null,"E.  PROGRAMS AND SERVICES FOR ELs AND THEIR FAMILIES (CONTINUED)",null,null,null,null,null,null,null,null,null,null,null,null,null,null,null,"E.  PROGRAMS AND SERVICES FOR ELs AND THEIR FAMILIES (CONTINUED)",null,null,null,null,null,null,null,null,null,null,null,null,null,null,null,"E.  PROGRAMS AND SERVICES FOR ELs AND THEIR FAMILIES (CONTINUED)",null,null,null,null,null,null,null,null,null,null,null,null,null,null,null,"E.  PROGRAMS AND SERVICES FOR ELs AND THEIR FAMILIES (CONTINUED)",null,null,null,null,null,null,null,null,null,null,null,null,null,null,null,"E.  PROGRAMS AND SERVICES FOR ELs AND THEIR FAMILIES (CONTINUED)",null,null,null,null,null,null,null,null,null,null,null,null,null,null,null,"E.  PROGRAMS AND SERVICES FOR ELs AND THEIR FAMILIES (CONTINUED)",null,null,null,null,null,null,null,null,null,null,null,null,null,null,null,"E.  PROGRAMS AND SERVICES FOR ELs AND THEIR FAMILIES (CONTINUED)",null,null,null,null,null,null,null,null,null,null,null,null,null,null,null,"E.  PROGRAMS AND SERVICES FOR ELs AND THEIR FAMILIES (CONTINUED)",null,null,null,null,null,null,null,null,null,null,null,null,null,null,null,"E.  PROGRAMS AND SERVICES FOR ELs AND THEIR FAMILIES (CONTINUED)",null,null,null,null,null,null,null,null,null,null,null,null,null,null,null,"E.  PROGRAMS AND SERVICES FOR ELs AND THEIR FAMILIES (CONTINUED)",null,null,null,null,null,null,null,null,null,null,null,null,null,null,null,"E.  PROGRAMS AND SERVICES FOR ELs AND THEIR FAMILIES (CONTINUED)",null,null,null,null,null,null,null,null,null,null,null,null,null,null,null,"E.  PROGRAMS AND SERVICES FOR ELs AND THEIR FAMILIES (CONTINUED)",null,null,null,null,null,null,null,null,null,null,null,null,null,null,null,"E.  PROGRAMS AND SERVICES FOR ELs AND THEIR FAMILIES (CONTINUED)",null,null,null,null,null,null,null,null,null,null,null,null,null,null,null,"E.  PROGRAMS AND SERVICES FOR ELs AND THEIR FAMILIES (CONTINUED)",null,null,null,null,null,null,null,null,null,null,null,null,null,null,null,"E.  PROGRAMS AND SERVICES FOR ELs AND THEIR FAMILIES (CONTINUED)",null,null,null,null,null,null,null,null,null,null,null,null,null,null,null,"E.  PROGRAMS AND SERVICES FOR ELs AND THEIR FAMILIES (CONTINUED)",null,null,null,null,null,null,null,null,null,null,null,null,null,null,null,"E.  PROGRAMS AND SERVICES FOR ELs AND THEIR FAMILIES (CONTINUED)",null,null,null,null,null,null,null,null,null,null,null,null,null,null,null,"E.  PROGRAMS AND SERVICES FOR ELs AND THEIR FAMILIES (CONTINUED)",null,null,null,null,null,null,null,null,null,null,null,null,null,null,null,"E.  PROGRAMS AND SERVICES FOR ELs AND THEIR FAMILIES (CONTINUED)",null,null,null,null,null,null,null,null,null,null,null,null,null,null,null,"E.  PROGRAMS AND SERVICES FOR ELs AND THEIR FAMILIES (CONTINUED)",null,null,null,null,null,null,null,null,null,null,null,null,null,null,null,"E.  PROGRAMS AND SERVICES FOR ELs AND THEIR FAMILIES (CONTINUED)",null,null,null,null,null,null,null,null,null,null,null,null,null,null,null,"E.  PROGRAMS AND SERVICES FOR ELs AND THEIR FAMILIES (CONTINUED)",null,null,null,null,null,null,null,null,null,null,null,null,null,null,null,"E.  PROGRAMS AND SERVICES FOR ELs AND THEIR FAMILIES (CONTINUED)",null,null,null,null,null,null,null,null,null,null,null,null,null,null,null,"E.  PROGRAMS AND SERVICES FOR ELs AND THEIR FAMILIES (CONTINUED)",null,null,null,null,null,null,null,null,null,null,null,null,null,null,null,"E.  PROGRAMS AND SERVICES FOR ELs AND THEIR FAMILIES (CONTINUED)",null,null,null,null,null,null,null,null,null,null,null,null,null,null,null,"E.  PROGRAMS AND SERVICES FOR ELs AND THEIR FAMILIES (CONTINUED)",null,null,null,null,null,null,null,null,null,null,null,null,null,null,null,"E.  PROGRAMS AND SERVICES FOR ELs AND THEIR FAMILIES (CONTINUED)",null,null,null,null,null,null,null,null,null,null,null,null,null,null,null,"E.  PROGRAMS AND SERVICES FOR ELs AND THEIR FAMILIES (CONTINUED)",null,null,null,null,null,null,null,null,null,null,null,null,null,null,null,"E.  PROGRAMS AND SERVICES FOR ELs AND THEIR FAMILIES (CONTINUED)",null,null,null,null,null,null,null,null,null,null,null,null,null,null,null,"E.  PROGRAMS AND SERVICES FOR ELs AND THEIR FAMILIES (CONTINUED)",null,null,null,null,null,null,null,null,null,null,null,null,null,null,null,"E.  PROGRAMS AND SERVICES FOR ELs AND THEIR FAMILIES (CONTINUED)",null,null,null,null,null,null,null,null,null,null,null,null,null,null,null,"E.  PROGRAMS AND SERVICES FOR ELs AND THEIR FAMILIES (CONTINUED)",null,null,null,null,null,null,null,null,null,null,null,null,null,null,null,"E.  PROGRAMS AND SERVICES FOR ELs AND THEIR FAMILIES (CONTINUED)",null,null,null,null,null,null,null,null,null,null,null,null,null,null,null,"E.  PROGRAMS AND SERVICES FOR ELs AND THEIR FAMILIES (CONTINUED)",null,null,null,null,null,null,null,null,null,null,null,null,null,null,null,"E.  PROGRAMS AND SERVICES FOR ELs AND THEIR FAMILIES (CONTINUED)",null,null,null,null,null,null,null,null,null,null,null,null,null,null,null,"E.  PROGRAMS AND SERVICES FOR ELs AND THEIR FAMILIES (CONTINUED)",null,null,null,null,null,null,null,null,null,null,null,null,null,null,null,"E.  PROGRAMS AND SERVICES FOR ELs AND THEIR FAMILIES (CONTINUED)",null,null,null,null,null,null,null,null,null,null,null,null,null,null,null,"E.  PROGRAMS AND SERVICES FOR ELs AND THEIR FAMILIES (CONTINUED)",null,null,null,null,null,null,null,null,null,null,null,null,null,null,null,"E.  PROGRAMS AND SERVICES FOR ELs AND THEIR FAMILIES (CONTINUED)",null,null,null,null,null,null,null,null,null,null,null,null,null,null,null,"E.  PROGRAMS AND SERVICES FOR ELs AND THEIR FAMILIES (CONTINUED)",null,null,null,null,null,null,null,null,null,null,null,null,null,null,null,"E.  PROGRAMS AND SERVICES FOR ELs AND THEIR FAMILIES (CONTINUED)",null,null,null,null,null,null,null,null,null,null,null,null,null,null,null,"E.  PROGRAMS AND SERVICES FOR ELs AND THEIR FAMILIES (CONTINUED)",null,null,null,null,null,null,null,null,null,null,null,null,null,null,null,"E.  PROGRAMS AND SERVICES FOR ELs AND THEIR FAMILIES (CONTINUED)",null,null,null,null,null,null,null,null,null,null,null,null,null,null,null,"E.  PROGRAMS AND SERVICES FOR ELs AND THEIR FAMILIES (CONTINUED)",null,null,null,null,null,null,null,null,null,null,null,null,null,null,null,"E.  PROGRAMS AND SERVICES FOR ELs AND THEIR FAMILIES (CONTINUED)",null,null,null,null,null,null,null,null,null,null,null,null,null,null,null,"E.  PROGRAMS AND SERVICES FOR ELs AND THEIR FAMILIES (CONTINUED)",null,null,null,null,null,null,null,null,null,null,null,null,null,null,null,"E.  PROGRAMS AND SERVICES FOR ELs AND THEIR FAMILIES (CONTINUED)",null,null,null,null,null,null,null,null,null,null,null,null,null,null,null,"E.  PROGRAMS AND SERVICES FOR ELs AND THEIR FAMILIES (CONTINUED)",null,null,null,null,null,null,null,null,null,null,null,null,null,null,null,"E.  PROGRAMS AND SERVICES FOR ELs AND THEIR FAMILIES (CONTINUED)",null,null,null,null,null,null,null,null,null,null,null,null,null,null,null,"E.  PROGRAMS AND SERVICES FOR ELs AND THEIR FAMILIES (CONTINUED)",null,null,null,null,null,null,null,null,null,null,null,null,null,null,null,"E.  PROGRAMS AND SERVICES FOR ELs AND THEIR FAMILIES (CONTINUED)",null,null,null,null,null,null,null,null,null,null,null,null,null,null,null,"E.  PROGRAMS AND SERVICES FOR ELs AND THEIR FAMILIES (CONTINUED)",null,null,null,null,null,null,null,null,null,null,null,null,null,null,null,"E.  PROGRAMS AND SERVICES FOR ELs AND THEIR FAMILIES (CONTINUED)",null,null,null,null,null,null,null,null,null,null,null,null,null,null,null,"E.  PROGRAMS AND SERVICES FOR ELs AND THEIR FAMILIES (CONTINUED)",null,null,null,null,null,null,null,null,null,null,null,null,null,null,null,"E.  PROGRAMS AND SERVICES FOR ELs AND THEIR FAMILIES (CONTINUED)",null,null,null,null,null,null,null,null,null,null,null,null,null,null,null,"E.  PROGRAMS AND SERVICES FOR ELs AND THEIR FAMILIES (CONTINUED)",null,null,null,null,null,null,null,null,null,null,null,null,null,null,null,"E.  PROGRAMS AND SERVICES FOR ELs AND THEIR FAMILIES (CONTINUED)",null,null,null,null,null,null,null,null,null,null,null,null,null,null,null,"E.  PROGRAMS AND SERVICES FOR ELs AND THEIR FAMILIES (CONTINUED)",null,null,null,null,null,null,null,null,null,null,null,null,null,null,null,"E.  PROGRAMS AND SERVICES FOR ELs AND THEIR FAMILIES (CONTINUED)",null,null,null,null,null,null,null,null,null,null,null,null,null,null,null,"E.  PROGRAMS AND SERVICES FOR ELs AND THEIR FAMILIES (CONTINUED)",null,null,null,null,null,null,null,null,null,null,null,null,null,null,null,"E.  PROGRAMS AND SERVICES FOR ELs AND THEIR FAMILIES (CONTINUED)",null,null,null,null,null,null,null,null,null,null,null,null,null,null,null,"E.  PROGRAMS AND SERVICES FOR ELs AND THEIR FAMILIES (CONTINUED)",null,null,null,null,null,null,null,null,null,null,null,null,null,null,null,"E.  PROGRAMS AND SERVICES FOR ELs AND THEIR FAMILIES (CONTINUED)",null,null,null,null,null,null,null,null,null,null,null,null,null,null,null,"E.  PROGRAMS AND SERVICES FOR ELs AND THEIR FAMILIES (CONTINUED)",null,null,null,null,null,null,null,null,null,null,null,null,null,null,null,"E.  PROGRAMS AND SERVICES FOR ELs AND THEIR FAMILIES (CONTINUED)",null,null,null,null,null,null,null,null,null,null,null,null,null,null,null,"E.  PROGRAMS AND SERVICES FOR ELs AND THEIR FAMILIES (CONTINUED)",null,null,null,null,null,null,null,null,null,null,null,null,null,null,null,"E.  PROGRAMS AND SERVICES FOR ELs AND THEIR FAMILIES (CONTINUED)",null,null,null,null,null,null,null,null,null,null,null,null,null,null,null,"E.  PROGRAMS AND SERVICES FOR ELs AND THEIR FAMILIES (CONTINUED)",null,null,null,null,null,null,null,null,null,null,null,null,null,null,null,"E.  PROGRAMS AND SERVICES FOR ELs AND THEIR FAMILIES (CONTINUED)",null,null,null,null,null,null,null,null,null,null,null,null,null,null,null,"E.  PROGRAMS AND SERVICES FOR ELs AND THEIR FAMILIES (CONTINUED)",null,null,null,null,null,null,null,null,null,null,null,null,null,null,null,"E.  PROGRAMS AND SERVICES FOR ELs AND THEIR FAMILIES (CONTINUED)",null,null,null,null,null,null,null,null,null,null,null,null,null,null,null,"E.  PROGRAMS AND SERVICES FOR ELs AND THEIR FAMILIES (CONTINUED)",null,null,null,null,null,null,null,null,null,null,null,null,null,null,null,"E.  PROGRAMS AND SERVICES FOR ELs AND THEIR FAMILIES (CONTINUED)",null,null,null,null,null,null,null,null,null,null,null,null,null,null,null,"E.  PROGRAMS AND SERVICES FOR ELs AND THEIR FAMILIES (CONTINUED)",null,null,null,null,null,null,null,null,null,null,null,null,null,null,null,"E.  PROGRAMS AND SERVICES FOR ELs AND THEIR FAMILIES (CONTINUED)",null,null,null,null,null,null,null,null,null,null,null,null,null,null,null,"E.  PROGRAMS AND SERVICES FOR ELs AND THEIR FAMILIES (CONTINUED)",null,null,null,null,null,null,null,null,null,null,null,null,null,null,null,"E.  PROGRAMS AND SERVICES FOR ELs AND THEIR FAMILIES (CONTINUED)",null,null,null,null,null,null,null,null,null,null,null,null,null,null,null,"E.  PROGRAMS AND SERVICES FOR ELs AND THEIR FAMILIES (CONTINUED)",null,null,null,null,null,null,null,null,null,null,null,null,null,null,null,"E.  PROGRAMS AND SERVICES FOR ELs AND THEIR FAMILIES (CONTINUED)",null,null,null,null,null,null,null,null,null,null,null,null,null,null,null,"E.  PROGRAMS AND SERVICES FOR ELs AND THEIR FAMILIES (CONTINUED)",null,null,null,null,null,null,null,null,null,null,null,null,null,null,null,"E.  PROGRAMS AND SERVICES FOR ELs AND THEIR FAMILIES (CONTINUED)",null,null,null,null,null,null,null,null,null,null,null,null,null,null,null,"E.  PROGRAMS AND SERVICES FOR ELs AND THEIR FAMILIES (CONTINUED)",null,null,null,null,null,null,null,null,null,null,null,null,null,null,null,"E.  PROGRAMS AND SERVICES FOR ELs AND THEIR FAMILIES (CONTINUED)",null,null,null,null,null,null,null,null,null,null,null,null,null,null,null,"E.  PROGRAMS AND SERVICES FOR ELs AND THEIR FAMILIES (CONTINUED)",null,null,null,null,null,null,null,null,null,null,null,null,null,null,null,"E.  PROGRAMS AND SERVICES FOR ELs AND THEIR FAMILIES (CONTINUED)",null,null,null,null,null,null,null,null,null,null,null,null,null,null,null,"E.  PROGRAMS AND SERVICES FOR ELs AND THEIR FAMILIES (CONTINUED)",null,null,null,null,null,null,null,null,null,null,null,null,null,null,null,"E.  PROGRAMS AND SERVICES FOR ELs AND THEIR FAMILIES (CONTINUED)",null,null,null,null,null,null,null,null,null,null,null,null,null,null,null,"E.  PROGRAMS AND SERVICES FOR ELs AND THEIR FAMILIES (CONTINUED)",null,null,null,null,null,null,null,null,null,null,null,null,null,null,null,"E.  PROGRAMS AND SERVICES FOR ELs AND THEIR FAMILIES (CONTINUED)",null,null,null,null,null,null,null,null,null,null,null,null,null,null,null,"E.  PROGRAMS AND SERVICES FOR ELs AND THEIR FAMILIES (CONTINUED)",null,null,null,null,null,null,null,null,null,null,null,null,null,null,null,"E.  PROGRAMS AND SERVICES FOR ELs AND THEIR FAMILIES (CONTINUED)",null,null,null,null,null,null,null,null,null,null,null,null,null,null,null,"E.  PROGRAMS AND SERVICES FOR ELs AND THEIR FAMILIES (CONTINUED)",null,null,null,null,null,null,null,null,null,null,null,null,null,null,null,"E.  PROGRAMS AND SERVICES FOR ELs AND THEIR FAMILIES (CONTINUED)",null,null,null,null,null,null,null,null,null,null,null,null,null,null,null,"E.  PROGRAMS AND SERVICES FOR ELs AND THEIR FAMILIES (CONTINUED)",null,null,null,null,null,null,null,null,null,null,null,null,null,null,null,"E.  PROGRAMS AND SERVICES FOR ELs AND THEIR FAMILIES (CONTINUED)",null,null,null,null,null,null,null,null,null,null,null,null,null,null,null,"E.  PROGRAMS AND SERVICES FOR ELs AND THEIR FAMILIES (CONTINUED)",null,null,null,null,null,null,null,null,null,null,null,null,null,null,null,"E.  PROGRAMS AND SERVICES FOR ELs AND THEIR FAMILIES (CONTINUED)",null,null,null,null,null,null,null,null,null,null,null,null,null,null,null,"E.  PROGRAMS AND SERVICES FOR ELs AND THEIR FAMILIES (CONTINUED)",null,null,null,null,null,null,null,null,null,null,null,null,null,null,null,"E.  PROGRAMS AND SERVICES FOR ELs AND THEIR FAMILIES (CONTINUED)",null,null,null,null,null,null,null,null,null,null,null,null,null,null,null,"E.  PROGRAMS AND SERVICES FOR ELs AND THEIR FAMILIES (CONTINUED)",null,null,null,null,null,null,null,null,null,null,null,null,null,null,null,"E.  PROGRAMS AND SERVICES FOR ELs AND THEIR FAMILIES (CONTINUED)",null,null,null,null,null,null,null,null,null,null,null,null,null,null,null,"E.  PROGRAMS AND SERVICES FOR ELs AND THEIR FAMILIES (CONTINUED)",null,null,null,null,null,null,null,null,null,null,null,null,null,null,null,"E.  PROGRAMS AND SERVICES FOR ELs AND THEIR FAMILIES (CONTINUED)",null,null,null,null,null,null,null,null,null,null,null,null,null,null,null,"E.  PROGRAMS AND SERVICES FOR ELs AND THEIR FAMILIES (CONTINUED)",null,null,null,null,null,null,null,null,null,null,null,null,null,null,null,"E.  PROGRAMS AND SERVICES FOR ELs AND THEIR FAMILIES (CONTINUED)",null,null,null,null,null,null,null,null,null,null,null,null,null,null,null,"E.  PROGRAMS AND SERVICES FOR ELs AND THEIR FAMILIES (CONTINUED)",null,null,null,null,null,null,null,null,null,null,null,null,null,null,null,"E.  PROGRAMS AND SERVICES FOR ELs AND THEIR FAMILIES (CONTINUED)",null,null,null,null,null,null,null,null,null,null,null,null,null,null,null,"E.  PROGRAMS AND SERVICES FOR ELs AND THEIR FAMILIES (CONTINUED)",null,null,null,null,null,null,null,null,null,null,null,null,null,null,null,"E.  PROGRAMS AND SERVICES FOR ELs AND THEIR FAMILIES (CONTINUED)",null,null,null,null,null,null,null,null,null,null,null,null,null,null,null,"E.  PROGRAMS AND SERVICES FOR ELs AND THEIR FAMILIES (CONTINUED)",null,null,null,null,null,null,null,null,null,null,null,null,null,null,null,"E.  PROGRAMS AND SERVICES FOR ELs AND THEIR FAMILIES (CONTINUED)",null,null,null,null,null,null,null,null,null,null,null,null,null,null,null,"E.  PROGRAMS AND SERVICES FOR ELs AND THEIR FAMILIES (CONTINUED)",null,null,null,null,null,null,null,null,null,null,null,null,null,null,null,"E.  PROGRAMS AND SERVICES FOR ELs AND THEIR FAMILIES (CONTINUED)",null,null,null,null,null,null,null,null,null,null,null,null,null,null,null,"E.  PROGRAMS AND SERVICES FOR ELs AND THEIR FAMILIES (CONTINUED)",null,null,null,null,null,null,null,null,null,null,null,null,null,null,null,"E.  PROGRAMS AND SERVICES FOR ELs AND THEIR FAMILIES (CONTINUED)",null,null,null,null,null,null,null,null,null,null,null,null,null,null,null,"E.  PROGRAMS AND SERVICES FOR ELs AND THEIR FAMILIES (CONTINUED)",null,null,null,null,null,null,null,null,null,null,null,null,null,null,null,"E.  PROGRAMS AND SERVICES FOR ELs AND THEIR FAMILIES (CONTINUED)",null,null,null,null,null,null,null,null,null,null,null,null,null,null,null,"E.  PROGRAMS AND SERVICES FOR ELs AND THEIR FAMILIES (CONTINUED)",null,null,null,null,null,null,null,null,null,null,null,null,null,null,null,"E.  PROGRAMS AND SERVICES FOR ELs AND THEIR FAMILIES (CONTINUED)",null,null,null,null,null,null,null,null,null,null,null,null,null,null,null,"E.  PROGRAMS AND SERVICES FOR ELs AND THEIR FAMILIES (CONTINUED)",null,null,null,null,null,null,null,null,null,null,null,null,null,null,null,"E.  PROGRAMS AND SERVICES FOR ELs AND THEIR FAMILIES (CONTINUED)",null,null,null,null,null,null,null,null,null,null,null,null,null,null,null,"E.  PROGRAMS AND SERVICES FOR ELs AND THEIR FAMILIES (CONTINUED)",null,null,null,null,null,null,null,null,null,null,null,null,null,null,null,"E.  PROGRAMS AND SERVICES FOR ELs AND THEIR FAMILIES (CONTINUED)",null,null,null,null,null,null,null,null,null,null,null,null,null,null,null,"E.  PROGRAMS AND SERVICES FOR ELs AND THEIR FAMILIES (CONTINUED)",null,null,null,null,null,null,null,null,null,null,null,null,null,null,null,"E.  PROGRAMS AND SERVICES FOR ELs AND THEIR FAMILIES (CONTINUED)",null,null,null,null,null,null,null,null,null,null,null,null,null,null,null,"E.  PROGRAMS AND SERVICES FOR ELs AND THEIR FAMILIES (CONTINUED)",null,null,null,null,null,null,null,null,null,null,null,null,null,null,null,"E.  PROGRAMS AND SERVICES FOR ELs AND THEIR FAMILIES (CONTINUED)",null,null,null,null,null,null,null,null,null,null,null,null,null,null,null,"E.  PROGRAMS AND SERVICES FOR ELs AND THEIR FAMILIES (CONTINUED)",null,null,null,null,null,null,null,null,null,null,null,null,null,null,null,"E.  PROGRAMS AND SERVICES FOR ELs AND THEIR FAMILIES (CONTINUED)",null,null,null,null,null,null,null,null,null,null,null,null,null,null,null,"E.  PROGRAMS AND SERVICES FOR ELs AND THEIR FAMILIES (CONTINUED)",null,null,null,null,null,null,null,null,null,null,null,null,null,null,null,"E.  PROGRAMS AND SERVICES FOR ELs AND THEIR FAMILIES (CONTINUED)",null,null,null,null,null,null,null,null,null,null,null,null,null,null,null,"E.  PROGRAMS AND SERVICES FOR ELs AND THEIR FAMILIES (CONTINUED)",null,null,null,null,null,null,null,null,null,null,null,null,null,null,null,"E.  PROGRAMS AND SERVICES FOR ELs AND THEIR FAMILIES (CONTINUED)",null,null,null,null,null,null,null,null,null,null,null,null,null,null,null,"E.  PROGRAMS AND SERVICES FOR ELs AND THEIR FAMILIES (CONTINUED)",null,null,null,null,null,null,null,null,null,null,null,null,null,null,null,"E.  PROGRAMS AND SERVICES FOR ELs AND THEIR FAMILIES (CONTINUED)",null,null,null,null,null,null,null,null,null,null,null,null,null,null,null,"E.  PROGRAMS AND SERVICES FOR ELs AND THEIR FAMILIES (CONTINUED)",null,null,null,null,null,null,null,null,null,null,null,null,null,null,null,"E.  PROGRAMS AND SERVICES FOR ELs AND THEIR FAMILIES (CONTINUED)",null,null,null,null,null,null,null,null,null,null,null,null,null,null,null,"E.  PROGRAMS AND SERVICES FOR ELs AND THEIR FAMILIES (CONTINUED)",null,null,null,null,null,null,null,null,null,null,null,null,null,null,null,"E.  PROGRAMS AND SERVICES FOR ELs AND THEIR FAMILIES (CONTINUED)",null,null,null,null,null,null,null,null,null,null,null,null,null,null,null,"E.  PROGRAMS AND SERVICES FOR ELs AND THEIR FAMILIES (CONTINUED)",null,null,null,null,null,null,null,null,null,null,null,null,null,null,null,"E.  PROGRAMS AND SERVICES FOR ELs AND THEIR FAMILIES (CONTINUED)",null,null,null,null,null,null,null,null,null,null,null,null,null,null,null,"E.  PROGRAMS AND SERVICES FOR ELs AND THEIR FAMILIES (CONTINUED)",null,null,null,null,null,null,null,null,null,null,null,null,null,null,null,"E.  PROGRAMS AND SERVICES FOR ELs AND THEIR FAMILIES (CONTINUED)",null,null,null,null,null,null,null,null,null,null,null,null,null,null,null,"E.  PROGRAMS AND SERVICES FOR ELs AND THEIR FAMILIES (CONTINUED)",null,null,null,null,null,null,null,null,null,null,null,null,null,null,null,"E.  PROGRAMS AND SERVICES FOR ELs AND THEIR FAMILIES (CONTINUED)",null,null,null,null,null,null,null,null,null,null,null,null,null,null,null,"E.  PROGRAMS AND SERVICES FOR ELs AND THEIR FAMILIES (CONTINUED)",null,null,null,null,null,null,null,null,null,null,null,null,null,null,null,"E.  PROGRAMS AND SERVICES FOR ELs AND THEIR FAMILIES (CONTINUED)",null,null,null,null,null,null,null,null,null,null,null,null,null,null,null,"E.  PROGRAMS AND SERVICES FOR ELs AND THEIR FAMILIES (CONTINUED)",null,null,null,null,null,null,null,null,null,null,null,null,null,null,null,"E.  PROGRAMS AND SERVICES FOR ELs AND THEIR FAMILIES (CONTINUED)",null,null,null,null,null,null,null,null,null,null,null,null,null,null,null,"E.  PROGRAMS AND SERVICES FOR ELs AND THEIR FAMILIES (CONTINUED)",null,null,null,null,null,null,null,null,null,null,null,null,null,null,null,"E.  PROGRAMS AND SERVICES FOR ELs AND THEIR FAMILIES (CONTINUED)",null,null,null,null,null,null,null,null,null,null,null,null,null,null,null,"E.  PROGRAMS AND SERVICES FOR ELs AND THEIR FAMILIES (CONTINUED)",null,null,null,null,null,null,null,null,null,null,null,null,null,null,null,"E.  PROGRAMS AND SERVICES FOR ELs AND THEIR FAMILIES (CONTINUED)",null,null,null,null,null,null,null,null,null,null,null,null,null,null,null,"E.  PROGRAMS AND SERVICES FOR ELs AND THEIR FAMILIES (CONTINUED)",null,null,null,null,null,null,null,null,null,null,null,null,null,null,null,"E.  PROGRAMS AND SERVICES FOR ELs AND THEIR FAMILIES (CONTINUED)",null,null,null,null,null,null,null,null,null,null,null,null,null,null,null,"E.  PROGRAMS AND SERVICES FOR ELs AND THEIR FAMILIES (CONTINUED)",null,null,null,null,null,null,null,null,null,null,null,null,null,null,null,"E.  PROGRAMS AND SERVICES FOR ELs AND THEIR FAMILIES (CONTINUED)",null,null,null,null,null,null,null,null,null,null,null,null,null,null,null,"E.  PROGRAMS AND SERVICES FOR ELs AND THEIR FAMILIES (CONTINUED)",null,null,null,null,null,null,null,null,null,null,null,null,null,null,null,"E.  PROGRAMS AND SERVICES FOR ELs AND THEIR FAMILIES (CONTINUED)",null,null,null,null,null,null,null,null,null,null,null,null,null,null,null,"E.  PROGRAMS AND SERVICES FOR ELs AND THEIR FAMILIES (CONTINUED)",null,null,null,null,null,null,null,null,null,null,null,null,null,null,null,"E.  PROGRAMS AND SERVICES FOR ELs AND THEIR FAMILIES (CONTINUED)",null,null,null,null,null,null,null,null,null,null,null,null,null,null,null,"E.  PROGRAMS AND SERVICES FOR ELs AND THEIR FAMILIES (CONTINUED)",null,null,null,null,null,null,null,null,null,null,null,null,null,null,null,"E.  PROGRAMS AND SERVICES FOR ELs AND THEIR FAMILIES (CONTINUED)",null,null,null,null,null,null,null,null,null,null,null,null,null,null,null,"E.  PROGRAMS AND SERVICES FOR ELs AND THEIR FAMILIES (CONTINUED)",null,null,null,null,null,null,null,null,null,null,null,null,null,null,null,"E.  PROGRAMS AND SERVICES FOR ELs AND THEIR FAMILIES (CONTINUED)",null,null,null,null,null,null,null,null,null,null,null,null,null,null,null,"E.  PROGRAMS AND SERVICES FOR ELs AND THEIR FAMILIES (CONTINUED)",null,null,null,null,null,null,null,null,null,null,null,null,null,null,null,"E.  PROGRAMS AND SERVICES FOR ELs AND THEIR FAMILIES (CONTINUED)",null,null,null,null,null,null,null,null,null,null,null,null,null,null,null,"E.  PROGRAMS AND SERVICES FOR ELs AND THEIR FAMILIES (CONTINUED)",null,null,null,null,null,null,null,null,null,null,null,null,null,null,null,"E.  PROGRAMS AND SERVICES FOR ELs AND THEIR FAMILIES (CONTINUED)",null,null,null,null,null,null,null,null,null,null,null,null,null,null,null,"E.  PROGRAMS AND SERVICES FOR ELs AND THEIR FAMILIES (CONTINUED)",null,null,null,null,null,null,null,null,null,null,null,null,null,null,null,"E.  PROGRAMS AND SERVICES FOR ELs AND THEIR FAMILIES (CONTINUED)",null,null,null,null,null,null,null,null,null,null,null,null,null,null,null,"E.  PROGRAMS AND SERVICES FOR ELs AND THEIR FAMILIES (CONTINUED)",null,null,null,null,null,null,null,null,null,null,null,null,null,null,null,"E.  PROGRAMS AND SERVICES FOR ELs AND THEIR FAMILIES (CONTINUED)",null,null,null,null,null,null,null,null,null,null,null,null,null,null,null,"E.  PROGRAMS AND SERVICES FOR ELs AND THEIR FAMILIES (CONTINUED)",null,null,null,null,null,null,null,null,null,null,null,null,null,null,null,"E.  PROGRAMS AND SERVICES FOR ELs AND THEIR FAMILIES (CONTINUED)",null,null,null,null,null,null,null,null,null,null,null,null,null,null,null,"E.  PROGRAMS AND SERVICES FOR ELs AND THEIR FAMILIES (CONTINUED)",null,null,null,null,null,null,null,null,null,null,null,null,null,null,null,"E.  PROGRAMS AND SERVICES FOR ELs AND THEIR FAMILIES (CONTINUED)",null,null,null,null,null,null,null,null,null,null,null,null,null,null,null,"E.  PROGRAMS AND SERVICES FOR ELs AND THEIR FAMILIES (CONTINUED)",null,null,null,null,null,null,null,null,null,null,null,null,null,null,null,"E.  PROGRAMS AND SERVICES FOR ELs AND THEIR FAMILIES (CONTINUED)",null,null,null,null,null,null,null,null,null,null,null,null,null,null,null,"E.  PROGRAMS AND SERVICES FOR ELs AND THEIR FAMILIES (CONTINUED)",null,null,null,null,null,null,null,null,null,null,null,null,null,null,null,"E.  PROGRAMS AND SERVICES FOR ELs AND THEIR FAMILIES (CONTINUED)",null,null,null,null,null,null,null,null,null,null,null,null,null,null,null,"E.  PROGRAMS AND SERVICES FOR ELs AND THEIR FAMILIES (CONTINUED)",null,null,null,null,null,null,null,null,null,null,null,null,null,null,null,"E.  PROGRAMS AND SERVICES FOR ELs AND THEIR FAMILIES (CONTINUED)",null,null,null,null,null,null,null,null,null,null,null,null,null,null,null,"E.  PROGRAMS AND SERVICES FOR ELs AND THEIR FAMILIES (CONTINUED)",null,null,null,null,null,null,null,null,null,null,null,null,null,null,null,"E.  PROGRAMS AND SERVICES FOR ELs AND THEIR FAMILIES (CONTINUED)",null,null,null,null,null,null,null,null,null,null,null,null,null,null,null,"E.  PROGRAMS AND SERVICES FOR ELs AND THEIR FAMILIES (CONTINUED)",null,null,null,null,null,null,null,null,null,null,null,null,null,null,null,"E.  PROGRAMS AND SERVICES FOR ELs AND THEIR FAMILIES (CONTINUED)",null,null,null,null,null,null,null,null,null,null,null,null,null,null,null,"E.  PROGRAMS AND SERVICES FOR ELs AND THEIR FAMILIES (CONTINUED)",null,null,null,null,null,null,null,null,null,null,null,null,null,null,null,"E.  PROGRAMS AND SERVICES FOR ELs AND THEIR FAMILIES (CONTINUED)",null,null,null,null,null,null,null,null,null,null,null,null,null,null,null,"E.  PROGRAMS AND SERVICES FOR ELs AND THEIR FAMILIES (CONTINUED)",null,null,null,null,null,null,null,null,null,null,null,null,null,null,null,"E.  PROGRAMS AND SERVICES FOR ELs AND THEIR FAMILIES (CONTINUED)",null,null,null,null,null,null,null,null,null,null,null,null,null,null,null,"E.  PROGRAMS AND SERVICES FOR ELs AND THEIR FAMILIES (CONTINUED)",null,null,null,null,null,null,null,null,null,null,null,null,null,null,null,"E.  PROGRAMS AND SERVICES FOR ELs AND THEIR FAMILIES (CONTINUED)",null,null,null,null,null,null,null,null,null,null,null,null,null,null,null,"E.  PROGRAMS AND SERVICES FOR ELs AND THEIR FAMILIES (CONTINUED)",null,null,null,null,null,null,null,null,null,null,null,null,null,null,null,"E.  PROGRAMS AND SERVICES FOR ELs AND THEIR FAMILIES (CONTINUED)",null,null,null,null,null,null,null,null,null,null,null,null,null,null,null,"E.  PROGRAMS AND SERVICES FOR ELs AND THEIR FAMILIES (CONTINUED)",null,null,null,null,null,null,null,null,null,null,null,null,null,null,null,"E.  PROGRAMS AND SERVICES FOR ELs AND THEIR FAMILIES (CONTINUED)",null,null,null,null,null,null,null,null,null,null,null,null,null,null,null,"E.  PROGRAMS AND SERVICES FOR ELs AND THEIR FAMILIES (CONTINUED)",null,null,null,null,null,null,null,null,null,null,null,null,null,null,null,"E.  PROGRAMS AND SERVICES FOR ELs AND THEIR FAMILIES (CONTINUED)",null,null,null,null,null,null,null,null,null,null,null,null,null,null,null,"E.  PROGRAMS AND SERVICES FOR ELs AND THEIR FAMILIES (CONTINUED)",null,null,null,null,null,null,null,null,null,null,null,null,null,null,null,"E.  PROGRAMS AND SERVICES FOR ELs AND THEIR FAMILIES (CONTINUED)",null,null,null,null,null,null,null,null,null,null,null,null,null,null,null,"E.  PROGRAMS AND SERVICES FOR ELs AND THEIR FAMILIES (CONTINUED)",null,null,null,null,null,null,null,null,null,null,null,null,null,null,null,"E.  PROGRAMS AND SERVICES FOR ELs AND THEIR FAMILIES (CONTINUED)",null,null,null,null,null,null,null,null,null,null,null,null,null,null,null,"E.  PROGRAMS AND SERVICES FOR ELs AND THEIR FAMILIES (CONTINUED)",null,null,null,null,null,null,null,null,null,null,null,null,null,null,null,"E.  PROGRAMS AND SERVICES FOR ELs AND THEIR FAMILIES (CONTINUED)",null,null,null,null,null,null,null,null,null,null,null,null,null,null,null,"E.  PROGRAMS AND SERVICES FOR ELs AND THEIR FAMILIES (CONTINUED)",null,null,null,null,null,null,null,null,null,null,null,null,null,null,null,"E.  PROGRAMS AND SERVICES FOR ELs AND THEIR FAMILIES (CONTINUED)",null,null,null,null,null,null,null,null,null,null,null,null,null,null,null,"E.  PROGRAMS AND SERVICES FOR ELs AND THEIR FAMILIES (CONTINUED)",null,null,null,null,null,null,null,null,null,null,null,null,null,null,null,"E.  PROGRAMS AND SERVICES FOR ELs AND THEIR FAMILIES (CONTINUED)",null,null,null,null,null,null,null,null,null,null,null,null,null,null,null,"E.  PROGRAMS AND SERVICES FOR ELs AND THEIR FAMILIES (CONTINUED)",null,null,null,null,null,null,null,null,null,null,null,null,null,null,null,"E.  PROGRAMS AND SERVICES FOR ELs AND THEIR FAMILIES (CONTINUED)",null,null,null,null,null,null,null,null,null,null,null,null,null,null,null,"E.  PROGRAMS AND SERVICES FOR ELs AND THEIR FAMILIES (CONTINUED)",null,null,null,null,null,null,null,null,null,null,null,null,null,null,null,"E.  PROGRAMS AND SERVICES FOR ELs AND THEIR FAMILIES (CONTINUED)",null,null,null,null,null,null,null,null,null,null,null,null,null,null,null,"E.  PROGRAMS AND SERVICES FOR ELs AND THEIR FAMILIES (CONTINUED)",null,null,null,null,null,null,null,null,null,null,null,null,null,null,null,"E.  PROGRAMS AND SERVICES FOR ELs AND THEIR FAMILIES (CONTINUED)",null,null,null,null,null,null,null,null,null,null,null,null,null,null,null,"E.  PROGRAMS AND SERVICES FOR ELs AND THEIR FAMILIES (CONTINUED)",null,null,null,null,null,null,null,null,null,null,null,null,null,null,null,"E.  PROGRAMS AND SERVICES FOR ELs AND THEIR FAMILIES (CONTINUED)",null,null,null,null,null,null,null,null,null,null,null,null,null,null,null,"E.  PROGRAMS AND SERVICES FOR ELs AND THEIR FAMILIES (CONTINUED)",null,null,null,null,null,null,null,null,null,null,null,null,null,null,null,"E.  PROGRAMS AND SERVICES FOR ELs AND THEIR FAMILIES (CONTINUED)",null,null,null,null,null,null,null,null,null,null,null,null,null,null,null,"E.  PROGRAMS AND SERVICES FOR ELs AND THEIR FAMILIES (CONTINUED)",null,null,null,null,null,null,null,null,null,null,null,null,null,null,null,"E.  PROGRAMS AND SERVICES FOR ELs AND THEIR FAMILIES (CONTINUED)",null,null,null,null,null,null,null,null,null,null,null,null,null,null,null,"E.  PROGRAMS AND SERVICES FOR ELs AND THEIR FAMILIES (CONTINUED)",null,null,null,null,null,null,null,null,null,null,null,null,null,null,null,"E.  PROGRAMS AND SERVICES FOR ELs AND THEIR FAMILIES (CONTINUED)",null,null,null,null,null,null,null,null,null,null,null,null,null,null,null,"E.  PROGRAMS AND SERVICES FOR ELs AND THEIR FAMILIES (CONTINUED)",null,null,null,null,null,null,null,null,null,null,null,null,null,null,null,"E.  PROGRAMS AND SERVICES FOR ELs AND THEIR FAMILIES (CONTINUED)",null,null,null,null,null,null,null,null,null,null,null,null,null,null,null,"E.  PROGRAMS AND SERVICES FOR ELs AND THEIR FAMILIES (CONTINUED)",null,null,null,null,null,null,null,null,null,null,null,null,null,null,null,"E.  PROGRAMS AND SERVICES FOR ELs AND THEIR FAMILIES (CONTINUED)",null,null,null,null,null,null,null,null,null,null,null,null,null,null,null,"E.  PROGRAMS AND SERVICES FOR ELs AND THEIR FAMILIES (CONTINUED)",null,null,null,null,null,null,null,null,null,null,null,null,null,null,null,"E.  PROGRAMS AND SERVICES FOR ELs AND THEIR FAMILIES (CONTINUED)",null,null,null,null,null,null,null,null,null,null,null,null,null,null,null,"E.  PROGRAMS AND SERVICES FOR ELs AND THEIR FAMILIES (CONTINUED)",null,null,null,null,null,null,null,null,null,null,null,null,null,null,null,"E.  PROGRAMS AND SERVICES FOR ELs AND THEIR FAMILIES (CONTINUED)",null,null,null,null,null,null,null,null,null,null,null,null,null,null,null,"E.  PROGRAMS AND SERVICES FOR ELs AND THEIR FAMILIES (CONTINUED)",null,null,null,null,null,null,null,null,null,null,null,null,null,null,null,"E.  PROGRAMS AND SERVICES FOR ELs AND THEIR FAMILIES (CONTINUED)",null,null,null,null,null,null,null,null,null,null,null,null,null,null,null,"E.  PROGRAMS AND SERVICES FOR ELs AND THEIR FAMILIES (CONTINUED)",null,null,null,null,null,null,null,null,null,null,null,null,null,null,null,"E.  PROGRAMS AND SERVICES FOR ELs AND THEIR FAMILIES (CONTINUED)",null,null,null,null,null,null,null,null,null,null,null,null,null,null,null,"E.  PROGRAMS AND SERVICES FOR ELs AND THEIR FAMILIES (CONTINUED)",null,null,null,null,null,null,null,null,null,null,null,null,null,null,null,"E.  PROGRAMS AND SERVICES FOR ELs AND THEIR FAMILIES (CONTINUED)",null,null,null,null,null,null,null,null,null,null,null,null,null,null,null,"E.  PROGRAMS AND SERVICES FOR ELs AND THEIR FAMILIES (CONTINUED)",null,null,null,null,null,null,null,null,null,null,null,null,null,null,null,"E.  PROGRAMS AND SERVICES FOR ELs AND THEIR FAMILIES (CONTINUED)",null,null,null,null,null,null,null,null,null,null,null,null,null,null,null,"E.  PROGRAMS AND SERVICES FOR ELs AND THEIR FAMILIES (CONTINUED)",null,null,null,null,null,null,null,null,null,null,null,null,null,null,null,"E.  PROGRAMS AND SERVICES FOR ELs AND THEIR FAMILIES (CONTINUED)",null,null,null,null,null,null,null,null,null,null,null,null,null,null,null,"E.  PROGRAMS AND SERVICES FOR ELs AND THEIR FAMILIES (CONTINUED)",null,null,null,null,null,null,null,null,null,null,null,null,null,null,null,"E.  PROGRAMS AND SERVICES FOR ELs AND THEIR FAMILIES (CONTINUED)",null,null,null,null,null,null,null,null,null,null,null,null,null,null,null,"E.  PROGRAMS AND SERVICES FOR ELs AND THEIR FAMILIES (CONTINUED)",null,null,null,null,null,null,null,null,null,null,null,null,null,null,null,"E.  PROGRAMS AND SERVICES FOR ELs AND THEIR FAMILIES (CONTINUED)",null,null,null,null,null,null,null,null,null,null,null,null,null,null,null,"E.  PROGRAMS AND SERVICES FOR ELs AND THEIR FAMILIES (CONTINUED)",null,null,null,null,null,null,null,null,null,null,null,null,null,null,null,"E.  PROGRAMS AND SERVICES FOR ELs AND THEIR FAMILIES (CONTINUED)",null,null,null,null,null,null,null,null,null,null,null,null,null,null,null,"E.  PROGRAMS AND SERVICES FOR ELs AND THEIR FAMILIES (CONTINUED)",null,null,null,null,null,null,null,null,null,null,null,null,null,null,null,"E.  PROGRAMS AND SERVICES FOR ELs AND THEIR FAMILIES (CONTINUED)",null,null,null,null,null,null,null,null,null,null,null,null,null,null,null,"E.  PROGRAMS AND SERVICES FOR ELs AND THEIR FAMILIES (CONTINUED)",null,null,null,null,null,null,null,null,null,null,null,null,null,null,null,"E.  PROGRAMS AND SERVICES FOR ELs AND THEIR FAMILIES (CONTINUED)",null,null,null,null,null,null,null,null,null,null,null,null,null,null,null,"E.  PROGRAMS AND SERVICES FOR ELs AND THEIR FAMILIES (CONTINUED)",null,null,null,null,null,null,null,null,null,null,null,null,null,null,null,"E.  PROGRAMS AND SERVICES FOR ELs AND THEIR FAMILIES (CONTINUED)",null,null,null,null,null,null,null,null,null,null,null,null,null,null,null,"E.  PROGRAMS AND SERVICES FOR ELs AND THEIR FAMILIES (CONTINUED)",null,null,null,null,null,null,null,null,null,null,null,null,null,null,null,"E.  PROGRAMS AND SERVICES FOR ELs AND THEIR FAMILIES (CONTINUED)",null,null,null,null,null,null,null,null,null,null,null,null,null,null,null,"E.  PROGRAMS AND SERVICES FOR ELs AND THEIR FAMILIES (CONTINUED)",null,null,null,null,null,null,null,null,null,null,null,null,null,null,null,"E.  PROGRAMS AND SERVICES FOR ELs AND THEIR FAMILIES (CONTINUED)",null,null,null,null,null,null,null,null,null,null,null,null,null,null,null,"E.  PROGRAMS AND SERVICES FOR ELs AND THEIR FAMILIES (CONTINUED)",null,null,null,null,null,null,null,null,null,null,null,null,null,null,null,"E.  PROGRAMS AND SERVICES FOR ELs AND THEIR FAMILIES (CONTINUED)",null,null,null,null,null,null,null,null,null,null,null,null,null,null,null,"E.  PROGRAMS AND SERVICES FOR ELs AND THEIR FAMILIES (CONTINUED)",null,null,null,null,null,null,null,null,null,null,null,null,null,null,null,"E.  PROGRAMS AND SERVICES FOR ELs AND THEIR FAMILIES (CONTINUED)",null,null,null,null,null,null,null,null,null,null,null,null,null,null,null,"E.  PROGRAMS AND SERVICES FOR ELs AND THEIR FAMILIES (CONTINUED)",null,null,null,null,null,null,null,null,null,null,null,null,null,null,null,"E.  PROGRAMS AND SERVICES FOR ELs AND THEIR FAMILIES (CONTINUED)",null,null,null,null,null,null,null,null,null,null,null,null,null,null,null,"E.  PROGRAMS AND SERVICES FOR ELs AND THEIR FAMILIES (CONTINUED)",null,null,null,null,null,null,null,null,null,null,null,null,null,null,null,"E.  PROGRAMS AND SERVICES FOR ELs AND THEIR FAMILIES (CONTINUED)",null,null,null,null,null,null,null,null,null,null,null,null,null,null,null,"E.  PROGRAMS AND SERVICES FOR ELs AND THEIR FAMILIES (CONTINUED)",null,null,null,null,null,null,null,null,null,null,null,null,null,null,null,"E.  PROGRAMS AND SERVICES FOR ELs AND THEIR FAMILIES (CONTINUED)",null,null,null,null,null,null,null,null,null,null,null,null,null,null,null,"E.  PROGRAMS AND SERVICES FOR ELs AND THEIR FAMILIES (CONTINUED)",null,null,null,null,null,null,null,null,null,null,null,null,null,null,null,"E.  PROGRAMS AND SERVICES FOR ELs AND THEIR FAMILIES (CONTINUED)",null,null,null,null,null,null,null,null,null,null,null,null,null,null,null,"E.  PROGRAMS AND SERVICES FOR ELs AND THEIR FAMILIES (CONTINUED)",null,null,null,null,null,null,null,null,null,null,null,null,null,null,null,"E.  PROGRAMS AND SERVICES FOR ELs AND THEIR FAMILIES (CONTINUED)",null,null,null,null,null,null,null,null,null,null,null,null,null,null,null,"E.  PROGRAMS AND SERVICES FOR ELs AND THEIR FAMILIES (CONTINUED)",null,null,null,null,null,null,null,null,null,null,null,null,null,null,null,"E.  PROGRAMS AND SERVICES FOR ELs AND THEIR FAMILIES (CONTINUED)",null,null,null,null,null,null,null,null,null,null,null,null,null,null,null,"E.  PROGRAMS AND SERVICES FOR ELs AND THEIR FAMILIES (CONTINUED)",null,null,null,null,null,null,null,null,null,null,null,null,null,null,null,"E.  PROGRAMS AND SERVICES FOR ELs AND THEIR FAMILIES (CONTINUED)",null,null,null,null,null,null,null,null,null,null,null,null,null,null,null,"E.  PROGRAMS AND SERVICES FOR ELs AND THEIR FAMILIES (CONTINUED)",null,null,null,null,null,null,null,null,null,null,null,null,null,null,null,"E.  PROGRAMS AND SERVICES FOR ELs AND THEIR FAMILIES (CONTINUED)",null,null,null,null,null,null,null,null,null,null,null,null,null,null,null,"E.  PROGRAMS AND SERVICES FOR ELs AND THEIR FAMILIES (CONTINUED)",null,null,null,null,null,null,null,null,null,null,null,null,null,null,null,"E.  PROGRAMS AND SERVICES FOR ELs AND THEIR FAMILIES (CONTINUED)",null,null,null,null,null,null,null,null,null,null,null,null,null,null,null,"E.  PROGRAMS AND SERVICES FOR ELs AND THEIR FAMILIES (CONTINUED)",null,null,null,null,null,null,null,null,null,null,null,null,null,null,null,"E.  PROGRAMS AND SERVICES FOR ELs AND THEIR FAMILIES (CONTINUED)",null,null,null,null,null,null,null,null,null,null,null,null,null,null,null,"E.  PROGRAMS AND SERVICES FOR ELs AND THEIR FAMILIES (CONTINUED)",null,null,null,null,null,null,null,null,null,null,null,null,null,null,null,"E.  PROGRAMS AND SERVICES FOR ELs AND THEIR FAMILIES (CONTINUED)",null,null,null,null,null,null,null,null,null,null,null,null,null,null,null,"E.  PROGRAMS AND SERVICES FOR ELs AND THEIR FAMILIES (CONTINUED)",null,null,null,null,null,null,null,null,null,null,null,null,null,null,null,"E.  PROGRAMS AND SERVICES FOR ELs AND THEIR FAMILIES (CONTINUED)",null,null,null,null,null,null,null,null,null,null,null,null,null,null,null,"E.  PROGRAMS AND SERVICES FOR ELs AND THEIR FAMILIES (CONTINUED)",null,null,null,null,null,null,null,null,null,null,null,null,null,null,null,"E.  PROGRAMS AND SERVICES FOR ELs AND THEIR FAMILIES (CONTINUED)",null,null,null,null,null,null,null,null,null,null,null,null,null,null,null,"E.  PROGRAMS AND SERVICES FOR ELs AND THEIR FAMILIES (CONTINUED)",null,null,null,null,null,null,null,null,null,null,null,null,null,null,null,"E.  PROGRAMS AND SERVICES FOR ELs AND THEIR FAMILIES (CONTINUED)",null,null,null,null,null,null,null,null,null,null,null,null,null,null,null,"E.  PROGRAMS AND SERVICES FOR ELs AND THEIR FAMILIES (CONTINUED)",null,null,null,null,null,null,null,null,null,null,null,null,null,null,null,"E.  PROGRAMS AND SERVICES FOR ELs AND THEIR FAMILIES (CONTINUED)",null,null,null,null,null,null,null,null,null,null,null,null,null,null,null,"E.  PROGRAMS AND SERVICES FOR ELs AND THEIR FAMILIES (CONTINUED)",null,null,null,null,null,null,null,null,null,null,null,null,null,null,null,"E.  PROGRAMS AND SERVICES FOR ELs AND THEIR FAMILIES (CONTINUED)",null,null,null,null,null,null,null,null,null,null,null,null,null,null,null,"E.  PROGRAMS AND SERVICES FOR ELs AND THEIR FAMILIES (CONTINUED)",null,null,null,null,null,null,null,null,null,null,null,null,null,null,null,"E.  PROGRAMS AND SERVICES FOR ELs AND THEIR FAMILIES (CONTINUED)",null,null,null,null,null,null,null,null,null,null,null,null,null,null,null,"E.  PROGRAMS AND SERVICES FOR ELs AND THEIR FAMILIES (CONTINUED)",null,null,null,null,null,null,null,null,null,null,null,null,null,null,null,"E.  PROGRAMS AND SERVICES FOR ELs AND THEIR FAMILIES (CONTINUED)",null,null,null,null,null,null,null,null,null,null,null,null,null,null,null,"E.  PROGRAMS AND SERVICES FOR ELs AND THEIR FAMILIES (CONTINUED)",null,null,null,null,null,null,null,null,null,null,null,null,null,null,null,"E.  PROGRAMS AND SERVICES FOR ELs AND THEIR FAMILIES (CONTINUED)",null,null,null,null,null,null,null,null,null,null,null,null,null,null,null,"E.  PROGRAMS AND SERVICES FOR ELs AND THEIR FAMILIES (CONTINUED)",null,null,null,null,null,null,null,null,null,null,null,null,null,null,null,"E.  PROGRAMS AND SERVICES FOR ELs AND THEIR FAMILIES (CONTINUED)",null,null,null,null,null,null,null,null,null,null,null,null,null,null,null,"E.  PROGRAMS AND SERVICES FOR ELs AND THEIR FAMILIES (CONTINUED)",null,null,null,null,null,null,null,null,null,null,null,null,null,null,null,"E.  PROGRAMS AND SERVICES FOR ELs AND THEIR FAMILIES (CONTINUED)",null,null,null,null,null,null,null,null,null,null,null,null,null,null,null,"E.  PROGRAMS AND SERVICES FOR ELs AND THEIR FAMILIES (CONTINUED)",null,null,null,null,null,null,null,null,null,null,null,null,null,null,null,"E.  PROGRAMS AND SERVICES FOR ELs AND THEIR FAMILIES (CONTINUED)",null,null,null,null,null,null,null,null,null,null,null,null,null,null,null,"E.  PROGRAMS AND SERVICES FOR ELs AND THEIR FAMILIES (CONTINUED)",null,null,null,null,null,null,null,null,null,null,null,null,null,null,null,"E.  PROGRAMS AND SERVICES FOR ELs AND THEIR FAMILIES (CONTINUED)",null,null,null,null,null,null,null,null,null,null,null,null,null,null,null,"E.  PROGRAMS AND SERVICES FOR ELs AND THEIR FAMILIES (CONTINUED)",null,null,null,null,null,null,null,null,null,null,null,null,null,null,null,"E.  PROGRAMS AND SERVICES FOR ELs AND THEIR FAMILIES (CONTINUED)",null,null,null,null,null,null,null,null,null,null,null,null,null,null,null,"E.  PROGRAMS AND SERVICES FOR ELs AND THEIR FAMILIES (CONTINUED)",null,null,null,null,null,null,null,null,null,null,null,null,null,null,null,"E.  PROGRAMS AND SERVICES FOR ELs AND THEIR FAMILIES (CONTINUED)",null,null,null,null,null,null,null,null,null,null,null,null,null,null,null,"E.  PROGRAMS AND SERVICES FOR ELs AND THEIR FAMILIES (CONTINUED)",null,null,null,null,null,null,null,null,null,null,null,null,null,null,null,"E.  PROGRAMS AND SERVICES FOR ELs AND THEIR FAMILIES (CONTINUED)",null,null,null,null,null,null,null,null,null,null,null,null,null,null,null,"E.  PROGRAMS AND SERVICES FOR ELs AND THEIR FAMILIES (CONTINUED)",null,null,null,null,null,null,null,null,null,null,null,null,null,null,null,"E.  PROGRAMS AND SERVICES FOR ELs AND THEIR FAMILIES (CONTINUED)",null,null,null,null,null,null,null,null,null,null,null,null,null,null,null,"E.  PROGRAMS AND SERVICES FOR ELs AND THEIR FAMILIES (CONTINUED)",null,null,null,null,null,null,null,null,null,null,null,null,null,null,null,"E.  PROGRAMS AND SERVICES FOR ELs AND THEIR FAMILIES (CONTINUED)",null,null,null,null,null,null,null,null,null,null,null,null,null,null,null,"E.  PROGRAMS AND SERVICES FOR ELs AND THEIR FAMILIES (CONTINUED)",null,null,null,null,null,null,null,null,null,null,null,null,null,null,null,"E.  PROGRAMS AND SERVICES FOR ELs AND THEIR FAMILIES (CONTINUED)",null,null,null,null,null,null,null,null,null,null,null,null,null,null,null,"E.  PROGRAMS AND SERVICES FOR ELs AND THEIR FAMILIES (CONTINUED)",null,null,null,null,null,null,null,null,null,null,null,null,null,null,null,"E.  PROGRAMS AND SERVICES FOR ELs AND THEIR FAMILIES (CONTINUED)",null,null,null,null,null,null,null,null,null,null,null,null,null,null,null,"E.  PROGRAMS AND SERVICES FOR ELs AND THEIR FAMILIES (CONTINUED)",null,null,null,null,null,null,null,null,null,null,null,null,null,null,null,"E.  PROGRAMS AND SERVICES FOR ELs AND THEIR FAMILIES (CONTINUED)",null,null,null,null,null,null,null,null,null,null,null,null,null,null,null,"E.  PROGRAMS AND SERVICES FOR ELs AND THEIR FAMILIES (CONTINUED)",null,null,null,null,null,null,null,null,null,null,null,null,null,null,null,"E.  PROGRAMS AND SERVICES FOR ELs AND THEIR FAMILIES (CONTINUED)",null,null,null,null,null,null,null,null,null,null,null,null,null,null,null,"E.  PROGRAMS AND SERVICES FOR ELs AND THEIR FAMILIES (CONTINUED)",null,null,null,null,null,null,null,null,null,null,null,null,null,null,null,"E.  PROGRAMS AND SERVICES FOR ELs AND THEIR FAMILIES (CONTINUED)",null,null,null,null,null,null,null,null,null,null,null,null,null,null,null,"E.  PROGRAMS AND SERVICES FOR ELs AND THEIR FAMILIES (CONTINUED)",null,null,null,null,null,null,null,null,null,null,null,null,null,null,null,"E.  PROGRAMS AND SERVICES FOR ELs AND THEIR FAMILIES (CONTINUED)",null,null,null,null,null,null,null,null,null,null,null,null,null,null,null,"E.  PROGRAMS AND SERVICES FOR ELs AND THEIR FAMILIES (CONTINUED)",null,null,null,null,null,null,null,null,null,null,null,null,null,null,null,"E.  PROGRAMS AND SERVICES FOR ELs AND THEIR FAMILIES (CONTINUED)",null,null,null,null,null,null,null,null,null,null,null,null,null,null,null,"E.  PROGRAMS AND SERVICES FOR ELs AND THEIR FAMILIES (CONTINUED)",null,null,null,null,null,null,null,null,null,null,null,null,null,null,null,"E.  PROGRAMS AND SERVICES FOR ELs AND THEIR FAMILIES (CONTINUED)",null,null,null,null,null,null,null,null,null,null,null,null,null,null,null,"E.  PROGRAMS AND SERVICES FOR ELs AND THEIR FAMILIES (CONTINUED)",null,null,null,null,null,null,null,null,null,null,null,null,null,null,null,"E.  PROGRAMS AND SERVICES FOR ELs AND THEIR FAMILIES (CONTINUED)",null,null,null,null,null,null,null,null,null,null,null,null,null,null,null,"E.  PROGRAMS AND SERVICES FOR ELs AND THEIR FAMILIES (CONTINUED)",null,null,null,null,null,null,null,null,null,null,null,null,null,null,null,"E.  PROGRAMS AND SERVICES FOR ELs AND THEIR FAMILIES (CONTINUED)",null,null,null,null,null,null,null,null,null,null,null,null,null,null,null,"E.  PROGRAMS AND SERVICES FOR ELs AND THEIR FAMILIES (CONTINUED)",null,null,null,null,null,null,null,null,null,null,null,null,null,null,null,"E.  PROGRAMS AND SERVICES FOR ELs AND THEIR FAMILIES (CONTINUED)",null,null,null,null,null,null,null,null,null,null,null,null,null,null,null,"E.  PROGRAMS AND SERVICES FOR ELs AND THEIR FAMILIES (CONTINUED)",null,null,null,null,null,null,null,null,null,null,null,null,null,null,null,"E.  PROGRAMS AND SERVICES FOR ELs AND THEIR FAMILIES (CONTINUED)",null,null,null,null,null,null,null,null,null,null,null,null,null,null,null,"E.  PROGRAMS AND SERVICES FOR ELs AND THEIR FAMILIES (CONTINUED)",null,null,null,null,null,null,null,null,null,null,null,null,null,null,null,"E.  PROGRAMS AND SERVICES FOR ELs AND THEIR FAMILIES (CONTINUED)",null,null,null,null,null,null,null,null,null,null,null,null,null,null,null,"E.  PROGRAMS AND SERVICES FOR ELs AND THEIR FAMILIES (CONTINUED)",null,null,null,null,null,null,null,null,null,null,null,null,null,null,null,"E.  PROGRAMS AND SERVICES FOR ELs AND THEIR FAMILIES (CONTINUED)",null,null,null,null,null,null,null,null,null,null,null,null,null,null,null,"E.  PROGRAMS AND SERVICES FOR ELs AND THEIR FAMILIES (CONTINUED)",null,null,null,null,null,null,null,null,null,null,null,null,null,null,null,"E.  PROGRAMS AND SERVICES FOR ELs AND THEIR FAMILIES (CONTINUED)",null,null,null,null,null,null,null,null,null,null,null,null,null,null,null,"E.  PROGRAMS AND SERVICES FOR ELs AND THEIR FAMILIES (CONTINUED)",null,null,null,null,null,null,null,null,null,null,null,null,null,null,null,"E.  PROGRAMS AND SERVICES FOR ELs AND THEIR FAMILIES (CONTINUED)",null,null,null,null,null,null,null,null,null,null,null,null,null,null,null,"E.  PROGRAMS AND SERVICES FOR ELs AND THEIR FAMILIES (CONTINUED)",null,null,null,null,null,null,null,null,null,null,null,null,null,null,null,"E.  PROGRAMS AND SERVICES FOR ELs AND THEIR FAMILIES (CONTINUED)",null,null,null,null,null,null,null,null,null,null,null,null,null,null,null,"E.  PROGRAMS AND SERVICES FOR ELs AND THEIR FAMILIES (CONTINUED)",null,null,null,null,null,null,null,null,null,null,null,null,null,null,null,"E.  PROGRAMS AND SERVICES FOR ELs AND THEIR FAMILIES (CONTINUED)",null,null,null,null,null,null,null,null,null,null,null,null,null,null,null,"E.  PROGRAMS AND SERVICES FOR ELs AND THEIR FAMILIES (CONTINUED)",null,null,null,null,null,null,null,null,null,null,null,null,null,null,null,"E.  PROGRAMS AND SERVICES FOR ELs AND THEIR FAMILIES (CONTINUED)",null,null,null,null,null,null,null,null,null,null,null,null,null,null,null,"E.  PROGRAMS AND SERVICES FOR ELs AND THEIR FAMILIES (CONTINUED)",null,null,null,null,null,null,null,null,null,null,null,null,null,null,null,"E.  PROGRAMS AND SERVICES FOR ELs AND THEIR FAMILIES (CONTINUED)",null,null,null,null,null,null,null,null,null,null,null,null,null,null,null,"E.  PROGRAMS AND SERVICES FOR ELs AND THEIR FAMILIES (CONTINUED)",null,null,null,null,null,null,null,null,null,null,null,null,null,null,null,"E.  PROGRAMS AND SERVICES FOR ELs AND THEIR FAMILIES (CONTINUED)",null,null,null,null,null,null,null,null,null,null,null,null,null,null,null,"E.  PROGRAMS AND SERVICES FOR ELs AND THEIR FAMILIES (CONTINUED)",null,null,null,null,null,null,null,null,null,null,null,null,null,null,null,"E.  PROGRAMS AND SERVICES FOR ELs AND THEIR FAMILIES (CONTINUED)",null,null,null,null,null,null,null,null,null,null,null,null,null,null,null,"E.  PROGRAMS AND SERVICES FOR ELs AND THEIR FAMILIES (CONTINUED)",null,null,null,null,null,null,null,null,null,null,null,null,null,null,null,"E.  PROGRAMS AND SERVICES FOR ELs AND THEIR FAMILIES (CONTINUED)",null,null,null,null,null,null,null,null,null,null,null,null,null,null,null,"E.  PROGRAMS AND SERVICES FOR ELs AND THEIR FAMILIES (CONTINUED)",null,null,null,null,null,null,null,null,null,null,null,null,null,null,null,"E.  PROGRAMS AND SERVICES FOR ELs AND THEIR FAMILIES (CONTINUED)",null,null,null,null,null,null,null,null,null,null,null,null,null,null,null,"E.  PROGRAMS AND SERVICES FOR ELs AND THEIR FAMILIES (CONTINUED)",null,null,null,null,null,null,null,null,null,null,null,null,null,null,null,"E.  PROGRAMS AND SERVICES FOR ELs AND THEIR FAMILIES (CONTINUED)",null,null,null,null,null,null,null,null,null,null,null,null,null,null,null,"E.  PROGRAMS AND SERVICES FOR ELs AND THEIR FAMILIES (CONTINUED)",null,null,null,null,null,null,null,null,null,null,null,null,null,null,null,"E.  PROGRAMS AND SERVICES FOR ELs AND THEIR FAMILIES (CONTINUED)",null,null,null,null,null,null,null,null,null,null,null,null,null,null,null,"E.  PROGRAMS AND SERVICES FOR ELs AND THEIR FAMILIES (CONTINUED)",null,null,null,null,null,null,null,null,null,null,null,null,null,null,null,"E.  PROGRAMS AND SERVICES FOR ELs AND THEIR FAMILIES (CONTINUED)",null,null,null,null,null,null,null,null,null,null,null,null,null,null,null,"E.  PROGRAMS AND SERVICES FOR ELs AND THEIR FAMILIES (CONTINUED)",null,null,null,null,null,null,null,null,null,null,null,null,null,null,null,"E.  PROGRAMS AND SERVICES FOR ELs AND THEIR FAMILIES (CONTINUED)",null,null,null,null,null,null,null,null,null,null,null,null,null,null,null,"E.  PROGRAMS AND SERVICES FOR ELs AND THEIR FAMILIES (CONTINUED)",null,null,null,null,null,null,null,null,null,null,null,null,null,null,null,"E.  PROGRAMS AND SERVICES FOR ELs AND THEIR FAMILIES (CONTINUED)",null,null,null,null,null,null,null,null,null,null,null,null,null,null,null,"E.  PROGRAMS AND SERVICES FOR ELs AND THEIR FAMILIES (CONTINUED)",null,null,null,null,null,null,null,null,null,null,null,null,null,null,null,"E.  PROGRAMS AND SERVICES FOR ELs AND THEIR FAMILIES (CONTINUED)",null,null,null,null,null,null,null,null,null,null,null,null,null,null,null,"E.  PROGRAMS AND SERVICES FOR ELs AND THEIR FAMILIES (CONTINUED)",null,null,null,null,null,null,null,null,null,null,null,null,null,null,null,"E.  PROGRAMS AND SERVICES FOR ELs AND THEIR FAMILIES (CONTINUED)",null,null,null,null,null,null,null,null,null,null,null,null,null,null,null,"E.  PROGRAMS AND SERVICES FOR ELs AND THEIR FAMILIES (CONTINUED)",null,null,null,null,null,null,null,null,null,null,null,null,null,null,null,"E.  PROGRAMS AND SERVICES FOR ELs AND THEIR FAMILIES (CONTINUED)",null,null,null,null,null,null,null,null,null,null,null,null,null,null,null,"E.  PROGRAMS AND SERVICES FOR ELs AND THEIR FAMILIES (CONTINUED)",null,null,null,null,null,null,null,null,null,null,null,null,null,null,null,"E.  PROGRAMS AND SERVICES FOR ELs AND THEIR FAMILIES (CONTINUED)",null,null,null,null,null,null,null,null,null,null,null,null,null,null,null,"E.  PROGRAMS AND SERVICES FOR ELs AND THEIR FAMILIES (CONTINUED)",null,null,null,null,null,null,null,null,null,null,null,null,null,null,null,"E.  PROGRAMS AND SERVICES FOR ELs AND THEIR FAMILIES (CONTINUED)",null,null,null,null,null,null,null,null,null,null,null,null,null,null,null,"E.  PROGRAMS AND SERVICES FOR ELs AND THEIR FAMILIES (CONTINUED)",null,null,null,null,null,null,null,null,null,null,null,null,null,null,null,"E.  PROGRAMS AND SERVICES FOR ELs AND THEIR FAMILIES (CONTINUED)",null,null,null,null,null,null,null,null,null,null,null,null,null,null,null,"E.  PROGRAMS AND SERVICES FOR ELs AND THEIR FAMILIES (CONTINUED)",null,null,null,null,null,null,null,null,null,null,null,null,null,null,null,"E.  PROGRAMS AND SERVICES FOR ELs AND THEIR FAMILIES (CONTINUED)",null,null,null,null,null,null,null,null,null,null,null,null,null,null,null,"E.  PROGRAMS AND SERVICES FOR ELs AND THEIR FAMILIES (CONTINUED)",null,null,null,null,null,null,null,null,null,null,null,null,null,null,null,"E.  PROGRAMS AND SERVICES FOR ELs AND THEIR FAMILIES (CONTINUED)",null,null,null,null,null,null,null,null,null,null,null,null,null,null,null,"E.  PROGRAMS AND SERVICES FOR ELs AND THEIR FAMILIES (CONTINUED)",null,null,null,null,null,null,null,null,null,null,null,null,null,null,null,"E.  PROGRAMS AND SERVICES FOR ELs AND THEIR FAMILIES (CONTINUED)",null,null,null,null,null,null,null,null,null,null,null,null,null,null,null,"E.  PROGRAMS AND SERVICES FOR ELs AND THEIR FAMILIES (CONTINUED)",null,null,null,null,null,null,null,null,null,null,null,null,null,null,null,"E.  PROGRAMS AND SERVICES FOR ELs AND THEIR FAMILIES (CONTINUED)",null,null,null,null,null,null,null,null,null,null,null,null,null,null,null,"E.  PROGRAMS AND SERVICES FOR ELs AND THEIR FAMILIES (CONTINUED)",null,null,null,null,null,null,null,null,null,null,null,null,null,null,null,"E.  PROGRAMS AND SERVICES FOR ELs AND THEIR FAMILIES (CONTINUED)",null,null,null,null,null,null,null,null,null,null,null,null,null,null,null,"E.  PROGRAMS AND SERVICES FOR ELs AND THEIR FAMILIES (CONTINUED)",null,null,null,null,null,null,null,null,null,null,null,null,null,null,null,"E.  PROGRAMS AND SERVICES FOR ELs AND THEIR FAMILIES (CONTINUED)",null,null,null,null,null,null,null,null,null,null,null,null,null,null,null,"E.  PROGRAMS AND SERVICES FOR ELs AND THEIR FAMILIES (CONTINUED)",null,null,null,null,null,null,null,null,null,null,null,null,null,null,null,"E.  PROGRAMS AND SERVICES FOR ELs AND THEIR FAMILIES (CONTINUED)",null,null,null,null,null,null,null,null,null,null,null,null,null,null,null,"E.  PROGRAMS AND SERVICES FOR ELs AND THEIR FAMILIES (CONTINUED)",null,null,null,null,null,null,null,null,null,null,null,null,null,null,null,"E.  PROGRAMS AND SERVICES FOR ELs AND THEIR FAMILIES (CONTINUED)",null,null,null,null,null,null,null,null,null,null,null,null,null,null,null,"E.  PROGRAMS AND SERVICES FOR ELs AND THEIR FAMILIES (CONTINUED)",null,null,null,null,null,null,null,null,null,null,null,null,null,null,null,"E.  PROGRAMS AND SERVICES FOR ELs AND THEIR FAMILIES (CONTINUED)",null,null,null,null,null,null,null,null,null,null,null,null,null,null,null,"E.  PROGRAMS AND SERVICES FOR ELs AND THEIR FAMILIES (CONTINUED)",null,null,null,null,null,null,null,null,null,null,null,null,null,null,null,"E.  PROGRAMS AND SERVICES FOR ELs AND THEIR FAMILIES (CONTINUED)",null,null,null,null,null,null,null,null,null,null,null,null,null,null,null,"E.  PROGRAMS AND SERVICES FOR ELs AND THEIR FAMILIES (CONTINUED)",null,null,null,null,null,null,null,null,null,null,null,null,null,null,null,"E.  PROGRAMS AND SERVICES FOR ELs AND THEIR FAMILIES (CONTINUED)",null,null,null,null,null,null,null,null,null,null,null,null,null,null,null,"E.  PROGRAMS AND SERVICES FOR ELs AND THEIR FAMILIES (CONTINUED)",null,null,null,null,null,null,null,null,null,null,null,null,null,null,null,"E.  PROGRAMS AND SERVICES FOR ELs AND THEIR FAMILIES (CONTINUED)",null,null,null,null,null,null,null,null,null,null,null,null,null,null,null,"E.  PROGRAMS AND SERVICES FOR ELs AND THEIR FAMILIES (CONTINUED)",null,null,null,null,null,null,null,null,null,null,null,null,null,null,null,"E.  PROGRAMS AND SERVICES FOR ELs AND THEIR FAMILIES (CONTINUED)",null,null,null,null,null,null,null,null,null,null,null,null,null,null,null,"E.  PROGRAMS AND SERVICES FOR ELs AND THEIR FAMILIES (CONTINUED)",null,null,null,null,null,null,null,null,null,null,null,null,null,null,null,"E.  PROGRAMS AND SERVICES FOR ELs AND THEIR FAMILIES (CONTINUED)",null,null,null,null,null,null,null,null,null,null,null,null,null,null,null,"E.  PROGRAMS AND SERVICES FOR ELs AND THEIR FAMILIES (CONTINUED)",null,null,null,null,null,null,null,null,null,null,null,null,null,null,null,"E.  PROGRAMS AND SERVICES FOR ELs AND THEIR FAMILIES (CONTINUED)",null,null,null,null,null,null,null,null,null,null,null,null,null,null,null,"E.  PROGRAMS AND SERVICES FOR ELs AND THEIR FAMILIES (CONTINUED)",null,null,null,null,null,null,null,null,null,null,null,null,null,null,null,"E.  PROGRAMS AND SERVICES FOR ELs AND THEIR FAMILIES (CONTINUED)",null,null,null,null,null,null,null,null,null,null,null,null,null,null,null,"E.  PROGRAMS AND SERVICES FOR ELs AND THEIR FAMILIES (CONTINUED)",null,null,null,null,null,null,null,null,null,null,null,null,null,null,null,"E.  PROGRAMS AND SERVICES FOR ELs AND THEIR FAMILIES (CONTINUED)",null,null,null,null,null,null,null,null,null,null,null,null,null,null,null,"E.  PROGRAMS AND SERVICES FOR ELs AND THEIR FAMILIES (CONTINUED)",null,null,null,null,null,null,null,null,null,null,null,null,null,null,null,"E.  PROGRAMS AND SERVICES FOR ELs AND THEIR FAMILIES (CONTINUED)",null,null,null,null,null,null,null,null,null,null,null,null,null,null,null,"E.  PROGRAMS AND SERVICES FOR ELs AND THEIR FAMILIES (CONTINUED)",null,null,null,null,null,null,null,null,null,null,null,null,null,null,null,"E.  PROGRAMS AND SERVICES FOR ELs AND THEIR FAMILIES (CONTINUED)",null,null,null,null,null,null,null,null,null,null,null,null,null,null,null,"E.  PROGRAMS AND SERVICES FOR ELs AND THEIR FAMILIES (CONTINUED)",null,null,null,null,null,null,null,null,null,null,null,null,null,null,null,"E.  PROGRAMS AND SERVICES FOR ELs AND THEIR FAMILIES (CONTINUED)",null,null,null,null,null,null,null,null,null,null,null,null,null,null,null,"E.  PROGRAMS AND SERVICES FOR ELs AND THEIR FAMILIES (CONTINUED)",null,null,null,null,null,null,null,null,null,null,null,null,null,null,null,"E.  PROGRAMS AND SERVICES FOR ELs AND THEIR FAMILIES (CONTINUED)",null,null,null,null,null,null,null,null,null,null,null,null,null,null,null,"E.  PROGRAMS AND SERVICES FOR ELs AND THEIR FAMILIES (CONTINUED)",null,null,null,null,null,null,null,null,null,null,null,null,null,null,null,"E.  PROGRAMS AND SERVICES FOR ELs AND THEIR FAMILIES (CONTINUED)",null,null,null,null,null,null,null,null,null,null,null,null,null,null,null,"E.  PROGRAMS AND SERVICES FOR ELs AND THEIR FAMILIES (CONTINUED)",null,null,null,null,null,null,null,null,null,null,null,null,null,null,null,"E.  PROGRAMS AND SERVICES FOR ELs AND THEIR FAMILIES (CONTINUED)",null,null,null,null,null,null,null,null,null,null,null,null,null,null,null,"E.  PROGRAMS AND SERVICES FOR ELs AND THEIR FAMILIES (CONTINUED)",null,null,null,null,null,null,null,null,null,null,null,null,null,null,null,"E.  PROGRAMS AND SERVICES FOR ELs AND THEIR FAMILIES (CONTINUED)",null,null,null,null,null,null,null,null,null,null,null,null,null,null,null,"E.  PROGRAMS AND SERVICES FOR ELs AND THEIR FAMILIES (CONTINUED)",null,null,null,null,null,null,null,null,null,null,null,null,null,null,null,"E.  PROGRAMS AND SERVICES FOR ELs AND THEIR FAMILIES (CONTINUED)",null,null,null,null,null,null,null,null,null,null,null,null,null,null,null,"E.  PROGRAMS AND SERVICES FOR ELs AND THEIR FAMILIES (CONTINUED)",null,null,null,null,null,null,null,null,null,null,null,null,null,null,null,"E.  PROGRAMS AND SERVICES FOR ELs AND THEIR FAMILIES (CONTINUED)",null,null,null,null,null,null,null,null,null,null,null,null,null,null,null,"E.  PROGRAMS AND SERVICES FOR ELs AND THEIR FAMILIES (CONTINUED)",null,null,null,null,null,null,null,null,null,null,null,null,null,null,null,"E.  PROGRAMS AND SERVICES FOR ELs AND THEIR FAMILIES (CONTINUED)",null,null,null,null,null,null,null,null,null,null,null,null,null,null,null,"E.  PROGRAMS AND SERVICES FOR ELs AND THEIR FAMILIES (CONTINUED)",null,null,null,null,null,null,null,null,null,null,null,null,null,null,null,"E.  PROGRAMS AND SERVICES FOR ELs AND THEIR FAMILIES (CONTINUED)",null,null,null,null,null,null,null,null,null,null,null,null,null,null,null,"E.  PROGRAMS AND SERVICES FOR ELs AND THEIR FAMILIES (CONTINUED)",null,null,null,null,null,null,null,null,null,null,null,null,null,null,null,"E.  PROGRAMS AND SERVICES FOR ELs AND THEIR FAMILIES (CONTINUED)",null,null,null,null,null,null,null,null,null,null,null,null,null,null,null,"E.  PROGRAMS AND SERVICES FOR ELs AND THEIR FAMILIES (CONTINUED)",null,null,null,null,null,null,null,null,null,null,null,null,null,null,null,"E.  PROGRAMS AND SERVICES FOR ELs AND THEIR FAMILIES (CONTINUED)",null,null,null,null,null,null,null,null,null,null,null,null,null,null,null,"E.  PROGRAMS AND SERVICES FOR ELs AND THEIR FAMILIES (CONTINUED)",null,null,null,null,null,null,null,null,null,null,null,null,null,null,null,"E.  PROGRAMS AND SERVICES FOR ELs AND THEIR FAMILIES (CONTINUED)",null,null,null,null,null,null,null,null,null,null,null,null,null,null,null,"E.  PROGRAMS AND SERVICES FOR ELs AND THEIR FAMILIES (CONTINUED)",null,null,null,null,null,null,null,null,null,null,null,null,null,null,null,"E.  PROGRAMS AND SERVICES FOR ELs AND THEIR FAMILIES (CONTINUED)",null,null,null,null,null,null,null,null,null,null,null,null,null,null,null,"E.  PROGRAMS AND SERVICES FOR ELs AND THEIR FAMILIES (CONTINUED)",null,null,null,null,null,null,null,null,null,null,null,null,null,null,null,"E.  PROGRAMS AND SERVICES FOR ELs AND THEIR FAMILIES (CONTINUED)",null,null,null,null,null,null,null,null,null,null,null,null,null,null,null,"E.  PROGRAMS AND SERVICES FOR ELs AND THEIR FAMILIES (CONTINUED)",null,null,null,null,null,null,null,null,null,null,null,null,null,null,null,"E.  PROGRAMS AND SERVICES FOR ELs AND THEIR FAMILIES (CONTINUED)",null,null,null,null,null,null,null,null,null,null,null,null,null,null,null,"E.  PROGRAMS AND SERVICES FOR ELs AND THEIR FAMILIES (CONTINUED)",null,null,null,null,null,null,null,null,null,null,null,null,null,null,null,"E.  PROGRAMS AND SERVICES FOR ELs AND THEIR FAMILIES (CONTINUED)",null,null,null,null,null,null,null,null,null,null,null,null,null,null,null,"E.  PROGRAMS AND SERVICES FOR ELs AND THEIR FAMILIES (CONTINUED)",null,null,null,null,null,null,null,null,null,null,null,null,null,null,null,"E.  PROGRAMS AND SERVICES FOR ELs AND THEIR FAMILIES (CONTINUED)",null,null,null,null,null,null,null,null,null,null,null,null,null,null,null,"E.  PROGRAMS AND SERVICES FOR ELs AND THEIR FAMILIES (CONTINUED)",null,null,null,null,null,null,null,null,null,null,null,null,null,null,null,"E.  PROGRAMS AND SERVICES FOR ELs AND THEIR FAMILIES (CONTINUED)",null,null,null,null,null,null,null,null,null,null,null,null,null,null,null,"E.  PROGRAMS AND SERVICES FOR ELs AND THEIR FAMILIES (CONTINUED)",null,null,null,null,null,null,null,null,null,null,null,null,null,null,null,"E.  PROGRAMS AND SERVICES FOR ELs AND THEIR FAMILIES (CONTINUED)",null,null,null,null,null,null,null,null,null,null,null,null,null,null,null,"E.  PROGRAMS AND SERVICES FOR ELs AND THEIR FAMILIES (CONTINUED)",null,null,null,null,null,null,null,null,null,null,null,null,null,null,null,"E.  PROGRAMS AND SERVICES FOR ELs AND THEIR FAMILIES (CONTINUED)",null,null,null,null,null,null,null,null,null,null,null,null,null,null,null,"E.  PROGRAMS AND SERVICES FOR ELs AND THEIR FAMILIES (CONTINUED)",null,null,null,null,null,null,null,null,null,null,null,null,null,null,null,"E.  PROGRAMS AND SERVICES FOR ELs AND THEIR FAMILIES (CONTINUED)",null,null,null,null,null,null,null,null,null,null,null,null,null,null,null,"E.  PROGRAMS AND SERVICES FOR ELs AND THEIR FAMILIES (CONTINUED)",null,null,null,null,null,null,null,null,null,null,null,null,null,null,null,"E.  PROGRAMS AND SERVICES FOR ELs AND THEIR FAMILIES (CONTINUED)",null,null,null,null,null,null,null,null,null,null,null,null,null,null,null,"E.  PROGRAMS AND SERVICES FOR ELs AND THEIR FAMILIES (CONTINUED)",null,null,null,null,null,null,null,null,null,null,null,null,null,null,null,"E.  PROGRAMS AND SERVICES FOR ELs AND THEIR FAMILIES (CONTINUED)",null,null,null,null,null,null,null,null,null,null,null,null,null,null,null,"E.  PROGRAMS AND SERVICES FOR ELs AND THEIR FAMILIES (CONTINUED)",null,null,null,null,null,null,null,null,null,null,null,null,null,null,null,"E.  PROGRAMS AND SERVICES FOR ELs AND THEIR FAMILIES (CONTINUED)",null,null,null,null,null,null,null,null,null,null,null,null,null,null,null,"E.  PROGRAMS AND SERVICES FOR ELs AND THEIR FAMILIES (CONTINUED)",null,null,null,null,null,null,null,null,null,null,null,null,null,null,null,"E.  PROGRAMS AND SERVICES FOR ELs AND THEIR FAMILIES (CONTINUED)",null,null,null,null,null,null,null,null,null,null,null,null,null,null,null,"E.  PROGRAMS AND SERVICES FOR ELs AND THEIR FAMILIES (CONTINUED)",null,null,null,null,null,null,null,null,null,null,null,null,null,null,null,"E.  PROGRAMS AND SERVICES FOR ELs AND THEIR FAMILIES (CONTINUED)",null,null,null,null,null,null,null,null,null,null,null,null,null,null,null,"E.  PROGRAMS AND SERVICES FOR ELs AND THEIR FAMILIES (CONTINUED)",null,null,null,null,null,null,null,null,null,null,null,null,null,null,null,"E.  PROGRAMS AND SERVICES FOR ELs AND THEIR FAMILIES (CONTINUED)",null,null,null,null,null,null,null,null,null,null,null,null,null,null,null,"E.  PROGRAMS AND SERVICES FOR ELs AND THEIR FAMILIES (CONTINUED)",null,null,null,null,null,null,null,null,null,null,null,null,null,null,null,"E.  PROGRAMS AND SERVICES FOR ELs AND THEIR FAMILIES (CONTINUED)",null,null,null,null,null,null,null,null,null,null,null,null,null,null,null,"E.  PROGRAMS AND SERVICES FOR ELs AND THEIR FAMILIES (CONTINUED)",null,null,null,null,null,null,null,null,null,null,null,null,null,null,null,"E.  PROGRAMS AND SERVICES FOR ELs AND THEIR FAMILIES (CONTINUED)",null,null,null,null,null,null,null,null,null,null,null,null,null,null,null,"E.  PROGRAMS AND SERVICES FOR ELs AND THEIR FAMILIES (CONTINUED)",null,null,null,null,null,null,null,null,null,null,null,null,null,null,null,"E.  PROGRAMS AND SERVICES FOR ELs AND THEIR FAMILIES (CONTINUED)",null,null,null,null,null,null,null,null,null,null,null,null,null,null,null,"E.  PROGRAMS AND SERVICES FOR ELs AND THEIR FAMILIES (CONTINUED)",null,null,null,null,null,null,null,null,null,null,null,null,null,null,null,"E.  PROGRAMS AND SERVICES FOR ELs AND THEIR FAMILIES (CONTINUED)",null,null,null,null,null,null,null,null,null,null,null,null,null,null,null,"E.  PROGRAMS AND SERVICES FOR ELs AND THEIR FAMILIES (CONTINUED)",null,null,null,null,null,null,null,null,null,null,null,null,null,null,null,"E.  PROGRAMS AND SERVICES FOR ELs AND THEIR FAMILIES (CONTINUED)",null,null,null,null,null,null,null,null,null,null,null,null,null,null,null,"E.  PROGRAMS AND SERVICES FOR ELs AND THEIR FAMILIES (CONTINUED)",null,null,null,null,null,null,null,null,null,null,null,null,null,null,null,"E.  PROGRAMS AND SERVICES FOR ELs AND THEIR FAMILIES (CONTINUED)",null,null,null,null,null,null,null,null,null,null,null,null,null,null,null,"E.  PROGRAMS AND SERVICES FOR ELs AND THEIR FAMILIES (CONTINUED)",null,null,null,null,null,null,null,null,null,null,null,null,null,null,null,"E.  PROGRAMS AND SERVICES FOR ELs AND THEIR FAMILIES (CONTINUED)",null,null,null,null,null,null,null,null,null,null,null,null,null,null,null,"E.  PROGRAMS AND SERVICES FOR ELs AND THEIR FAMILIES (CONTINUED)",null,null,null,null,null,null,null,null,null,null,null,null,null,null,null,"E.  PROGRAMS AND SERVICES FOR ELs AND THEIR FAMILIES (CONTINUED)",null,null,null,null,null,null,null,null,null,null,null,null,null,null,null,"E.  PROGRAMS AND SERVICES FOR ELs AND THEIR FAMILIES (CONTINUED)",null,null,null,null,null,null,null,null,null,null,null,null,null,null,null,"E.  PROGRAMS AND SERVICES FOR ELs AND THEIR FAMILIES (CONTINUED)",null,null,null,null,null,null,null,null,null,null,null,null,null,null,null,"E.  PROGRAMS AND SERVICES FOR ELs AND THEIR FAMILIES (CONTINUED)",null,null,null,null,null,null,null,null,null,null,null,null,null,null,null,"E.  PROGRAMS AND SERVICES FOR ELs AND THEIR FAMILIES (CONTINUED)",null,null,null,null,null,null,null,null,null,null,null,null,null,null,null,"E.  PROGRAMS AND SERVICES FOR ELs AND THEIR FAMILIES (CONTINUED)",null,null,null,null,null,null,null,null,null,null,null,null,null,null,null,"E.  PROGRAMS AND SERVICES FOR ELs AND THEIR FAMILIES (CONTINUED)",null,null,null,null,null,null,null,null,null,null,null,null,null,null,null,"E.  PROGRAMS AND SERVICES FOR ELs AND THEIR FAMILIES (CONTINUED)",null,null,null,null,null,null,null,null,null,null,null,null,null,null,null,"E.  PROGRAMS AND SERVICES FOR ELs AND THEIR FAMILIES (CONTINUED)",null,null,null,null,null,null,null,null,null,null,null,null,null,null,null,"E.  PROGRAMS AND SERVICES FOR ELs AND THEIR FAMILIES (CONTINUED)",null,null,null,null,null,null,null,null,null,null,null,null,null,null,null,"E.  PROGRAMS AND SERVICES FOR ELs AND THEIR FAMILIES (CONTINUED)",null,null,null,null,null,null,null,null,null,null,null,null,null,null,null,"E.  PROGRAMS AND SERVICES FOR ELs AND THEIR FAMILIES (CONTINUED)",null,null,null,null,null,null,null,null,null,null,null,null,null,null,null,"E.  PROGRAMS AND SERVICES FOR ELs AND THEIR FAMILIES (CONTINUED)",null,null,null,null,null,null,null,null,null,null,null,null,null,null,null,"E.  PROGRAMS AND SERVICES FOR ELs AND THEIR FAMILIES (CONTINUED)",null,null,null,null,null,null,null,null,null,null,null,null,null,null,null,"E.  PROGRAMS AND SERVICES FOR ELs AND THEIR FAMILIES (CONTINUED)",null,null,null,null,null,null,null,null,null,null,null,null,null,null,null,"E.  PROGRAMS AND SERVICES FOR ELs AND THEIR FAMILIES (CONTINUED)",null,null,null,null,null,null,null,null,null,null,null,null,null,null,null,"E.  PROGRAMS AND SERVICES FOR ELs AND THEIR FAMILIES (CONTINUED)",null,null,null,null,null,null,null,null,null,null,null,null,null,null,null,"E.  PROGRAMS AND SERVICES FOR ELs AND THEIR FAMILIES (CONTINUED)",null,null,null,null,null,null,null,null,null,null,null,null,null,null,null,"E.  PROGRAMS AND SERVICES FOR ELs AND THEIR FAMILIES (CONTINUED)",null,null,null,null,null,null,null,null,null,null,null,null,null,null,null,"E.  PROGRAMS AND SERVICES FOR ELs AND THEIR FAMILIES (CONTINUED)",null,null,null,null,null,null,null,null,null,null,null,null,null,null,null,"E.  PROGRAMS AND SERVICES FOR ELs AND THEIR FAMILIES (CONTINUED)",null,null,null,null,null,null,null,null,null,null,null,null,null,null,null,"E.  PROGRAMS AND SERVICES FOR ELs AND THEIR FAMILIES (CONTINUED)",null,null,null,null,null,null,null,null,null,null,null,null,null,null,null,"E.  PROGRAMS AND SERVICES FOR ELs AND THEIR FAMILIES (CONTINUED)",null,null,null,null,null,null,null,null,null,null,null,null,null,null,null,"E.  PROGRAMS AND SERVICES FOR ELs AND THEIR FAMILIES (CONTINUED)",null,null,null,null,null,null,null,null,null,null,null,null,null,null,null,"E.  PROGRAMS AND SERVICES FOR ELs AND THEIR FAMILIES (CONTINUED)",null,null,null,null,null,null,null,null,null,null,null,null,null,null,null,"E.  PROGRAMS AND SERVICES FOR ELs AND THEIR FAMILIES (CONTINUED)",null,null,null,null,null,null,null,null,null,null,null,null,null,null,null,"E.  PROGRAMS AND SERVICES FOR ELs AND THEIR FAMILIES (CONTINUED)",null,null,null,null,null,null,null,null,null,null,null,null,null,null,null,"E.  PROGRAMS AND SERVICES FOR ELs AND THEIR FAMILIES (CONTINUED)",null,null,null,null,null,null,null,null,null,null,null,null,null,null,null,"E.  PROGRAMS AND SERVICES FOR ELs AND THEIR FAMILIES (CONTINUED)",null,null,null,null,null,null,null,null,null,null,null,null,null,null,null,"E.  PROGRAMS AND SERVICES FOR ELs AND THEIR FAMILIES (CONTINUED)",null,null,null,null,null,null,null,null,null,null,null,null,null,null,null,"E.  PROGRAMS AND SERVICES FOR ELs AND THEIR FAMILIES (CONTINUED)",null,null,null,null,null,null,null,null,null,null,null,null,null,null,null,"E.  PROGRAMS AND SERVICES FOR ELs AND THEIR FAMILIES (CONTINUED)",null,null,null,null,null,null,null,null,null,null,null,null,null,null,null,"E.  PROGRAMS AND SERVICES FOR ELs AND THEIR FAMILIES (CONTINUED)",null,null,null,null,null,null,null,null,null,null,null,null,null,null,null,"E.  PROGRAMS AND SERVICES FOR ELs AND THEIR FAMILIES (CONTINUED)",null,null,null,null,null,null,null,null,null,null,null,null,null,null,null,"E.  PROGRAMS AND SERVICES FOR ELs AND THEIR FAMILIES (CONTINUED)",null,null,null,null,null,null,null,null,null,null,null,null,null,null,null,"E.  PROGRAMS AND SERVICES FOR ELs AND THEIR FAMILIES (CONTINUED)",null,null,null,null,null,null,null,null,null,null,null,null,null,null,null,"E.  PROGRAMS AND SERVICES FOR ELs AND THEIR FAMILIES (CONTINUED)",null,null,null,null,null,null,null,null,null,null,null,null,null,null,null,"E.  PROGRAMS AND SERVICES FOR ELs AND THEIR FAMILIES (CONTINUED)",null,null,null,null,null,null,null,null,null,null,null,null,null,null,null,"E.  PROGRAMS AND SERVICES FOR ELs AND THEIR FAMILIES (CONTINUED)",null,null,null,null,null,null,null,null,null,null,null,null,null,null,null,"E.  PROGRAMS AND SERVICES FOR ELs AND THEIR FAMILIES (CONTINUED)",null,null,null,null,null,null,null,null,null,null,null,null,null,null,null,"E.  PROGRAMS AND SERVICES FOR ELs AND THEIR FAMILIES (CONTINUED)",null,null,null,null,null,null,null,null,null,null,null,null,null,null,null,"E.  PROGRAMS AND SERVICES FOR ELs AND THEIR FAMILIES (CONTINUED)",null,null,null,null,null,null,null,null,null,null,null,null,null,null,null,"E.  PROGRAMS AND SERVICES FOR ELs AND THEIR FAMILIES (CONTINUED)",null,null,null,null,null,null,null,null,null,null,null,null,null,null,null,"E.  PROGRAMS AND SERVICES FOR ELs AND THEIR FAMILIES (CONTINUED)",null,null,null,null,null,null,null,null,null,null,null,null,null,null,null,"E.  PROGRAMS AND SERVICES FOR ELs AND THEIR FAMILIES (CONTINUED)",null,null,null,null,null,null,null,null,null,null,null,null,null,null,null,"E.  PROGRAMS AND SERVICES FOR ELs AND THEIR FAMILIES (CONTINUED)",null,null,null,null,null,null,null,null,null,null,null,null,null,null,null,"E.  PROGRAMS AND SERVICES FOR ELs AND THEIR FAMILIES (CONTINUED)",null,null,null,null,null,null,null,null,null,null,null,null,null,null,null,"E.  PROGRAMS AND SERVICES FOR ELs AND THEIR FAMILIES (CONTINUED)",null,null,null,null,null,null,null,null,null,null,null,null,null,null,null,"E.  PROGRAMS AND SERVICES FOR ELs AND THEIR FAMILIES (CONTINUED)",null,null,null,null,null,null,null,null,null,null,null,null,null,null,null,"E.  PROGRAMS AND SERVICES FOR ELs AND THEIR FAMILIES (CONTINUED)",null,null,null,null,null,null,null,null,null,null,null,null,null,null,null,"E.  PROGRAMS AND SERVICES FOR ELs AND THEIR FAMILIES (CONTINUED)",null,null,null,null,null,null,null,null,null,null,null,null,null,null,null,"E.  PROGRAMS AND SERVICES FOR ELs AND THEIR FAMILIES (CONTINUED)",null,null,null,null,null,null,null,null,null,null,null,null,null,null,null,"E.  PROGRAMS AND SERVICES FOR ELs AND THEIR FAMILIES (CONTINUED)",null,null,null,null,null,null,null,null,null,null,null,null,null,null,null,"E.  PROGRAMS AND SERVICES FOR ELs AND THEIR FAMILIES (CONTINUED)",null,null,null,null,null,null,null,null,null,null,null,null,null,null,null,"E.  PROGRAMS AND SERVICES FOR ELs AND THEIR FAMILIES (CONTINUED)",null,null,null,null,null,null,null,null,null,null,null,null,null,null,null,"E.  PROGRAMS AND SERVICES FOR ELs AND THEIR FAMILIES (CONTINUED)",null,null,null,null,null,null,null,null,null,null,null,null,null,null,null,"E.  PROGRAMS AND SERVICES FOR ELs AND THEIR FAMILIES (CONTINUED)",null,null,null,null,null,null,null,null,null,null,null,null,null,null,null,"E.  PROGRAMS AND SERVICES FOR ELs AND THEIR FAMILIES (CONTINUED)",null,null,null,null,null,null,null,null,null,null,null,null,null,null,null,"E.  PROGRAMS AND SERVICES FOR ELs AND THEIR FAMILIES (CONTINUED)",null,null,null,null,null,null,null,null,null,null,null,null,null,null,null,"E.  PROGRAMS AND SERVICES FOR ELs AND THEIR FAMILIES (CONTINUED)",null,null,null,null,null,null,null,null,null,null,null,null,null,null,null,"E.  PROGRAMS AND SERVICES FOR ELs AND THEIR FAMILIES (CONTINUED)",null,null,null,null,null,null,null,null,null,null,null,null,null,null,null,"E.  PROGRAMS AND SERVICES FOR ELs AND THEIR FAMILIES (CONTINUED)",null,null,null,null,null,null,null,null,null,null,null,null,null,null,null,"E.  PROGRAMS AND SERVICES FOR ELs AND THEIR FAMILIES (CONTINUED)",null,null,null,null,null,null,null,null,null,null,null,null,null,null,null,"E.  PROGRAMS AND SERVICES FOR ELs AND THEIR FAMILIES (CONTINUED)",null,null,null,null,null,null,null,null,null,null,null,null,null,null,null,"E.  PROGRAMS AND SERVICES FOR ELs AND THEIR FAMILIES (CONTINUED)",null,null,null,null,null,null,null,null,null,null,null,null,null,null,null,"E.  PROGRAMS AND SERVICES FOR ELs AND THEIR FAMILIES (CONTINUED)",null,null,null,null,null,null,null,null,null,null,null,null,null,null,null,"E.  PROGRAMS AND SERVICES FOR ELs AND THEIR FAMILIES (CONTINUED)",null,null,null,null,null,null,null,null,null,null,null,null,null,null,null,"E.  PROGRAMS AND SERVICES FOR ELs AND THEIR FAMILIES (CONTINUED)",null,null,null,null,null,null,null,null,null,null,null,null,null,null,null,"E.  PROGRAMS AND SERVICES FOR ELs AND THEIR FAMILIES (CONTINUED)",null,null,null,null,null,null,null,null,null,null,null,null,null,null,null,"E.  PROGRAMS AND SERVICES FOR ELs AND THEIR FAMILIES (CONTINUED)",null,null,null,null,null,null,null,null,null,null,null,null,null,null,null,"E.  PROGRAMS AND SERVICES FOR ELs AND THEIR FAMILIES (CONTINUED)",null,null,null,null,null,null,null,null,null,null,null,null,null,null,null,"E.  PROGRAMS AND SERVICES FOR ELs AND THEIR FAMILIES (CONTINUED)",null,null,null,null,null,null,null,null,null,null,null,null,null,null,null,"E.  PROGRAMS AND SERVICES FOR ELs AND THEIR FAMILIES (CONTINUED)",null,null,null,null,null,null,null,null,null,null,null,null,null,null,null,"E.  PROGRAMS AND SERVICES FOR ELs AND THEIR FAMILIES (CONTINUED)",null,null,null,null,null,null,null,null,null,null,null,null,null,null,null,"E.  PROGRAMS AND SERVICES FOR ELs AND THEIR FAMILIES (CONTINUED)",null,null,null,null,null,null,null,null,null,null,null,null,null,null,null,"E.  PROGRAMS AND SERVICES FOR ELs AND THEIR FAMILIES (CONTINUED)",null,null,null,null,null,null,null,null,null,null,null,null,null,null,null,"E.  PROGRAMS AND SERVICES FOR ELs AND THEIR FAMILIES (CONTINUED)",null,null,null,null,null,null,null,null,null,null,null,null,null,null,null,"E.  PROGRAMS AND SERVICES FOR ELs AND THEIR FAMILIES (CONTINUED)",null,null,null,null,null,null,null,null,null,null,null,null,null,null,null,"E.  PROGRAMS AND SERVICES FOR ELs AND THEIR FAMILIES (CONTINUED)",null,null,null,null,null,null,null,null,null,null,null,null,null,null,null,"E.  PROGRAMS AND SERVICES FOR ELs AND THEIR FAMILIES (CONTINUED)",null,null,null,null,null,null,null,null,null,null,null,null,null,null,null,"E.  PROGRAMS AND SERVICES FOR ELs AND THEIR FAMILIES (CONTINUED)",null,null,null,null,null,null,null,null,null,null,null,null,null,null,null,"E.  PROGRAMS AND SERVICES FOR ELs AND THEIR FAMILIES (CONTINUED)",null,null,null,null,null,null,null,null,null,null,null,null,null,null,null,"E.  PROGRAMS AND SERVICES FOR ELs AND THEIR FAMILIES (CONTINUED)",null,null,null,null,null,null,null,null,null,null,null,null,null,null,null,"E.  PROGRAMS AND SERVICES FOR ELs AND THEIR FAMILIES (CONTINUED)",null,null,null,null,null,null,null,null,null,null,null,null,null,null,null,"E.  PROGRAMS AND SERVICES FOR ELs AND THEIR FAMILIES (CONTINUED)",null,null,null,null,null,null,null,null,null,null,null,null,null,null,null,"E.  PROGRAMS AND SERVICES FOR ELs AND THEIR FAMILIES (CONTINUED)",null,null,null,null,null,null,null,null,null,null,null,null,null,null,null,"E.  PROGRAMS AND SERVICES FOR ELs AND THEIR FAMILIES (CONTINUED)",null,null,null,null,null,null,null,null,null,null,null,null,null,null,null,"E.  PROGRAMS AND SERVICES FOR ELs AND THEIR FAMILIES (CONTINUED)",null,null,null,null,null,null,null,null,null,null,null,null,null,null,null,"E.  PROGRAMS AND SERVICES FOR ELs AND THEIR FAMILIES (CONTINUED)",null,null,null,null,null,null,null,null,null,null,null,null,null,null,null,"E.  PROGRAMS AND SERVICES FOR ELs AND THEIR FAMILIES (CONTINUED)",null,null,null,null,null,null,null,null,null,null,null,null,null,null,null,"E.  PROGRAMS AND SERVICES FOR ELs AND THEIR FAMILIES (CONTINUED)",null,null,null,null,null,null,null,null,null,null,null,null,null,null,null,"E.  PROGRAMS AND SERVICES FOR ELs AND THEIR FAMILIES (CONTINUED)",null,null,null,null,null,null,null,null,null,null,null,null,null,null,null,"E.  PROGRAMS AND SERVICES FOR ELs AND THEIR FAMILIES (CONTINUED)",null,null,null,null,null,null,null,null,null,null,null,null,null,null,null,"E.  PROGRAMS AND SERVICES FOR ELs AND THEIR FAMILIES (CONTINUED)",null,null,null,null,null,null,null,null,null,null,null,null,null,null,null,"E.  PROGRAMS AND SERVICES FOR ELs AND THEIR FAMILIES (CONTINUED)",null,null,null,null,null,null,null,null,null,null,null,null,null,null,null,"E.  PROGRAMS AND SERVICES FOR ELs AND THEIR FAMILIES (CONTINUED)",null,null,null,null,null,null,null,null,null,null,null,null,null,null,null,"E.  PROGRAMS AND SERVICES FOR ELs AND THEIR FAMILIES (CONTINUED)",null,null,null,null,null,null,null,null,null,null,null,null,null,null,null,"E.  PROGRAMS AND SERVICES FOR ELs AND THEIR FAMILIES (CONTINUED)",null,null,null,null,null,null,null,null,null,null,null,null,null,null,null,"E.  PROGRAMS AND SERVICES FOR ELs AND THEIR FAMILIES (CONTINUED)",null,null,null,null,null,null,null,null,null,null,null,null,null,null,null,"E.  PROGRAMS AND SERVICES FOR ELs AND THEIR FAMILIES (CONTINUED)",null,null,null,null,null,null,null,null,null,null,null,null,null,null,null,"E.  PROGRAMS AND SERVICES FOR ELs AND THEIR FAMILIES (CONTINUED)",null,null,null,null,null,null,null,null,null,null,null,null,null,null,null,"E.  PROGRAMS AND SERVICES FOR ELs AND THEIR FAMILIES (CONTINUED)",null,null,null,null,null,null,null,null,null,null,null,null,null,null,null,"E.  PROGRAMS AND SERVICES FOR ELs AND THEIR FAMILIES (CONTINUED)",null,null,null,null,null,null,null,null,null,null,null,null,null,null,null,"E.  PROGRAMS AND SERVICES FOR ELs AND THEIR FAMILIES (CONTINUED)",null,null,null,null,null,null,null,null,null,null,null,null,null,null,null,"E.  PROGRAMS AND SERVICES FOR ELs AND THEIR FAMILIES (CONTINUED)",null,null,null,null,null,null,null,null,null,null,null,null,null,null,null,"E.  PROGRAMS AND SERVICES FOR ELs AND THEIR FAMILIES (CONTINUED)",null,null,null,null,null,null,null,null,null,null,null,null,null,null,null,"E.  PROGRAMS AND SERVICES FOR ELs AND THEIR FAMILIES (CONTINUED)",null,null,null,null,null,null,null,null,null,null,null,null,null,null,null,"E.  PROGRAMS AND SERVICES FOR ELs AND THEIR FAMILIES (CONTINUED)",null,null,null,null,null,null,null,null,null,null,null,null,null,null,null,"E.  PROGRAMS AND SERVICES FOR ELs AND THEIR FAMILIES (CONTINUED)",null,null,null,null,null,null,null,null,null,null,null,null,null,null,null,"E.  PROGRAMS AND SERVICES FOR ELs AND THEIR FAMILIES (CONTINUED)",null,null,null,null,null,null,null,null,null,null,null,null,null,null,null,"E.  PROGRAMS AND SERVICES FOR ELs AND THEIR FAMILIES (CONTINUED)",null,null,null,null,null,null,null,null,null,null,null,null,null,null,null,"E.  PROGRAMS AND SERVICES FOR ELs AND THEIR FAMILIES (CONTINUED)",null,null,null,null,null,null,null,null,null,null,null,null,null,null,null,"E.  PROGRAMS AND SERVICES FOR ELs AND THEIR FAMILIES (CONTINUED)",null,null,null,null,null,null,null,null,null,null,null,null,null,null,null,"E.  PROGRAMS AND SERVICES FOR ELs AND THEIR FAMILIES (CONTINUED)",null,null,null,null,null,null,null,null,null,null,null,null,null,null,null,"E.  PROGRAMS AND SERVICES FOR ELs AND THEIR FAMILIES (CONTINUED)",null,null,null,null,null,null,null,null,null,null,null,null,null,null,null,"E.  PROGRAMS AND SERVICES FOR ELs AND THEIR FAMILIES (CONTINUED)",null,null,null,null,null,null,null,null,null,null,null,null,null,null,null,"E.  PROGRAMS AND SERVICES FOR ELs AND THEIR FAMILIES (CONTINUED)",null,null,null,null,null,null,null,null,null,null,null,null,null,null,null,"E.  PROGRAMS AND SERVICES FOR ELs AND THEIR FAMILIES (CONTINUED)",null,null,null,null,null,null,null,null,null,null,null,null,null,null,null,"E.  PROGRAMS AND SERVICES FOR ELs AND THEIR FAMILIES (CONTINUED)",null,null,null,null,null,null,null,null,null,null,null,null,null,null,null,"E.  PROGRAMS AND SERVICES FOR ELs AND THEIR FAMILIES (CONTINUED)",null,null,null,null,null,null,null,null,null,null,null,null,null,null,null,"E.  PROGRAMS AND SERVICES FOR ELs AND THEIR FAMILIES (CONTINUED)",null,null,null,null,null,null,null,null,null,null,null,null,null,null,null,"E.  PROGRAMS AND SERVICES FOR ELs AND THEIR FAMILIES (CONTINUED)",null,null,null,null,null,null,null,null,null,null,null,null,null,null,null,"E.  PROGRAMS AND SERVICES FOR ELs AND THEIR FAMILIES (CONTINUED)",null,null,null,null,null,null,null,null,null,null,null,null,null,null,null,"E.  PROGRAMS AND SERVICES FOR ELs AND THEIR FAMILIES (CONTINUED)",null,null,null,null,null,null,null,null,null,null,null,null,null,null,null,"E.  PROGRAMS AND SERVICES FOR ELs AND THEIR FAMILIES (CONTINUED)",null,null,null,null,null,null,null,null,null,null,null,null,null,null,null,"E.  PROGRAMS AND SERVICES FOR ELs AND THEIR FAMILIES (CONTINUED)",null,null,null,null,null,null,null,null,null,null,null,null,null,null,null,"E.  PROGRAMS AND SERVICES FOR ELs AND THEIR FAMILIES (CONTINUED)",null,null,null,null,null,null,null,null,null,null,null,null,null,null,null,"E.  PROGRAMS AND SERVICES FOR ELs AND THEIR FAMILIES (CONTINUED)",null,null,null,null,null,null,null,null,null,null,null,null,null,null,null,"E.  PROGRAMS AND SERVICES FOR ELs AND THEIR FAMILIES (CONTINUED)",null,null,null,null,null,null,null,null,null,null,null,null,null,null,null,"E.  PROGRAMS AND SERVICES FOR ELs AND THEIR FAMILIES (CONTINUED)",null,null,null,null,null,null,null,null,null,null,null,null,null,null,null,"E.  PROGRAMS AND SERVICES FOR ELs AND THEIR FAMILIES (CONTINUED)",null,null,null,null,null,null,null,null,null,null,null,null,null,null,null,"E.  PROGRAMS AND SERVICES FOR ELs AND THEIR FAMILIES (CONTINUED)",null,null,null,null,null,null,null,null,null,null,null,null,null,null,null,"E.  PROGRAMS AND SERVICES FOR ELs AND THEIR FAMILIES (CONTINUED)",null,null,null,null,null,null,null,null,null,null,null,null,null,null,null,"E.  PROGRAMS AND SERVICES FOR ELs AND THEIR FAMILIES (CONTINUED)",null,null,null,null,null,null,null,null,null,null,null,null,null,null,null,"E.  PROGRAMS AND SERVICES FOR ELs AND THEIR FAMILIES (CONTINUED)",null,null,null,null,null,null,null,null,null,null,null,null,null,null,null,"E.  PROGRAMS AND SERVICES FOR ELs AND THEIR FAMILIES (CONTINUED)",null,null,null,null,null,null,null,null,null,null,null,null,null,null,null,"E.  PROGRAMS AND SERVICES FOR ELs AND THEIR FAMILIES (CONTINUED)",null,null,null,null,null,null,null,null,null,null,null,null,null,null,null,"E.  PROGRAMS AND SERVICES FOR ELs AND THEIR FAMILIES (CONTINUED)",null,null,null,null,null,null,null,null,null,null,null,null,null,null,null,"E.  PROGRAMS AND SERVICES FOR ELs AND THEIR FAMILIES (CONTINUED)",null,null,null,null,null,null,null,null,null,null,null,null,null,null,null,"E.  PROGRAMS AND SERVICES FOR ELs AND THEIR FAMILIES (CONTINUED)",null,null,null,null,null,null,null,null,null,null,null,null,null,null,null,"E.  PROGRAMS AND SERVICES FOR ELs AND THEIR FAMILIES (CONTINUED)",null,null,null,null,null,null,null,null,null,null,null,null,null,null,null,"E.  PROGRAMS AND SERVICES FOR ELs AND THEIR FAMILIES (CONTINUED)",null,null,null,null,null,null,null,null,null,null,null,null,null,null,null,"E.  PROGRAMS AND SERVICES FOR ELs AND THEIR FAMILIES (CONTINUED)",null,null,null,null,null,null,null,null,null,null,null,null,null,null,null,"E.  PROGRAMS AND SERVICES FOR ELs AND THEIR FAMILIES (CONTINUED)",null,null,null,null,null,null,null,null,null,null,null,null,null,null,null,"E.  PROGRAMS AND SERVICES FOR ELs AND THEIR FAMILIES (CONTINUED)",null,null,null,null,null,null,null,null,null,null,null,null,null,null,null,"E.  PROGRAMS AND SERVICES FOR ELs AND THEIR FAMILIES (CONTINUED)",null,null,null,null,null,null,null,null,null,null,null,null,null,null,null,"E.  PROGRAMS AND SERVICES FOR ELs AND THEIR FAMILIES (CONTINUED)",null,null,null,null,null,null,null,null,null,null,null,null,null,null,null,"E.  PROGRAMS AND SERVICES FOR ELs AND THEIR FAMILIES (CONTINUED)",null,null,null,null,null,null,null,null,null,null,null,null,null,null,null,"E.  PROGRAMS AND SERVICES FOR ELs AND THEIR FAMILIES (CONTINUED)",null,null,null,null,null,null,null,null,null,null,null,null,null,null,null,"E.  PROGRAMS AND SERVICES FOR ELs AND THEIR FAMILIES (CONTINUED)",null,null,null,null,null,null,null,null,null,null,null,null,null,null,null,"E.  PROGRAMS AND SERVICES FOR ELs AND THEIR FAMILIES (CONTINUED)",null,null,null,null,null,null,null,null,null,null,null,null,null,null,null,"E.  PROGRAMS AND SERVICES FOR ELs AND THEIR FAMILIES (CONTINUED)",null,null,null,null,null,null,null,null,null,null,null,null,null,null,null,"E.  PROGRAMS AND SERVICES FOR ELs AND THEIR FAMILIES (CONTINUED)",null,null,null,null,null,null,null,null,null,null,null,null,null,null,null,"E.  PROGRAMS AND SERVICES FOR ELs AND THEIR FAMILIES (CONTINUED)",null,null,null,null,null,null,null,null,null,null,null,null,null,null,null,"E.  PROGRAMS AND SERVICES FOR ELs AND THEIR FAMILIES (CONTINUED)",null,null,null,null,null,null,null,null,null,null,null,null,null,null,null,"E.  PROGRAMS AND SERVICES FOR ELs AND THEIR FAMILIES (CONTINUED)",null,null,null,null,null,null,null,null,null,null,null,null,null,null,null,"E.  PROGRAMS AND SERVICES FOR ELs AND THEIR FAMILIES (CONTINUED)",null,null,null,null,null,null,null,null,null,null,null,null,null,null,null,"E.  PROGRAMS AND SERVICES FOR ELs AND THEIR FAMILIES (CONTINUED)",null,null,null,null,null,null,null,null,null,null,null,null,null,null,null,"E.  PROGRAMS AND SERVICES FOR ELs AND THEIR FAMILIES (CONTINUED)",null,null,null,null,null,null,null,null,null,null,null,null,null,null,null,"E.  PROGRAMS AND SERVICES FOR ELs AND THEIR FAMILIES (CONTINUED)",null,null,null,null,null,null,null,null,null,null,null,null,null,null,null,"E.  PROGRAMS AND SERVICES FOR ELs AND THEIR FAMILIES (CONTINUED)",null,null,null,null,null,null,null,null,null,null,null,null,null,null,null,"E.  PROGRAMS AND SERVICES FOR ELs AND THEIR FAMILIES (CONTINUED)",null,null,null,null,null,null,null,null,null,null,null,null,null,null,null,"E.  PROGRAMS AND SERVICES FOR ELs AND THEIR FAMILIES (CONTINUED)",null,null,null,null,null,null,null,null,null,null,null,null,null,null,null,"E.  PROGRAMS AND SERVICES FOR ELs AND THEIR FAMILIES (CONTINUED)",null,null,null,null,null,null,null,null,null,null,null,null,null,null,null,"E.  PROGRAMS AND SERVICES FOR ELs AND THEIR FAMILIES (CONTINUED)",null,null,null,null,null,null,null,null,null,null,null,null,null,null,null,"E.  PROGRAMS AND SERVICES FOR ELs AND THEIR FAMILIES (CONTINUED)",null,null,null,null,null,null,null,null,null,null,null,null,null,null,null,"E.  PROGRAMS AND SERVICES FOR ELs AND THEIR FAMILIES (CONTINUED)",null,null,null,null,null,null,null,null,null,null,null,null,null,null,null,"E.  PROGRAMS AND SERVICES FOR ELs AND THEIR FAMILIES (CONTINUED)",null,null,null,null,null,null,null,null,null,null,null,null,null,null,null,"E.  PROGRAMS AND SERVICES FOR ELs AND THEIR FAMILIES (CONTINUED)",null,null,null,null,null,null,null,null,null,null,null,null,null,null,null,"E.  PROGRAMS AND SERVICES FOR ELs AND THEIR FAMILIES (CONTINUED)",null,null,null,null,null,null,null,null,null,null,null,null,null,null,null,"E.  PROGRAMS AND SERVICES FOR ELs AND THEIR FAMILIES (CONTINUED)",null,null,null,null,null,null,null,null,null,null,null,null,null,null,null,"E.  PROGRAMS AND SERVICES FOR ELs AND THEIR FAMILIES (CONTINUED)",null,null,null,null,null,null,null,null,null,null,null,null,null,null,null,"E.  PROGRAMS AND SERVICES FOR ELs AND THEIR FAMILIES (CONTINUED)",null,null,null,null,null,null,null,null,null,null,null,null,null,null,null,"E.  PROGRAMS AND SERVICES FOR ELs AND THEIR FAMILIES (CONTINUED)",null,null,null,null,null,null,null,null,null,null,null,null,null,null,null,"E.  PROGRAMS AND SERVICES FOR ELs AND THEIR FAMILIES (CONTINUED)",null,null,null,null,null,null,null,null,null,null,null,null,null,null,null,"E.  PROGRAMS AND SERVICES FOR ELs AND THEIR FAMILIES (CONTINUED)",null,null,null,null,null,null,null,null,null,null,null,null,null,null,null,"E.  PROGRAMS AND SERVICES FOR ELs AND THEIR FAMILIES (CONTINUED)",null,null,null,null,null,null,null,null,null,null,null,null,null,null,null,"E.  PROGRAMS AND SERVICES FOR ELs AND THEIR FAMILIES (CONTINUED)",null,null,null,null,null,null,null,null,null,null,null,null,null,null,null,"E.  PROGRAMS AND SERVICES FOR ELs AND THEIR FAMILIES (CONTINUED)",null,null,null,null,null,null,null,null,null,null,null,null,null,null,null,"E.  PROGRAMS AND SERVICES FOR ELs AND THEIR FAMILIES (CONTINUED)",null,null,null,null,null,null,null,null,null,null,null,null,null,null,null,"E.  PROGRAMS AND SERVICES FOR ELs AND THEIR FAMILIES (CONTINUED)",null,null,null,null,null,null,null,null,null,null,null,null,null,null,null,"E.  PROGRAMS AND SERVICES FOR ELs AND THEIR FAMILIES (CONTINUED)",null,null,null,null,null,null,null,null,null,null,null,null,null,null,null,"E.  PROGRAMS AND SERVICES FOR ELs AND THEIR FAMILIES (CONTINUED)",null,null,null,null,null,null,null,null,null,null,null,null,null,null,null,"E.  PROGRAMS AND SERVICES FOR ELs AND THEIR FAMILIES (CONTINUED)",null,null,null,null,null,null,null,null,null,null,null,null,null,null,null,"E.  PROGRAMS AND SERVICES FOR ELs AND THEIR FAMILIES (CONTINUED)",null,null,null,null,null,null,null,null,null,null,null,null,null,null,null,"E.  PROGRAMS AND SERVICES FOR ELs AND THEIR FAMILIES (CONTINUED)",null,null,null,null,null,null,null,null,null,null,null,null,null,null,null,"E.  PROGRAMS AND SERVICES FOR ELs AND THEIR FAMILIES (CONTINUED)",null,null,null,null,null,null,null,null,null,null,null,null,null,null,null,"E.  PROGRAMS AND SERVICES FOR ELs AND THEIR FAMILIES (CONTINUED)",null,null,null,null,null,null,null,null,null,null,null,null,null,null,null,"E.  PROGRAMS AND SERVICES FOR ELs AND THEIR FAMILIES (CONTINUED)",null,null,null,null,null,null,null,null,null,null,null,null,null,null,null,"E.  PROGRAMS AND SERVICES FOR ELs AND THEIR FAMILIES (CONTINUED)",null,null,null,null,null,null,null,null,null,null,null,null,null,null,null,"E.  PROGRAMS AND SERVICES FOR ELs AND THEIR FAMILIES (CONTINUED)",null,null,null,null,null,null,null,null,null,null,null,null,null,null,null,"E.  PROGRAMS AND SERVICES FOR ELs AND THEIR FAMILIES (CONTINUED)",null,null,null,null,null,null,null,null,null,null,null,null,null,null,null,"E.  PROGRAMS AND SERVICES FOR ELs AND THEIR FAMILIES (CONTINUED)",null,null,null,null,null,null,null,null,null,null,null,null,null,null,null,"E.  PROGRAMS AND SERVICES FOR ELs AND THEIR FAMILIES (CONTINUED)",null,null,null,null,null,null,null,null,null,null,null,null,null,null,null,"E.  PROGRAMS AND SERVICES FOR ELs AND THEIR FAMILIES (CONTINUED)",null,null,null,null,null,null,null,null,null,null,null,null,null,null,null,"E.  PROGRAMS AND SERVICES FOR ELs AND THEIR FAMILIES (CONTINUED)",null,null,null,null,null,null,null,null,null,null,null,null,null,null,null,"E.  PROGRAMS AND SERVICES FOR ELs AND THEIR FAMILIES (CONTINUED)",null,null,null,null,null,null,null,null,null,null,null,null,null,null,null,"E.  PROGRAMS AND SERVICES FOR ELs AND THEIR FAMILIES (CONTINUED)",null,null,null,null,null,null,null,null,null,null,null,null,null,null,null,"E.  PROGRAMS AND SERVICES FOR ELs AND THEIR FAMILIES (CONTINUED)",null,null,null,null,null,null,null,null,null,null,null,null,null,null,null,"E.  PROGRAMS AND SERVICES FOR ELs AND THEIR FAMILIES (CONTINUED)",null,null,null,null,null,null,null,null,null,null,null,null,null,null,null,"E.  PROGRAMS AND SERVICES FOR ELs AND THEIR FAMILIES (CONTINUED)",null,null,null,null,null,null,null,null,null,null,null,null,null,null,null,"E.  PROGRAMS AND SERVICES FOR ELs AND THEIR FAMILIES (CONTINUED)",null,null,null,null,null,null,null,null,null,null,null,null,null,null,null,"E.  PROGRAMS AND SERVICES FOR ELs AND THEIR FAMILIES (CONTINUED)",null,null,null,null,null,null,null,null,null,null,null,null,null,null,null,"E.  PROGRAMS AND SERVICES FOR ELs AND THEIR FAMILIES (CONTINUED)",null,null,null,null,null,null,null,null,null,null,null,null,null,null,null,"E.  PROGRAMS AND SERVICES FOR ELs AND THEIR FAMILIES (CONTINUED)",null,null,null,null,null,null,null,null,null,null,null,null,null,null,null,"E.  PROGRAMS AND SERVICES FOR ELs AND THEIR FAMILIES (CONTINUED)",null,null,null,null,null,null,null,null,null,null,null,null,null,null,null,"E.  PROGRAMS AND SERVICES FOR ELs AND THEIR FAMILIES (CONTINUED)",null,null,null,null,null,null,null,null,null,null,null,null,null,null,null,"E.  PROGRAMS AND SERVICES FOR ELs AND THEIR FAMILIES (CONTINUED)",null,null,null,null,null,null,null,null,null,null,null,null,null,null,null,"E.  PROGRAMS AND SERVICES FOR ELs AND THEIR FAMILIES (CONTINUED)",null,null,null,null,null,null,null,null,null,null,null,null,null,null,null,"E.  PROGRAMS AND SERVICES FOR ELs AND THEIR FAMILIES (CONTINUED)",null,null,null,null,null,null,null,null,null,null,null,null,null,null,null,"E.  PROGRAMS AND SERVICES FOR ELs AND THEIR FAMILIES (CONTINUED)",null,null,null,null,null,null,null,null,null,null,null,null,null,null,null,"E.  PROGRAMS AND SERVICES FOR ELs AND THEIR FAMILIES (CONTINUED)",null,null,null,null,null,null,null,null,null,null,null,null,null,null,null,"E.  PROGRAMS AND SERVICES FOR ELs AND THEIR FAMILIES (CONTINUED)",null,null,null,null,null,null,null,null,null,null,null,null,null,null,null,"E.  PROGRAMS AND SERVICES FOR ELs AND THEIR FAMILIES (CONTINUED)",null,null,null,null,null,null,null,null,null,null,null,null,null,null,null,"E.  PROGRAMS AND SERVICES FOR ELs AND THEIR FAMILIES (CONTINUED)",null,null,null,null,null,null,null,null,null,null,null,null,null,null,null,"E.  PROGRAMS AND SERVICES FOR ELs AND THEIR FAMILIES (CONTINUED)",null,null,null,null,null,null,null,null,null,null,null,null,null,null,null,"E.  PROGRAMS AND SERVICES FOR ELs AND THEIR FAMILIES (CONTINUED)",null,null,null,null,null,null,null,null,null,null,null,null,null,null,null,"E.  PROGRAMS AND SERVICES FOR ELs AND THEIR FAMILIES (CONTINUED)",null,null,null,null,null,null,null,null,null,null,null,null,null,null,null,"E.  PROGRAMS AND SERVICES FOR ELs AND THEIR FAMILIES (CONTINUED)",null,null,null,null,null,null,null,null,null,null,null,null,null,null,null,"E.  PROGRAMS AND SERVICES FOR ELs AND THEIR FAMILIES (CONTINUED)",null,null,null,null,null,null,null,null,null,null,null,null,null,null,null,"E.  PROGRAMS AND SERVICES FOR ELs AND THEIR FAMILIES (CONTINUED)",null,null,null,null,null,null,null,null,null,null,null,null,null,null,null,"E.  PROGRAMS AND SERVICES FOR ELs AND THEIR FAMILIES (CONTINUED)",null,null,null,null,null,null,null,null,null,null,null,null,null,null,null,"E.  PROGRAMS AND SERVICES FOR ELs AND THEIR FAMILIES (CONTINUED)",null,null,null,null,null,null,null,null,null,null,null,null,null,null,null,"E.  PROGRAMS AND SERVICES FOR ELs AND THEIR FAMILIES (CONTINUED)",null,null,null,null,null,null,null,null,null,null,null,null,null,null,null,"E.  PROGRAMS AND SERVICES FOR ELs AND THEIR FAMILIES (CONTINUED)",null,null,null,null,null,null,null,null,null,null,null,null,null,null,null,"E.  PROGRAMS AND SERVICES FOR ELs AND THEIR FAMILIES (CONTINUED)",null,null,null,null,null,null,null,null,null,null,null,null,null,null,null,"E.  PROGRAMS AND SERVICES FOR ELs AND THEIR FAMILIES (CONTINUED)",null,null,null,null,null,null,null,null,null,null,null,null,null,null,null,"E.  PROGRAMS AND SERVICES FOR ELs AND THEIR FAMILIES (CONTINUED)",null,null,null,null,null,null,null,null,null,null,null,null,null,null,null,"E.  PROGRAMS AND SERVICES FOR ELs AND THEIR FAMILIES (CONTINUED)",null,null,null,null,null,null,null,null,null,null,null,null,null,null,null,"E.  PROGRAMS AND SERVICES FOR ELs AND THEIR FAMILIES (CONTINUED)",null,null,null,null,null,null,null,null,null,null,null,null,null,null,null,"E.  PROGRAMS AND SERVICES FOR ELs AND THEIR FAMILIES (CONTINUED)",null,null,null,null,null,null,null,null,null,null,null,null,null,null,null,"E.  PROGRAMS AND SERVICES FOR ELs AND THEIR FAMILIES (CONTINUED)",null,null,null,null,null,null,null,null,null,null,null,null,null,null,null,"E.  PROGRAMS AND SERVICES FOR ELs AND THEIR FAMILIES (CONTINUED)",null,null,null,null,null,null,null,null,null,null,null,null,null,null,null,"E.  PROGRAMS AND SERVICES FOR ELs AND THEIR FAMILIES (CONTINUED)",null,null,null,null,null,null,null,null,null,null,null,null,null,null,null,"E.  PROGRAMS AND SERVICES FOR ELs AND THEIR FAMILIES (CONTINUED)",null,null,null,null,null,null,null,null,null,null,null,null,null,null,null,"E.  PROGRAMS AND SERVICES FOR ELs AND THEIR FAMILIES (CONTINUED)",null,null,null,null,null,null,null,null,null,null,null,null,null,null,null,"E.  PROGRAMS AND SERVICES FOR ELs AND THEIR FAMILIES (CONTINUED)",null,null,null,null,null,null,null,null,null,null,null,null,null,null,null,"E.  PROGRAMS AND SERVICES FOR ELs AND THEIR FAMILIES (CONTINUED)",null,null,null,null,null,null,null,null,null,null,null,null,null,null,null,"E.  PROGRAMS AND SERVICES FOR ELs AND THEIR FAMILIES (CONTINUED)",null,null,null,null,null,null,null,null,null,null,null,null,null,null,null,"E.  PROGRAMS AND SERVICES FOR ELs AND THEIR FAMILIES (CONTINUED)",null,null,null,null,null,null,null,null,null,null,null,null,null,null,null,"E.  PROGRAMS AND SERVICES FOR ELs AND THEIR FAMILIES (CONTINUED)",null,null,null,null,null,null,null,null,null,null,null,null,null,null,null,"E.  PROGRAMS AND SERVICES FOR ELs AND THEIR FAMILIES (CONTINUED)",null,null,null,null,null,null,null,null,null,null,null,null,null,null,null,"E.  PROGRAMS AND SERVICES FOR ELs AND THEIR FAMILIES (CONTINUED)",null,null,null,null,null,null,null,null,null,null,null,null,null,null,null,"E.  PROGRAMS AND SERVICES FOR ELs AND THEIR FAMILIES (CONTINUED)",null,null,null,null,null,null,null,null,null,null,null,null,null,null,null,"E.  PROGRAMS AND SERVICES FOR ELs AND THEIR FAMILIES (CONTINUED)",null,null,null,null,null,null,null,null,null,null,null,null,null,null,null,"E.  PROGRAMS AND SERVICES FOR ELs AND THEIR FAMILIES (CONTINUED)",null,null,null,null,null,null,null,null,null,null,null,null,null,null,null,"E.  PROGRAMS AND SERVICES FOR ELs AND THEIR FAMILIES (CONTINUED)",null,null,null,null,null,null,null,null,null,null,null,null,null,null,null,"E.  PROGRAMS AND SERVICES FOR ELs AND THEIR FAMILIES (CONTINUED)",null,null,null,null,null,null,null,null,null,null,null,null,null,null,null,"E.  PROGRAMS AND SERVICES FOR ELs AND THEIR FAMILIES (CONTINUED)",null,null,null,null,null,null,null,null,null,null,null,null,null,null,null,"E.  PROGRAMS AND SERVICES FOR ELs AND THEIR FAMILIES (CONTINUED)",null,null,null,null,null,null,null,null,null,null,null,null,null,null,null,"E.  PROGRAMS AND SERVICES FOR ELs AND THEIR FAMILIES (CONTINUED)",null,null,null,null,null,null,null,null,null,null,null,null,null,null,null,"E.  PROGRAMS AND SERVICES FOR ELs AND THEIR FAMILIES (CONTINUED)",null,null,null,null,null,null,null,null,null,null,null,null,null,null,null,"E.  PROGRAMS AND SERVICES FOR ELs AND THEIR FAMILIES (CONTINUED)",null,null,null,null,null,null,null,null,null,null,null,null,null,null,null,"E.  PROGRAMS AND SERVICES FOR ELs AND THEIR FAMILIES (CONTINUED)",null,null,null,null,null,null,null,null,null,null,null,null,null,null,null,"E.  PROGRAMS AND SERVICES FOR ELs AND THEIR FAMILIES (CONTINUED)",null,null,null,null,null,null,null,null,null,null,null,null,null,null,null,"E.  PROGRAMS AND SERVICES FOR ELs AND THEIR FAMILIES (CONTINUED)",null,null,null,null,null,null,null,null,null,null,null,null,null,null,null,"E.  PROGRAMS AND SERVICES FOR ELs AND THEIR FAMILIES (CONTINUED)",null,null,null,null,null,null,null,null,null,null,null,null,null,null,null,"E.  PROGRAMS AND SERVICES FOR ELs AND THEIR FAMILIES (CONTINUED)",null,null,null,null,null,null,null,null,null,null,null,null,null,null,null,"E.  PROGRAMS AND SERVICES FOR ELs AND THEIR FAMILIES (CONTINUED)",null,null,null,null,null,null,null,null,null,null,null,null,null,null,null,"E.  PROGRAMS AND SERVICES FOR ELs AND THEIR FAMILIES (CONTINUED)",null,null,null,null,null,null,null,null,null,null,null,null,null,null,null,"E.  PROGRAMS AND SERVICES FOR ELs AND THEIR FAMILIES (CONTINUED)",null,null,null,null,null,null,null,null,null,null,null,null,null,null,null,"E.  PROGRAMS AND SERVICES FOR ELs AND THEIR FAMILIES (CONTINUED)",null,null,null,null,null,null,null,null,null,null,null,null,null,null,null,"E.  PROGRAMS AND SERVICES FOR ELs AND THEIR FAMILIES (CONTINUED)",null,null,null,null,null,null,null,null,null,null,null,null,null,null,null,"E.  PROGRAMS AND SERVICES FOR ELs AND THEIR FAMILIES (CONTINUED)",null,null,null,null,null,null,null,null,null,null,null,null,null,null,null,"E.  PROGRAMS AND SERVICES FOR ELs AND THEIR FAMILIES (CONTINUED)",null,null,null,null,null,null,null,null,null,null,null,null,null,null,null,"E.  PROGRAMS AND SERVICES FOR ELs AND THEIR FAMILIES (CONTINUED)",null,null,null,null,null,null,null,null,null,null,null,null,null,null,null,"E.  PROGRAMS AND SERVICES FOR ELs AND THEIR FAMILIES (CONTINUED)",null,null,null,null,null,null,null,null,null,null,null,null,null,null,null,"E.  PROGRAMS AND SERVICES FOR ELs AND THEIR FAMILIES (CONTINUED)",null,null,null,null,null,null,null,null,null,null,null,null,null,null,null,"E.  PROGRAMS AND SERVICES FOR ELs AND THEIR FAMILIES (CONTINUED)",null,null,null,null,null,null,null,null,null,null,null,null,null,null,null,"E.  PROGRAMS AND SERVICES FOR ELs AND THEIR FAMILIES (CONTINUED)",null,null,null,null,null,null,null,null,null,null,null,null,null,null,null,"E.  PROGRAMS AND SERVICES FOR ELs AND THEIR FAMILIES (CONTINUED)",null,null,null,null,null,null,null,null,null,null,null,null,null,null,null,"E.  PROGRAMS AND SERVICES FOR ELs AND THEIR FAMILIES (CONTINUED)",null,null,null,null,null,null,null,null,null,null,null,null,null,null,null,"E.  PROGRAMS AND SERVICES FOR ELs AND THEIR FAMILIES (CONTINUED)",null,null,null,null,null,null,null,null,null,null,null,null,null,null,null,"E.  PROGRAMS AND SERVICES FOR ELs AND THEIR FAMILIES (CONTINUED)",null,null,null,null,null,null,null,null,null,null,null,null,null,null,null,"E.  PROGRAMS AND SERVICES FOR ELs AND THEIR FAMILIES (CONTINUED)",null,null,null,null,null,null,null,null,null,null,null,null,null,null,null,"E.  PROGRAMS AND SERVICES FOR ELs AND THEIR FAMILIES (CONTINUED)",null,null,null,null,null,null,null,null,null,null,null,null,null,null,null,"E.  PROGRAMS AND SERVICES FOR ELs AND THEIR FAMILIES (CONTINUED)",null,null,null,null,null,null,null,null,null,null,null,null,null,null,null,"E.  PROGRAMS AND SERVICES FOR ELs AND THEIR FAMILIES (CONTINUED)",null,null,null,null,null,null,null,null,null,null,null,null,null,null,null,"E.  PROGRAMS AND SERVICES FOR ELs AND THEIR FAMILIES (CONTINUED)",null,null,null,null,null,null,null,null,null,null,null,null,null,null,null,"E.  PROGRAMS AND SERVICES FOR ELs AND THEIR FAMILIES (CONTINUED)",null,null,null,null,null,null,null,null,null,null,null,null,null,null,null,"E.  PROGRAMS AND SERVICES FOR ELs AND THEIR FAMILIES (CONTINUED)",null,null,null,null,null,null,null,null,null,null,null,null,null,null,null,"E.  PROGRAMS AND SERVICES FOR ELs AND THEIR FAMILIES (CONTINUED)",null,null,null,null,null,null,null,null,null,null,null,null,null,null,null,"E.  PROGRAMS AND SERVICES FOR ELs AND THEIR FAMILIES (CONTINUED)",null,null,null,null,null,null,null,null,null,null,null,null,null,null,null,"E.  PROGRAMS AND SERVICES FOR ELs AND THEIR FAMILIES (CONTINUED)",null,null,null,null,null,null,null,null,null,null,null,null,null,null,null,"E.  PROGRAMS AND SERVICES FOR ELs AND THEIR FAMILIES (CONTINUED)",null,null,null,null,null,null,null,null,null,null,null,null,null,null,null,"E.  PROGRAMS AND SERVICES FOR ELs AND THEIR FAMILIES (CONTINUED)",null,null,null,null,null,null,null,null,null,null,null,null,null,null,null,"E.  PROGRAMS AND SERVICES FOR ELs AND THEIR FAMILIES (CONTINUED)",null,null,null,null,null,null,null,null,null,null,null,null,null,null,null,"E.  PROGRAMS AND SERVICES FOR ELs AND THEIR FAMILIES (CONTINUED)",null,null,null,null,null,null,null,null,null,null,null,null,null,null,null,"E.  PROGRAMS AND SERVICES FOR ELs AND THEIR FAMILIES (CONTINUED)",null,null,null,null,null,null,null,null,null,null,null,null,null,null,null,"E.  PROGRAMS AND SERVICES FOR ELs AND THEIR FAMILIES (CONTINUED)",null,null,null,null,null,null,null,null,null,null,null,null,null,null,null,"E.  PROGRAMS AND SERVICES FOR ELs AND THEIR FAMILIES (CONTINUED)",null,null,null,null,null,null,null,null,null,null,null,null,null,null,null,"E.  PROGRAMS AND SERVICES FOR ELs AND THEIR FAMILIES (CONTINUED)",null,null,null,null,null,null,null,null,null,null,null,null,null,null,null,"E.  PROGRAMS AND SERVICES FOR ELs AND THEIR FAMILIES (CONTINUED)",null,null,null,null,null,null,null,null,null,null,null,null,null,null,null,"E.  PROGRAMS AND SERVICES FOR ELs AND THEIR FAMILIES (CONTINUED)",null,null,null,null,null,null,null,null,null,null,null,null,null,null,null,"E.  PROGRAMS AND SERVICES FOR ELs AND THEIR FAMILIES (CONTINUED)",null,null,null,null,null,null,null,null,null,null,null,null,null,null,null,"E.  PROGRAMS AND SERVICES FOR ELs AND THEIR FAMILIES (CONTINUED)",null,null,null,null,null,null,null,null,null,null,null,null,null,null,null,"E.  PROGRAMS AND SERVICES FOR ELs AND THEIR FAMILIES (CONTINUED)",null,null,null,null,null,null,null,null,null,null,null,null,null,null,null,"E.  PROGRAMS AND SERVICES FOR ELs AND THEIR FAMILIES (CONTINUED)",null,null,null,null,null,null,null,null,null,null,null,null,null,null,null,"E.  PROGRAMS AND SERVICES FOR ELs AND THEIR FAMILIES (CONTINUED)",null,null,null,null,null,null,null,null,null,null,null,null,null,null,null,"E.  PROGRAMS AND SERVICES FOR ELs AND THEIR FAMILIES (CONTINUED)",null,null,null,null,null,null,null,null,null,null,null,null,null,null,null,"E.  PROGRAMS AND SERVICES FOR ELs AND THEIR FAMILIES (CONTINUED)",null,null,null,null,null,null,null,null,null,null,null,null,null,null,null,"E.  PROGRAMS AND SERVICES FOR ELs AND THEIR FAMILIES (CONTINUED)",null,null,null,null,null,null,null,null,null,null,null,null,null,null,null,"E.  PROGRAMS AND SERVICES FOR ELs AND THEIR FAMILIES (CONTINUED)",null,null,null,null,null,null,null,null,null,null,null,null,null,null,null,"E.  PROGRAMS AND SERVICES FOR ELs AND THEIR FAMILIES (CONTINUED)",null,null,null,null,null,null,null,null,null,null,null,null,null,null,null,"E.  PROGRAMS AND SERVICES FOR ELs AND THEIR FAMILIES (CONTINUED)",null,null,null,null,null,null,null,null,null,null,null,null,null,null,null,"E.  PROGRAMS AND SERVICES FOR ELs AND THEIR FAMILIES (CONTINUED)",null,null,null,null,null,null,null,null,null,null,null,null,null,null,null,"E.  PROGRAMS AND SERVICES FOR ELs AND THEIR FAMILIES (CONTINUED)",null,null,null,null,null,null,null,null,null,null,null,null,null,null,null,"E.  PROGRAMS AND SERVICES FOR ELs AND THEIR FAMILIES (CONTINUED)",null,null,null,null,null,null,null,null,null,null,null,null,null,null,null,"E.  PROGRAMS AND SERVICES FOR ELs AND THEIR FAMILIES (CONTINUED)",null,null,null,null,null,null,null,null,null,null,null,null,null,null,null,"E.  PROGRAMS AND SERVICES FOR ELs AND THEIR FAMILIES (CONTINUED)",null,null,null,null,null,null,null,null,null,null,null,null,null,null,null,"E.  PROGRAMS AND SERVICES FOR ELs AND THEIR FAMILIES (CONTINUED)",null,null,null,null,null,null,null,null,null,null,null,null,null,null,null,"E.  PROGRAMS AND SERVICES FOR ELs AND THEIR FAMILIES (CONTINUED)",null,null,null,null,null,null,null,null,null,null,null,null,null,null,null,"E.  PROGRAMS AND SERVICES FOR ELs AND THEIR FAMILIES (CONTINUED)",null,null,null,null,null,null,null,null,null,null,null,null,null,null,null,"E.  PROGRAMS AND SERVICES FOR ELs AND THEIR FAMILIES (CONTINUED)",null,null,null,null,null,null,null,null,null,null,null,null,null,null,null,"E.  PROGRAMS AND SERVICES FOR ELs AND THEIR FAMILIES (CONTINUED)",null,null,null,null,null,null,null,null,null,null,null,null,null,null,null,"E.  PROGRAMS AND SERVICES FOR ELs AND THEIR FAMILIES (CONTINUED)",null,null,null,null,null,null,null,null,null,null,null,null,null,null,null,"E.  PROGRAMS AND SERVICES FOR ELs AND THEIR FAMILIES (CONTINUED)",null,null,null,null,null,null,null,null,null,null,null,null,null,null,null,"E.  PROGRAMS AND SERVICES FOR ELs AND THEIR FAMILIES (CONTINUED)",null,null,null,null,null,null,null,null,null,null,null,null,null,null,null,"E.  PROGRAMS AND SERVICES FOR ELs AND THEIR FAMILIES (CONTINUED)",null,null,null,null,null,null,null,null,null,null,null,null,null,null,null,"E.  PROGRAMS AND SERVICES FOR ELs AND THEIR FAMILIES (CONTINUED)",null,null,null,null,null,null,null,null,null,null,null,null,null,null,null,"E.  PROGRAMS AND SERVICES FOR ELs AND THEIR FAMILIES (CONTINUED)",null,null,null,null,null,null,null,null,null,null,null,null,null,null,null,"E.  PROGRAMS AND SERVICES FOR ELs AND THEIR FAMILIES (CONTINUED)",null,null,null,null,null,null,null,null,null,null,null,null,null,null,null,"E.  PROGRAMS AND SERVICES FOR ELs AND THEIR FAMILIES (CONTINUED)",null,null,null,null,null,null,null,null,null,null,null,null,null,null,null,"E.  PROGRAMS AND SERVICES FOR ELs AND THEIR FAMILIES (CONTINUED)",null,null,null,null,null,null,null,null,null,null,null,null,null,null,null,"E.  PROGRAMS AND SERVICES FOR ELs AND THEIR FAMILIES (CONTINUED)",null,null,null,null,null,null,null,null,null,null,null,null,null,null,null,"E.  PROGRAMS AND SERVICES FOR ELs AND THEIR FAMILIES (CONTINUED)",null,null,null,null,null,null,null,null,null,null,null,null,null,null,null,"E.  PROGRAMS AND SERVICES FOR ELs AND THEIR FAMILIES (CONTINUED)",null,null,null,null,null,null,null,null,null,null,null,null,null,null,null,"E.  PROGRAMS AND SERVICES FOR ELs AND THEIR FAMILIES (CONTINUED)",null,null,null,null,null,null,null,null,null,null,null,null,null,null,null,"E.  PROGRAMS AND SERVICES FOR ELs AND THEIR FAMILIES (CONTINUED)",null,null,null,null,null,null,null,null,null,null,null,null,null,null,null,"E.  PROGRAMS AND SERVICES FOR ELs AND THEIR FAMILIES (CONTINUED)",null,null,null,null,null,null,null,null,null,null,null,null,null,null,null,"E.  PROGRAMS AND SERVICES FOR ELs AND THEIR FAMILIES (CONTINUED)",null,null,null,null,null,null,null,null,null,null,null,null,null,null,null,"E.  PROGRAMS AND SERVICES FOR ELs AND THEIR FAMILIES (CONTINUED)",null,null,null,null,null,null,null,null,null,null,null,null,null,null,null,"E.  PROGRAMS AND SERVICES FOR ELs AND THEIR FAMILIES (CONTINUED)",null,null,null,null,null,null,null,null,null,null,null,null,null,null,null,"E.  PROGRAMS AND SERVICES FOR ELs AND THEIR FAMILIES (CONTINUED)",null,null,null,null,null,null,null,null,null,null,null,null,null,null,null,"E.  PROGRAMS AND SERVICES FOR ELs AND THEIR FAMILIES (CONTINUED)",null,null,null,null,null,null,null,null,null,null,null,null,null,null,null,"E.  PROGRAMS AND SERVICES FOR ELs AND THEIR FAMILIES (CONTINUED)",null,null,null,null,null,null,null,null,null,null,null,null,null,null,null,"E.  PROGRAMS AND SERVICES FOR ELs AND THEIR FAMILIES (CONTINUED)",null,null,null,null,null,null,null,null,null,null,null,null,null,null,null,"E.  PROGRAMS AND SERVICES FOR ELs AND THEIR FAMILIES (CONTINUED)",null,null,null,null,null,null,null,null,null,null,null,null,null,null,null,"E.  PROGRAMS AND SERVICES FOR ELs AND THEIR FAMILIES (CONTINUED)",null,null,null,null,null,null,null,null,null,null,null,null,null,null,null,"E.  PROGRAMS AND SERVICES FOR ELs AND THEIR FAMILIES (CONTINUED)",null,null,null,null,null,null,null,null,null,null,null,null,null,null,null,"E.  PROGRAMS AND SERVICES FOR ELs AND THEIR FAMILIES (CONTINUED)",null,null,null,null,null,null,null,null,null,null,null,null,null,null,null,"E.  PROGRAMS AND SERVICES FOR ELs AND THEIR FAMILIES (CONTINUED)"]
[]
["Implementation of an Effective LIEP Supported by Local and/or State Funds: The division must carry out a comprehensive analysis of the EL population within the division in order to 1) design programs and services that will meet the needs of students; and 2) to determine the necessary resources for an effective implementation of the LIEP.  "]
[]
["Box 3:  Provide the following information regarding the division-wide EL population for SY 2017-2018."]
[null,"The number of ELs division-wide (Level 1-4.3)",null,null,null,null,null,null,null,null,null,null,980]
[null,"The percentage of ELs who reached proficiency (4.4+ on the ACCESS for ELLs assessment)\n\n",null,null,null,null,null,null,null,null,null,null,0.1459]
[null,"The percentage of ELs who made progress toward reaching proficiency\n\n",null,null,null,null,null,null,null,null,null,null,0.62560000000000004]
[null,"The number of endorsed ESL teachers",null,null,null,null,null,null,null,null,null,null,37]
[]
["Box 4:  Identify the amount of targeted language instruction for ELs the division determines appropriate at each proficiency level and/or grade span level."]
["ACPS has specific instructional guidelines and staffing formulas that provide a baseline for designing programming for ELs. For staffing allocations, we consider the number of ELs at a school, based on their grade and ELP levels. ESOL teachers work with students to set quarterly goals in the four language domains of listening, speaking, reading, and writing. The goals are individualized based on ELs’ English languages proficiency levels and drawn from the WIDA Can Do Descriptors and our teacher-created ESOL Language Goals.\nOur minimum instructional minutes at the elementary level are as follows:\n*Level 1.0-1.9 = 150 minutes/week   *Level 2.0-2.9 = 100 minutes/week  *Level 3.0-3.9 = 60 minutes/week  *Level 4.0-4.3 = 45 minutes/week   *Level 6 Formerly ELs = quarterly conferencing\nOur minimum instructional minutes at the secondary level are as follows:\n*Level 1.0-1.9 = 300 minutes/week  *Level 2.0-2.9 = 200 minutes/week   *Level 3.0-3.9 = 120 minutes/week  *Level 4.0-4.3 = 45 minutes/week   *Level 6 Formerly ELs = quarterly conferencing\n The amount of instructional time received is determined and adjusted by (1) the EL’s linguistic progress on ACPS’ quarterly benchmarks for ELs (2) grade level, (3) teacher scheduling, and (4) clustering of ELs. Our purpose in doubling the service minutes at the secondary level is to create a sense of urgency with school-based stakeholders in an effort to accelerate older ELs’ English acquisition and graduate on time. Schools strive to provide ELs with the best balance of time with their ESOL teachers, classroom/content teacher(s), and age-level peers.\n"]
[]
["Evaluation of the Effectiveness of the LIEP Supported by Local and/or State Funds: The division must evaluate the LIEP to determine its effectiveness in helping ELs make progress toward achieving English proficiency, exit the LIEP, and meet challenging State academic standards within a reasonable timeframe."]
[]
["Box 5:  Describe the division’s procedures to evaluate programs and services for ELs.  Include the following information:\n• A timeline for evaluation; \n• The titles of stakeholders involved in the evaluation process; and \n• The data collected by the division to determine the effectiveness of the LIEP.  Data elements may include EL academic achievement indicators by grade span or content area, specific LIEP secondary courses, student or parent surveys, EL graduation rates, ELs with disabilities, Long Term ELs, formerly ELs (4.4+ on the ACCESS for ELs assessment)."]
["We collect data via intentional and ongoing: classroom walkthroughs with school administrators; conversations with teachers of English Learners (ELs) during ESOL classes; periodic review of ESOL teacher lesson plans; interactions with families and educational partners at family and community engagement events or in our office; teacher discussions during Professional Learning Communities (PLCs) and Professional Development (PD) workshops;development and review of Standard Operating Procedures (SOPs); and audits of teacher caseloads. Additionally, we analyze quantitative data at key times during the year through: 1. Quarterly ESOL Report Cards and/or Report Cards in Parent Portal: The ESOL Office cross-checks for supplemental support needed by ELs by running our “Low Grade Report” in PowerSchool. 2. Standards of Learning (SOL) content area exam results: During the summer, we look for gaps between overall school averages and ELs’ pass rates. 3. WIDA ACCESS for ELLs 2.0 English language proficiency exam results: This now includes a cross-check for any new Long-Term ELs. ESOL teachers use the WIDA Score Reports in August to confer with students and classroom teachers about student progress and proficiency.\n4. ESOL Benchmarks: On a quarterly basis, ESOL teachers compare ELs’ English language proficiency levels to our ESOL Benchmarks in order to determine expected linguistic growth and needed supports.  \n5. Surveys: We constantly seek feedback from our teachers. Whether after an ESOL Team PD or at the end of the year, we use a hybrid of anonymous surveys and personal interviews in order to gage program effectiveness and direction. Survey questions center on instruction, expectations, and equity gaps.  \n"]
["Page 22"]
[null,null,null,null,"School Division:",null,{"$f":"'Title III Budget'!$A$16","v":"ALBEMARLE COUNTY PUBLIC SCHOOLS"},null,null,null,null,null,"Division Number:",null,null,{"$f":"'Title III Budget'!$H$16","v":2}]
[]
["E.  PROGRAMS AND SERVICES FOR ELs AND THEIR FAMILIES (CONTINUED)",null,null,null,null,null,null,null,null,null,null,null,null,null,null,null,null,null,null,null,null,null,null,null,null,null,null,null,null,null,null,null,"E.  PROGRAMS AND SERVICES FOR ELs AND THEIR FAMILIES (CONTINUED)",null,null,null,null,null,null,null,null,null,null,null,null,null,null,null,"E.  PROGRAMS AND SERVICES FOR ELs AND THEIR FAMILIES (CONTINUED)",null,null,null,null,null,null,null,null,null,null,null,null,null,null,null,"E.  PROGRAMS AND SERVICES FOR ELs AND THEIR FAMILIES (CONTINUED)",null,null,null,null,null,null,null,null,null,null,null,null,null,null,null,"E.  PROGRAMS AND SERVICES FOR ELs AND THEIR FAMILIES (CONTINUED)",null,null,null,null,null,null,null,null,null,null,null,null,null,null,null,"E.  PROGRAMS AND SERVICES FOR ELs AND THEIR FAMILIES (CONTINUED)",null,null,null,null,null,null,null,null,null,null,null,null,null,null,null,"E.  PROGRAMS AND SERVICES FOR ELs AND THEIR FAMILIES (CONTINUED)",null,null,null,null,null,null,null,null,null,null,null,null,null,null,null,"E.  PROGRAMS AND SERVICES FOR ELs AND THEIR FAMILIES (CONTINUED)",null,null,null,null,null,null,null,null,null,null,null,null,null,null,null,"E.  PROGRAMS AND SERVICES FOR ELs AND THEIR FAMILIES (CONTINUED)",null,null,null,null,null,null,null,null,null,null,null,null,null,null,null,"E.  PROGRAMS AND SERVICES FOR ELs AND THEIR FAMILIES (CONTINUED)",null,null,null,null,null,null,null,null,null,null,null,null,null,null,null,"E.  PROGRAMS AND SERVICES FOR ELs AND THEIR FAMILIES (CONTINUED)",null,null,null,null,null,null,null,null,null,null,null,null,null,null,null,"E.  PROGRAMS AND SERVICES FOR ELs AND THEIR FAMILIES (CONTINUED)",null,null,null,null,null,null,null,null,null,null,null,null,null,null,null,"E.  PROGRAMS AND SERVICES FOR ELs AND THEIR FAMILIES (CONTINUED)",null,null,null,null,null,null,null,null,null,null,null,null,null,null,null,"E.  PROGRAMS AND SERVICES FOR ELs AND THEIR FAMILIES (CONTINUED)",null,null,null,null,null,null,null,null,null,null,null,null,null,null,null,"E.  PROGRAMS AND SERVICES FOR ELs AND THEIR FAMILIES (CONTINUED)",null,null,null,null,null,null,null,null,null,null,null,null,null,null,null,"E.  PROGRAMS AND SERVICES FOR ELs AND THEIR FAMILIES (CONTINUED)",null,null,null,null,null,null,null,null,null,null,null,null,null,null,null,"E.  PROGRAMS AND SERVICES FOR ELs AND THEIR FAMILIES (CONTINUED)",null,null,null,null,null,null,null,null,null,null,null,null,null,null,null,"E.  PROGRAMS AND SERVICES FOR ELs AND THEIR FAMILIES (CONTINUED)",null,null,null,null,null,null,null,null,null,null,null,null,null,null,null,"E.  PROGRAMS AND SERVICES FOR ELs AND THEIR FAMILIES (CONTINUED)",null,null,null,null,null,null,null,null,null,null,null,null,null,null,null,"E.  PROGRAMS AND SERVICES FOR ELs AND THEIR FAMILIES (CONTINUED)",null,null,null,null,null,null,null,null,null,null,null,null,null,null,null,"E.  PROGRAMS AND SERVICES FOR ELs AND THEIR FAMILIES (CONTINUED)",null,null,null,null,null,null,null,null,null,null,null,null,null,null,null,"E.  PROGRAMS AND SERVICES FOR ELs AND THEIR FAMILIES (CONTINUED)",null,null,null,null,null,null,null,null,null,null,null,null,null,null,null,"E.  PROGRAMS AND SERVICES FOR ELs AND THEIR FAMILIES (CONTINUED)",null,null,null,null,null,null,null,null,null,null,null,null,null,null,null,"E.  PROGRAMS AND SERVICES FOR ELs AND THEIR FAMILIES (CONTINUED)",null,null,null,null,null,null,null,null,null,null,null,null,null,null,null,"E.  PROGRAMS AND SERVICES FOR ELs AND THEIR FAMILIES (CONTINUED)",null,null,null,null,null,null,null,null,null,null,null,null,null,null,null,"E.  PROGRAMS AND SERVICES FOR ELs AND THEIR FAMILIES (CONTINUED)",null,null,null,null,null,null,null,null,null,null,null,null,null,null,null,"E.  PROGRAMS AND SERVICES FOR ELs AND THEIR FAMILIES (CONTINUED)",null,null,null,null,null,null,null,null,null,null,null,null,null,null,null,"E.  PROGRAMS AND SERVICES FOR ELs AND THEIR FAMILIES (CONTINUED)",null,null,null,null,null,null,null,null,null,null,null,null,null,null,null,"E.  PROGRAMS AND SERVICES FOR ELs AND THEIR FAMILIES (CONTINUED)",null,null,null,null,null,null,null,null,null,null,null,null,null,null,null,"E.  PROGRAMS AND SERVICES FOR ELs AND THEIR FAMILIES (CONTINUED)",null,null,null,null,null,null,null,null,null,null,null,null,null,null,null,"E.  PROGRAMS AND SERVICES FOR ELs AND THEIR FAMILIES (CONTINUED)",null,null,null,null,null,null,null,null,null,null,null,null,null,null,null,"E.  PROGRAMS AND SERVICES FOR ELs AND THEIR FAMILIES (CONTINUED)",null,null,null,null,null,null,null,null,null,null,null,null,null,null,null,"E.  PROGRAMS AND SERVICES FOR ELs AND THEIR FAMILIES (CONTINUED)",null,null,null,null,null,null,null,null,null,null,null,null,null,null,null,"E.  PROGRAMS AND SERVICES FOR ELs AND THEIR FAMILIES (CONTINUED)",null,null,null,null,null,null,null,null,null,null,null,null,null,null,null,"E.  PROGRAMS AND SERVICES FOR ELs AND THEIR FAMILIES (CONTINUED)",null,null,null,null,null,null,null,null,null,null,null,null,null,null,null,"E.  PROGRAMS AND SERVICES FOR ELs AND THEIR FAMILIES (CONTINUED)",null,null,null,null,null,null,null,null,null,null,null,null,null,null,null,"E.  PROGRAMS AND SERVICES FOR ELs AND THEIR FAMILIES (CONTINUED)",null,null,null,null,null,null,null,null,null,null,null,null,null,null,null,"E.  PROGRAMS AND SERVICES FOR ELs AND THEIR FAMILIES (CONTINUED)",null,null,null,null,null,null,null,null,null,null,null,null,null,null,null,"E.  PROGRAMS AND SERVICES FOR ELs AND THEIR FAMILIES (CONTINUED)",null,null,null,null,null,null,null,null,null,null,null,null,null,null,null,"E.  PROGRAMS AND SERVICES FOR ELs AND THEIR FAMILIES (CONTINUED)",null,null,null,null,null,null,null,null,null,null,null,null,null,null,null,"E.  PROGRAMS AND SERVICES FOR ELs AND THEIR FAMILIES (CONTINUED)",null,null,null,null,null,null,null,null,null,null,null,null,null,null,null,"E.  PROGRAMS AND SERVICES FOR ELs AND THEIR FAMILIES (CONTINUED)",null,null,null,null,null,null,null,null,null,null,null,null,null,null,null,"E.  PROGRAMS AND SERVICES FOR ELs AND THEIR FAMILIES (CONTINUED)",null,null,null,null,null,null,null,null,null,null,null,null,null,null,null,"E.  PROGRAMS AND SERVICES FOR ELs AND THEIR FAMILIES (CONTINUED)",null,null,null,null,null,null,null,null,null,null,null,null,null,null,null,"E.  PROGRAMS AND SERVICES FOR ELs AND THEIR FAMILIES (CONTINUED)",null,null,null,null,null,null,null,null,null,null,null,null,null,null,null,"E.  PROGRAMS AND SERVICES FOR ELs AND THEIR FAMILIES (CONTINUED)",null,null,null,null,null,null,null,null,null,null,null,null,null,null,null,"E.  PROGRAMS AND SERVICES FOR ELs AND THEIR FAMILIES (CONTINUED)",null,null,null,null,null,null,null,null,null,null,null,null,null,null,null,"E.  PROGRAMS AND SERVICES FOR ELs AND THEIR FAMILIES (CONTINUED)",null,null,null,null,null,null,null,null,null,null,null,null,null,null,null,"E.  PROGRAMS AND SERVICES FOR ELs AND THEIR FAMILIES (CONTINUED)",null,null,null,null,null,null,null,null,null,null,null,null,null,null,null,"E.  PROGRAMS AND SERVICES FOR ELs AND THEIR FAMILIES (CONTINUED)",null,null,null,null,null,null,null,null,null,null,null,null,null,null,null,"E.  PROGRAMS AND SERVICES FOR ELs AND THEIR FAMILIES (CONTINUED)",null,null,null,null,null,null,null,null,null,null,null,null,null,null,null,"E.  PROGRAMS AND SERVICES FOR ELs AND THEIR FAMILIES (CONTINUED)",null,null,null,null,null,null,null,null,null,null,null,null,null,null,null,"E.  PROGRAMS AND SERVICES FOR ELs AND THEIR FAMILIES (CONTINUED)",null,null,null,null,null,null,null,null,null,null,null,null,null,null,null,"E.  PROGRAMS AND SERVICES FOR ELs AND THEIR FAMILIES (CONTINUED)",null,null,null,null,null,null,null,null,null,null,null,null,null,null,null,"E.  PROGRAMS AND SERVICES FOR ELs AND THEIR FAMILIES (CONTINUED)",null,null,null,null,null,null,null,null,null,null,null,null,null,null,null,"E.  PROGRAMS AND SERVICES FOR ELs AND THEIR FAMILIES (CONTINUED)",null,null,null,null,null,null,null,null,null,null,null,null,null,null,null,"E.  PROGRAMS AND SERVICES FOR ELs AND THEIR FAMILIES (CONTINUED)",null,null,null,null,null,null,null,null,null,null,null,null,null,null,null,"E.  PROGRAMS AND SERVICES FOR ELs AND THEIR FAMILIES (CONTINUED)",null,null,null,null,null,null,null,null,null,null,null,null,null,null,null,"E.  PROGRAMS AND SERVICES FOR ELs AND THEIR FAMILIES (CONTINUED)",null,null,null,null,null,null,null,null,null,null,null,null,null,null,null,"E.  PROGRAMS AND SERVICES FOR ELs AND THEIR FAMILIES (CONTINUED)",null,null,null,null,null,null,null,null,null,null,null,null,null,null,null,"E.  PROGRAMS AND SERVICES FOR ELs AND THEIR FAMILIES (CONTINUED)",null,null,null,null,null,null,null,null,null,null,null,null,null,null,null,"E.  PROGRAMS AND SERVICES FOR ELs AND THEIR FAMILIES (CONTINUED)",null,null,null,null,null,null,null,null,null,null,null,null,null,null,null,"E.  PROGRAMS AND SERVICES FOR ELs AND THEIR FAMILIES (CONTINUED)",null,null,null,null,null,null,null,null,null,null,null,null,null,null,null,"E.  PROGRAMS AND SERVICES FOR ELs AND THEIR FAMILIES (CONTINUED)",null,null,null,null,null,null,null,null,null,null,null,null,null,null,null,"E.  PROGRAMS AND SERVICES FOR ELs AND THEIR FAMILIES (CONTINUED)",null,null,null,null,null,null,null,null,null,null,null,null,null,null,null,"E.  PROGRAMS AND SERVICES FOR ELs AND THEIR FAMILIES (CONTINUED)",null,null,null,null,null,null,null,null,null,null,null,null,null,null,null,"E.  PROGRAMS AND SERVICES FOR ELs AND THEIR FAMILIES (CONTINUED)",null,null,null,null,null,null,null,null,null,null,null,null,null,null,null,"E.  PROGRAMS AND SERVICES FOR ELs AND THEIR FAMILIES (CONTINUED)",null,null,null,null,null,null,null,null,null,null,null,null,null,null,null,"E.  PROGRAMS AND SERVICES FOR ELs AND THEIR FAMILIES (CONTINUED)",null,null,null,null,null,null,null,null,null,null,null,null,null,null,null,"E.  PROGRAMS AND SERVICES FOR ELs AND THEIR FAMILIES (CONTINUED)",null,null,null,null,null,null,null,null,null,null,null,null,null,null,null,"E.  PROGRAMS AND SERVICES FOR ELs AND THEIR FAMILIES (CONTINUED)",null,null,null,null,null,null,null,null,null,null,null,null,null,null,null,"E.  PROGRAMS AND SERVICES FOR ELs AND THEIR FAMILIES (CONTINUED)",null,null,null,null,null,null,null,null,null,null,null,null,null,null,null,"E.  PROGRAMS AND SERVICES FOR ELs AND THEIR FAMILIES (CONTINUED)",null,null,null,null,null,null,null,null,null,null,null,null,null,null,null,"E.  PROGRAMS AND SERVICES FOR ELs AND THEIR FAMILIES (CONTINUED)",null,null,null,null,null,null,null,null,null,null,null,null,null,null,null,"E.  PROGRAMS AND SERVICES FOR ELs AND THEIR FAMILIES (CONTINUED)",null,null,null,null,null,null,null,null,null,null,null,null,null,null,null,"E.  PROGRAMS AND SERVICES FOR ELs AND THEIR FAMILIES (CONTINUED)",null,null,null,null,null,null,null,null,null,null,null,null,null,null,null,"E.  PROGRAMS AND SERVICES FOR ELs AND THEIR FAMILIES (CONTINUED)",null,null,null,null,null,null,null,null,null,null,null,null,null,null,null,"E.  PROGRAMS AND SERVICES FOR ELs AND THEIR FAMILIES (CONTINUED)",null,null,null,null,null,null,null,null,null,null,null,null,null,null,null,"E.  PROGRAMS AND SERVICES FOR ELs AND THEIR FAMILIES (CONTINUED)",null,null,null,null,null,null,null,null,null,null,null,null,null,null,null,"E.  PROGRAMS AND SERVICES FOR ELs AND THEIR FAMILIES (CONTINUED)",null,null,null,null,null,null,null,null,null,null,null,null,null,null,null,"E.  PROGRAMS AND SERVICES FOR ELs AND THEIR FAMILIES (CONTINUED)",null,null,null,null,null,null,null,null,null,null,null,null,null,null,null,"E.  PROGRAMS AND SERVICES FOR ELs AND THEIR FAMILIES (CONTINUED)",null,null,null,null,null,null,null,null,null,null,null,null,null,null,null,"E.  PROGRAMS AND SERVICES FOR ELs AND THEIR FAMILIES (CONTINUED)",null,null,null,null,null,null,null,null,null,null,null,null,null,null,null,"E.  PROGRAMS AND SERVICES FOR ELs AND THEIR FAMILIES (CONTINUED)",null,null,null,null,null,null,null,null,null,null,null,null,null,null,null,"E.  PROGRAMS AND SERVICES FOR ELs AND THEIR FAMILIES (CONTINUED)",null,null,null,null,null,null,null,null,null,null,null,null,null,null,null,"E.  PROGRAMS AND SERVICES FOR ELs AND THEIR FAMILIES (CONTINUED)",null,null,null,null,null,null,null,null,null,null,null,null,null,null,null,"E.  PROGRAMS AND SERVICES FOR ELs AND THEIR FAMILIES (CONTINUED)",null,null,null,null,null,null,null,null,null,null,null,null,null,null,null,"E.  PROGRAMS AND SERVICES FOR ELs AND THEIR FAMILIES (CONTINUED)",null,null,null,null,null,null,null,null,null,null,null,null,null,null,null,"E.  PROGRAMS AND SERVICES FOR ELs AND THEIR FAMILIES (CONTINUED)",null,null,null,null,null,null,null,null,null,null,null,null,null,null,null,"E.  PROGRAMS AND SERVICES FOR ELs AND THEIR FAMILIES (CONTINUED)",null,null,null,null,null,null,null,null,null,null,null,null,null,null,null,"E.  PROGRAMS AND SERVICES FOR ELs AND THEIR FAMILIES (CONTINUED)",null,null,null,null,null,null,null,null,null,null,null,null,null,null,null,"E.  PROGRAMS AND SERVICES FOR ELs AND THEIR FAMILIES (CONTINUED)",null,null,null,null,null,null,null,null,null,null,null,null,null,null,null,"E.  PROGRAMS AND SERVICES FOR ELs AND THEIR FAMILIES (CONTINUED)",null,null,null,null,null,null,null,null,null,null,null,null,null,null,null,"E.  PROGRAMS AND SERVICES FOR ELs AND THEIR FAMILIES (CONTINUED)",null,null,null,null,null,null,null,null,null,null,null,null,null,null,null,"E.  PROGRAMS AND SERVICES FOR ELs AND THEIR FAMILIES (CONTINUED)",null,null,null,null,null,null,null,null,null,null,null,null,null,null,null,"E.  PROGRAMS AND SERVICES FOR ELs AND THEIR FAMILIES (CONTINUED)",null,null,null,null,null,null,null,null,null,null,null,null,null,null,null,"E.  PROGRAMS AND SERVICES FOR ELs AND THEIR FAMILIES (CONTINUED)",null,null,null,null,null,null,null,null,null,null,null,null,null,null,null,"E.  PROGRAMS AND SERVICES FOR ELs AND THEIR FAMILIES (CONTINUED)",null,null,null,null,null,null,null,null,null,null,null,null,null,null,null,"E.  PROGRAMS AND SERVICES FOR ELs AND THEIR FAMILIES (CONTINUED)",null,null,null,null,null,null,null,null,null,null,null,null,null,null,null,"E.  PROGRAMS AND SERVICES FOR ELs AND THEIR FAMILIES (CONTINUED)",null,null,null,null,null,null,null,null,null,null,null,null,null,null,null,"E.  PROGRAMS AND SERVICES FOR ELs AND THEIR FAMILIES (CONTINUED)",null,null,null,null,null,null,null,null,null,null,null,null,null,null,null,"E.  PROGRAMS AND SERVICES FOR ELs AND THEIR FAMILIES (CONTINUED)",null,null,null,null,null,null,null,null,null,null,null,null,null,null,null,"E.  PROGRAMS AND SERVICES FOR ELs AND THEIR FAMILIES (CONTINUED)",null,null,null,null,null,null,null,null,null,null,null,null,null,null,null,"E.  PROGRAMS AND SERVICES FOR ELs AND THEIR FAMILIES (CONTINUED)",null,null,null,null,null,null,null,null,null,null,null,null,null,null,null,"E.  PROGRAMS AND SERVICES FOR ELs AND THEIR FAMILIES (CONTINUED)",null,null,null,null,null,null,null,null,null,null,null,null,null,null,null,"E.  PROGRAMS AND SERVICES FOR ELs AND THEIR FAMILIES (CONTINUED)",null,null,null,null,null,null,null,null,null,null,null,null,null,null,null,"E.  PROGRAMS AND SERVICES FOR ELs AND THEIR FAMILIES (CONTINUED)",null,null,null,null,null,null,null,null,null,null,null,null,null,null,null,"E.  PROGRAMS AND SERVICES FOR ELs AND THEIR FAMILIES (CONTINUED)",null,null,null,null,null,null,null,null,null,null,null,null,null,null,null,"E.  PROGRAMS AND SERVICES FOR ELs AND THEIR FAMILIES (CONTINUED)",null,null,null,null,null,null,null,null,null,null,null,null,null,null,null,"E.  PROGRAMS AND SERVICES FOR ELs AND THEIR FAMILIES (CONTINUED)",null,null,null,null,null,null,null,null,null,null,null,null,null,null,null,"E.  PROGRAMS AND SERVICES FOR ELs AND THEIR FAMILIES (CONTINUED)",null,null,null,null,null,null,null,null,null,null,null,null,null,null,null,"E.  PROGRAMS AND SERVICES FOR ELs AND THEIR FAMILIES (CONTINUED)",null,null,null,null,null,null,null,null,null,null,null,null,null,null,null,"E.  PROGRAMS AND SERVICES FOR ELs AND THEIR FAMILIES (CONTINUED)",null,null,null,null,null,null,null,null,null,null,null,null,null,null,null,"E.  PROGRAMS AND SERVICES FOR ELs AND THEIR FAMILIES (CONTINUED)",null,null,null,null,null,null,null,null,null,null,null,null,null,null,null,"E.  PROGRAMS AND SERVICES FOR ELs AND THEIR FAMILIES (CONTINUED)",null,null,null,null,null,null,null,null,null,null,null,null,null,null,null,"E.  PROGRAMS AND SERVICES FOR ELs AND THEIR FAMILIES (CONTINUED)",null,null,null,null,null,null,null,null,null,null,null,null,null,null,null,"E.  PROGRAMS AND SERVICES FOR ELs AND THEIR FAMILIES (CONTINUED)",null,null,null,null,null,null,null,null,null,null,null,null,null,null,null,"E.  PROGRAMS AND SERVICES FOR ELs AND THEIR FAMILIES (CONTINUED)",null,null,null,null,null,null,null,null,null,null,null,null,null,null,null,"E.  PROGRAMS AND SERVICES FOR ELs AND THEIR FAMILIES (CONTINUED)",null,null,null,null,null,null,null,null,null,null,null,null,null,null,null,"E.  PROGRAMS AND SERVICES FOR ELs AND THEIR FAMILIES (CONTINUED)",null,null,null,null,null,null,null,null,null,null,null,null,null,null,null,"E.  PROGRAMS AND SERVICES FOR ELs AND THEIR FAMILIES (CONTINUED)",null,null,null,null,null,null,null,null,null,null,null,null,null,null,null,"E.  PROGRAMS AND SERVICES FOR ELs AND THEIR FAMILIES (CONTINUED)",null,null,null,null,null,null,null,null,null,null,null,null,null,null,null,"E.  PROGRAMS AND SERVICES FOR ELs AND THEIR FAMILIES (CONTINUED)",null,null,null,null,null,null,null,null,null,null,null,null,null,null,null,"E.  PROGRAMS AND SERVICES FOR ELs AND THEIR FAMILIES (CONTINUED)",null,null,null,null,null,null,null,null,null,null,null,null,null,null,null,"E.  PROGRAMS AND SERVICES FOR ELs AND THEIR FAMILIES (CONTINUED)",null,null,null,null,null,null,null,null,null,null,null,null,null,null,null,"E.  PROGRAMS AND SERVICES FOR ELs AND THEIR FAMILIES (CONTINUED)",null,null,null,null,null,null,null,null,null,null,null,null,null,null,null,"E.  PROGRAMS AND SERVICES FOR ELs AND THEIR FAMILIES (CONTINUED)",null,null,null,null,null,null,null,null,null,null,null,null,null,null,null,"E.  PROGRAMS AND SERVICES FOR ELs AND THEIR FAMILIES (CONTINUED)",null,null,null,null,null,null,null,null,null,null,null,null,null,null,null,"E.  PROGRAMS AND SERVICES FOR ELs AND THEIR FAMILIES (CONTINUED)",null,null,null,null,null,null,null,null,null,null,null,null,null,null,null,"E.  PROGRAMS AND SERVICES FOR ELs AND THEIR FAMILIES (CONTINUED)",null,null,null,null,null,null,null,null,null,null,null,null,null,null,null,"E.  PROGRAMS AND SERVICES FOR ELs AND THEIR FAMILIES (CONTINUED)",null,null,null,null,null,null,null,null,null,null,null,null,null,null,null,"E.  PROGRAMS AND SERVICES FOR ELs AND THEIR FAMILIES (CONTINUED)",null,null,null,null,null,null,null,null,null,null,null,null,null,null,null,"E.  PROGRAMS AND SERVICES FOR ELs AND THEIR FAMILIES (CONTINUED)",null,null,null,null,null,null,null,null,null,null,null,null,null,null,null,"E.  PROGRAMS AND SERVICES FOR ELs AND THEIR FAMILIES (CONTINUED)",null,null,null,null,null,null,null,null,null,null,null,null,null,null,null,"E.  PROGRAMS AND SERVICES FOR ELs AND THEIR FAMILIES (CONTINUED)",null,null,null,null,null,null,null,null,null,null,null,null,null,null,null,"E.  PROGRAMS AND SERVICES FOR ELs AND THEIR FAMILIES (CONTINUED)",null,null,null,null,null,null,null,null,null,null,null,null,null,null,null,"E.  PROGRAMS AND SERVICES FOR ELs AND THEIR FAMILIES (CONTINUED)",null,null,null,null,null,null,null,null,null,null,null,null,null,null,null,"E.  PROGRAMS AND SERVICES FOR ELs AND THEIR FAMILIES (CONTINUED)",null,null,null,null,null,null,null,null,null,null,null,null,null,null,null,"E.  PROGRAMS AND SERVICES FOR ELs AND THEIR FAMILIES (CONTINUED)",null,null,null,null,null,null,null,null,null,null,null,null,null,null,null,"E.  PROGRAMS AND SERVICES FOR ELs AND THEIR FAMILIES (CONTINUED)",null,null,null,null,null,null,null,null,null,null,null,null,null,null,null,"E.  PROGRAMS AND SERVICES FOR ELs AND THEIR FAMILIES (CONTINUED)",null,null,null,null,null,null,null,null,null,null,null,null,null,null,null,"E.  PROGRAMS AND SERVICES FOR ELs AND THEIR FAMILIES (CONTINUED)",null,null,null,null,null,null,null,null,null,null,null,null,null,null,null,"E.  PROGRAMS AND SERVICES FOR ELs AND THEIR FAMILIES (CONTINUED)",null,null,null,null,null,null,null,null,null,null,null,null,null,null,null,"E.  PROGRAMS AND SERVICES FOR ELs AND THEIR FAMILIES (CONTINUED)",null,null,null,null,null,null,null,null,null,null,null,null,null,null,null,"E.  PROGRAMS AND SERVICES FOR ELs AND THEIR FAMILIES (CONTINUED)",null,null,null,null,null,null,null,null,null,null,null,null,null,null,null,"E.  PROGRAMS AND SERVICES FOR ELs AND THEIR FAMILIES (CONTINUED)",null,null,null,null,null,null,null,null,null,null,null,null,null,null,null,"E.  PROGRAMS AND SERVICES FOR ELs AND THEIR FAMILIES (CONTINUED)",null,null,null,null,null,null,null,null,null,null,null,null,null,null,null,"E.  PROGRAMS AND SERVICES FOR ELs AND THEIR FAMILIES (CONTINUED)",null,null,null,null,null,null,null,null,null,null,null,null,null,null,null,"E.  PROGRAMS AND SERVICES FOR ELs AND THEIR FAMILIES (CONTINUED)",null,null,null,null,null,null,null,null,null,null,null,null,null,null,null,"E.  PROGRAMS AND SERVICES FOR ELs AND THEIR FAMILIES (CONTINUED)",null,null,null,null,null,null,null,null,null,null,null,null,null,null,null,"E.  PROGRAMS AND SERVICES FOR ELs AND THEIR FAMILIES (CONTINUED)",null,null,null,null,null,null,null,null,null,null,null,null,null,null,null,"E.  PROGRAMS AND SERVICES FOR ELs AND THEIR FAMILIES (CONTINUED)",null,null,null,null,null,null,null,null,null,null,null,null,null,null,null,"E.  PROGRAMS AND SERVICES FOR ELs AND THEIR FAMILIES (CONTINUED)",null,null,null,null,null,null,null,null,null,null,null,null,null,null,null,"E.  PROGRAMS AND SERVICES FOR ELs AND THEIR FAMILIES (CONTINUED)",null,null,null,null,null,null,null,null,null,null,null,null,null,null,null,"E.  PROGRAMS AND SERVICES FOR ELs AND THEIR FAMILIES (CONTINUED)",null,null,null,null,null,null,null,null,null,null,null,null,null,null,null,"E.  PROGRAMS AND SERVICES FOR ELs AND THEIR FAMILIES (CONTINUED)",null,null,null,null,null,null,null,null,null,null,null,null,null,null,null,"E.  PROGRAMS AND SERVICES FOR ELs AND THEIR FAMILIES (CONTINUED)",null,null,null,null,null,null,null,null,null,null,null,null,null,null,null,"E.  PROGRAMS AND SERVICES FOR ELs AND THEIR FAMILIES (CONTINUED)",null,null,null,null,null,null,null,null,null,null,null,null,null,null,null,"E.  PROGRAMS AND SERVICES FOR ELs AND THEIR FAMILIES (CONTINUED)",null,null,null,null,null,null,null,null,null,null,null,null,null,null,null,"E.  PROGRAMS AND SERVICES FOR ELs AND THEIR FAMILIES (CONTINUED)",null,null,null,null,null,null,null,null,null,null,null,null,null,null,null,"E.  PROGRAMS AND SERVICES FOR ELs AND THEIR FAMILIES (CONTINUED)",null,null,null,null,null,null,null,null,null,null,null,null,null,null,null,"E.  PROGRAMS AND SERVICES FOR ELs AND THEIR FAMILIES (CONTINUED)",null,null,null,null,null,null,null,null,null,null,null,null,null,null,null,"E.  PROGRAMS AND SERVICES FOR ELs AND THEIR FAMILIES (CONTINUED)",null,null,null,null,null,null,null,null,null,null,null,null,null,null,null,"E.  PROGRAMS AND SERVICES FOR ELs AND THEIR FAMILIES (CONTINUED)",null,null,null,null,null,null,null,null,null,null,null,null,null,null,null,"E.  PROGRAMS AND SERVICES FOR ELs AND THEIR FAMILIES (CONTINUED)",null,null,null,null,null,null,null,null,null,null,null,null,null,null,null,"E.  PROGRAMS AND SERVICES FOR ELs AND THEIR FAMILIES (CONTINUED)",null,null,null,null,null,null,null,null,null,null,null,null,null,null,null,"E.  PROGRAMS AND SERVICES FOR ELs AND THEIR FAMILIES (CONTINUED)",null,null,null,null,null,null,null,null,null,null,null,null,null,null,null,"E.  PROGRAMS AND SERVICES FOR ELs AND THEIR FAMILIES (CONTINUED)",null,null,null,null,null,null,null,null,null,null,null,null,null,null,null,"E.  PROGRAMS AND SERVICES FOR ELs AND THEIR FAMILIES (CONTINUED)",null,null,null,null,null,null,null,null,null,null,null,null,null,null,null,"E.  PROGRAMS AND SERVICES FOR ELs AND THEIR FAMILIES (CONTINUED)",null,null,null,null,null,null,null,null,null,null,null,null,null,null,null,"E.  PROGRAMS AND SERVICES FOR ELs AND THEIR FAMILIES (CONTINUED)",null,null,null,null,null,null,null,null,null,null,null,null,null,null,null,"E.  PROGRAMS AND SERVICES FOR ELs AND THEIR FAMILIES (CONTINUED)",null,null,null,null,null,null,null,null,null,null,null,null,null,null,null,"E.  PROGRAMS AND SERVICES FOR ELs AND THEIR FAMILIES (CONTINUED)",null,null,null,null,null,null,null,null,null,null,null,null,null,null,null,"E.  PROGRAMS AND SERVICES FOR ELs AND THEIR FAMILIES (CONTINUED)",null,null,null,null,null,null,null,null,null,null,null,null,null,null,null,"E.  PROGRAMS AND SERVICES FOR ELs AND THEIR FAMILIES (CONTINUED)",null,null,null,null,null,null,null,null,null,null,null,null,null,null,null,"E.  PROGRAMS AND SERVICES FOR ELs AND THEIR FAMILIES (CONTINUED)",null,null,null,null,null,null,null,null,null,null,null,null,null,null,null,"E.  PROGRAMS AND SERVICES FOR ELs AND THEIR FAMILIES (CONTINUED)",null,null,null,null,null,null,null,null,null,null,null,null,null,null,null,"E.  PROGRAMS AND SERVICES FOR ELs AND THEIR FAMILIES (CONTINUED)",null,null,null,null,null,null,null,null,null,null,null,null,null,null,null,"E.  PROGRAMS AND SERVICES FOR ELs AND THEIR FAMILIES (CONTINUED)",null,null,null,null,null,null,null,null,null,null,null,null,null,null,null,"E.  PROGRAMS AND SERVICES FOR ELs AND THEIR FAMILIES (CONTINUED)",null,null,null,null,null,null,null,null,null,null,null,null,null,null,null,"E.  PROGRAMS AND SERVICES FOR ELs AND THEIR FAMILIES (CONTINUED)",null,null,null,null,null,null,null,null,null,null,null,null,null,null,null,"E.  PROGRAMS AND SERVICES FOR ELs AND THEIR FAMILIES (CONTINUED)",null,null,null,null,null,null,null,null,null,null,null,null,null,null,null,"E.  PROGRAMS AND SERVICES FOR ELs AND THEIR FAMILIES (CONTINUED)",null,null,null,null,null,null,null,null,null,null,null,null,null,null,null,"E.  PROGRAMS AND SERVICES FOR ELs AND THEIR FAMILIES (CONTINUED)",null,null,null,null,null,null,null,null,null,null,null,null,null,null,null,"E.  PROGRAMS AND SERVICES FOR ELs AND THEIR FAMILIES (CONTINUED)",null,null,null,null,null,null,null,null,null,null,null,null,null,null,null,"E.  PROGRAMS AND SERVICES FOR ELs AND THEIR FAMILIES (CONTINUED)",null,null,null,null,null,null,null,null,null,null,null,null,null,null,null,"E.  PROGRAMS AND SERVICES FOR ELs AND THEIR FAMILIES (CONTINUED)",null,null,null,null,null,null,null,null,null,null,null,null,null,null,null,"E.  PROGRAMS AND SERVICES FOR ELs AND THEIR FAMILIES (CONTINUED)",null,null,null,null,null,null,null,null,null,null,null,null,null,null,null,"E.  PROGRAMS AND SERVICES FOR ELs AND THEIR FAMILIES (CONTINUED)",null,null,null,null,null,null,null,null,null,null,null,null,null,null,null,"E.  PROGRAMS AND SERVICES FOR ELs AND THEIR FAMILIES (CONTINUED)",null,null,null,null,null,null,null,null,null,null,null,null,null,null,null,"E.  PROGRAMS AND SERVICES FOR ELs AND THEIR FAMILIES (CONTINUED)",null,null,null,null,null,null,null,null,null,null,null,null,null,null,null,"E.  PROGRAMS AND SERVICES FOR ELs AND THEIR FAMILIES (CONTINUED)",null,null,null,null,null,null,null,null,null,null,null,null,null,null,null,"E.  PROGRAMS AND SERVICES FOR ELs AND THEIR FAMILIES (CONTINUED)",null,null,null,null,null,null,null,null,null,null,null,null,null,null,null,"E.  PROGRAMS AND SERVICES FOR ELs AND THEIR FAMILIES (CONTINUED)",null,null,null,null,null,null,null,null,null,null,null,null,null,null,null,"E.  PROGRAMS AND SERVICES FOR ELs AND THEIR FAMILIES (CONTINUED)",null,null,null,null,null,null,null,null,null,null,null,null,null,null,null,"E.  PROGRAMS AND SERVICES FOR ELs AND THEIR FAMILIES (CONTINUED)",null,null,null,null,null,null,null,null,null,null,null,null,null,null,null,"E.  PROGRAMS AND SERVICES FOR ELs AND THEIR FAMILIES (CONTINUED)",null,null,null,null,null,null,null,null,null,null,null,null,null,null,null,"E.  PROGRAMS AND SERVICES FOR ELs AND THEIR FAMILIES (CONTINUED)",null,null,null,null,null,null,null,null,null,null,null,null,null,null,null,"E.  PROGRAMS AND SERVICES FOR ELs AND THEIR FAMILIES (CONTINUED)",null,null,null,null,null,null,null,null,null,null,null,null,null,null,null,"E.  PROGRAMS AND SERVICES FOR ELs AND THEIR FAMILIES (CONTINUED)",null,null,null,null,null,null,null,null,null,null,null,null,null,null,null,"E.  PROGRAMS AND SERVICES FOR ELs AND THEIR FAMILIES (CONTINUED)",null,null,null,null,null,null,null,null,null,null,null,null,null,null,null,"E.  PROGRAMS AND SERVICES FOR ELs AND THEIR FAMILIES (CONTINUED)",null,null,null,null,null,null,null,null,null,null,null,null,null,null,null,"E.  PROGRAMS AND SERVICES FOR ELs AND THEIR FAMILIES (CONTINUED)",null,null,null,null,null,null,null,null,null,null,null,null,null,null,null,"E.  PROGRAMS AND SERVICES FOR ELs AND THEIR FAMILIES (CONTINUED)",null,null,null,null,null,null,null,null,null,null,null,null,null,null,null,"E.  PROGRAMS AND SERVICES FOR ELs AND THEIR FAMILIES (CONTINUED)",null,null,null,null,null,null,null,null,null,null,null,null,null,null,null,"E.  PROGRAMS AND SERVICES FOR ELs AND THEIR FAMILIES (CONTINUED)",null,null,null,null,null,null,null,null,null,null,null,null,null,null,null,"E.  PROGRAMS AND SERVICES FOR ELs AND THEIR FAMILIES (CONTINUED)",null,null,null,null,null,null,null,null,null,null,null,null,null,null,null,"E.  PROGRAMS AND SERVICES FOR ELs AND THEIR FAMILIES (CONTINUED)",null,null,null,null,null,null,null,null,null,null,null,null,null,null,null,"E.  PROGRAMS AND SERVICES FOR ELs AND THEIR FAMILIES (CONTINUED)",null,null,null,null,null,null,null,null,null,null,null,null,null,null,null,"E.  PROGRAMS AND SERVICES FOR ELs AND THEIR FAMILIES (CONTINUED)",null,null,null,null,null,null,null,null,null,null,null,null,null,null,null,"E.  PROGRAMS AND SERVICES FOR ELs AND THEIR FAMILIES (CONTINUED)",null,null,null,null,null,null,null,null,null,null,null,null,null,null,null,"E.  PROGRAMS AND SERVICES FOR ELs AND THEIR FAMILIES (CONTINUED)",null,null,null,null,null,null,null,null,null,null,null,null,null,null,null,"E.  PROGRAMS AND SERVICES FOR ELs AND THEIR FAMILIES (CONTINUED)",null,null,null,null,null,null,null,null,null,null,null,null,null,null,null,"E.  PROGRAMS AND SERVICES FOR ELs AND THEIR FAMILIES (CONTINUED)",null,null,null,null,null,null,null,null,null,null,null,null,null,null,null,"E.  PROGRAMS AND SERVICES FOR ELs AND THEIR FAMILIES (CONTINUED)",null,null,null,null,null,null,null,null,null,null,null,null,null,null,null,"E.  PROGRAMS AND SERVICES FOR ELs AND THEIR FAMILIES (CONTINUED)",null,null,null,null,null,null,null,null,null,null,null,null,null,null,null,"E.  PROGRAMS AND SERVICES FOR ELs AND THEIR FAMILIES (CONTINUED)",null,null,null,null,null,null,null,null,null,null,null,null,null,null,null,"E.  PROGRAMS AND SERVICES FOR ELs AND THEIR FAMILIES (CONTINUED)",null,null,null,null,null,null,null,null,null,null,null,null,null,null,null,"E.  PROGRAMS AND SERVICES FOR ELs AND THEIR FAMILIES (CONTINUED)",null,null,null,null,null,null,null,null,null,null,null,null,null,null,null,"E.  PROGRAMS AND SERVICES FOR ELs AND THEIR FAMILIES (CONTINUED)",null,null,null,null,null,null,null,null,null,null,null,null,null,null,null,"E.  PROGRAMS AND SERVICES FOR ELs AND THEIR FAMILIES (CONTINUED)",null,null,null,null,null,null,null,null,null,null,null,null,null,null,null,"E.  PROGRAMS AND SERVICES FOR ELs AND THEIR FAMILIES (CONTINUED)",null,null,null,null,null,null,null,null,null,null,null,null,null,null,null,"E.  PROGRAMS AND SERVICES FOR ELs AND THEIR FAMILIES (CONTINUED)",null,null,null,null,null,null,null,null,null,null,null,null,null,null,null,"E.  PROGRAMS AND SERVICES FOR ELs AND THEIR FAMILIES (CONTINUED)",null,null,null,null,null,null,null,null,null,null,null,null,null,null,null,"E.  PROGRAMS AND SERVICES FOR ELs AND THEIR FAMILIES (CONTINUED)",null,null,null,null,null,null,null,null,null,null,null,null,null,null,null,"E.  PROGRAMS AND SERVICES FOR ELs AND THEIR FAMILIES (CONTINUED)",null,null,null,null,null,null,null,null,null,null,null,null,null,null,null,"E.  PROGRAMS AND SERVICES FOR ELs AND THEIR FAMILIES (CONTINUED)",null,null,null,null,null,null,null,null,null,null,null,null,null,null,null,"E.  PROGRAMS AND SERVICES FOR ELs AND THEIR FAMILIES (CONTINUED)",null,null,null,null,null,null,null,null,null,null,null,null,null,null,null,"E.  PROGRAMS AND SERVICES FOR ELs AND THEIR FAMILIES (CONTINUED)",null,null,null,null,null,null,null,null,null,null,null,null,null,null,null,"E.  PROGRAMS AND SERVICES FOR ELs AND THEIR FAMILIES (CONTINUED)",null,null,null,null,null,null,null,null,null,null,null,null,null,null,null,"E.  PROGRAMS AND SERVICES FOR ELs AND THEIR FAMILIES (CONTINUED)",null,null,null,null,null,null,null,null,null,null,null,null,null,null,null,"E.  PROGRAMS AND SERVICES FOR ELs AND THEIR FAMILIES (CONTINUED)",null,null,null,null,null,null,null,null,null,null,null,null,null,null,null,"E.  PROGRAMS AND SERVICES FOR ELs AND THEIR FAMILIES (CONTINUED)",null,null,null,null,null,null,null,null,null,null,null,null,null,null,null,"E.  PROGRAMS AND SERVICES FOR ELs AND THEIR FAMILIES (CONTINUED)",null,null,null,null,null,null,null,null,null,null,null,null,null,null,null,"E.  PROGRAMS AND SERVICES FOR ELs AND THEIR FAMILIES (CONTINUED)",null,null,null,null,null,null,null,null,null,null,null,null,null,null,null,"E.  PROGRAMS AND SERVICES FOR ELs AND THEIR FAMILIES (CONTINUED)",null,null,null,null,null,null,null,null,null,null,null,null,null,null,null,"E.  PROGRAMS AND SERVICES FOR ELs AND THEIR FAMILIES (CONTINUED)",null,null,null,null,null,null,null,null,null,null,null,null,null,null,null,"E.  PROGRAMS AND SERVICES FOR ELs AND THEIR FAMILIES (CONTINUED)",null,null,null,null,null,null,null,null,null,null,null,null,null,null,null,"E.  PROGRAMS AND SERVICES FOR ELs AND THEIR FAMILIES (CONTINUED)",null,null,null,null,null,null,null,null,null,null,null,null,null,null,null,"E.  PROGRAMS AND SERVICES FOR ELs AND THEIR FAMILIES (CONTINUED)",null,null,null,null,null,null,null,null,null,null,null,null,null,null,null,"E.  PROGRAMS AND SERVICES FOR ELs AND THEIR FAMILIES (CONTINUED)",null,null,null,null,null,null,null,null,null,null,null,null,null,null,null,"E.  PROGRAMS AND SERVICES FOR ELs AND THEIR FAMILIES (CONTINUED)",null,null,null,null,null,null,null,null,null,null,null,null,null,null,null,"E.  PROGRAMS AND SERVICES FOR ELs AND THEIR FAMILIES (CONTINUED)",null,null,null,null,null,null,null,null,null,null,null,null,null,null,null,"E.  PROGRAMS AND SERVICES FOR ELs AND THEIR FAMILIES (CONTINUED)",null,null,null,null,null,null,null,null,null,null,null,null,null,null,null,"E.  PROGRAMS AND SERVICES FOR ELs AND THEIR FAMILIES (CONTINUED)",null,null,null,null,null,null,null,null,null,null,null,null,null,null,null,"E.  PROGRAMS AND SERVICES FOR ELs AND THEIR FAMILIES (CONTINUED)",null,null,null,null,null,null,null,null,null,null,null,null,null,null,null,"E.  PROGRAMS AND SERVICES FOR ELs AND THEIR FAMILIES (CONTINUED)",null,null,null,null,null,null,null,null,null,null,null,null,null,null,null,"E.  PROGRAMS AND SERVICES FOR ELs AND THEIR FAMILIES (CONTINUED)",null,null,null,null,null,null,null,null,null,null,null,null,null,null,null,"E.  PROGRAMS AND SERVICES FOR ELs AND THEIR FAMILIES (CONTINUED)",null,null,null,null,null,null,null,null,null,null,null,null,null,null,null,"E.  PROGRAMS AND SERVICES FOR ELs AND THEIR FAMILIES (CONTINUED)",null,null,null,null,null,null,null,null,null,null,null,null,null,null,null,"E.  PROGRAMS AND SERVICES FOR ELs AND THEIR FAMILIES (CONTINUED)",null,null,null,null,null,null,null,null,null,null,null,null,null,null,null,"E.  PROGRAMS AND SERVICES FOR ELs AND THEIR FAMILIES (CONTINUED)",null,null,null,null,null,null,null,null,null,null,null,null,null,null,null,"E.  PROGRAMS AND SERVICES FOR ELs AND THEIR FAMILIES (CONTINUED)",null,null,null,null,null,null,null,null,null,null,null,null,null,null,null,"E.  PROGRAMS AND SERVICES FOR ELs AND THEIR FAMILIES (CONTINUED)",null,null,null,null,null,null,null,null,null,null,null,null,null,null,null,"E.  PROGRAMS AND SERVICES FOR ELs AND THEIR FAMILIES (CONTINUED)",null,null,null,null,null,null,null,null,null,null,null,null,null,null,null,"E.  PROGRAMS AND SERVICES FOR ELs AND THEIR FAMILIES (CONTINUED)",null,null,null,null,null,null,null,null,null,null,null,null,null,null,null,"E.  PROGRAMS AND SERVICES FOR ELs AND THEIR FAMILIES (CONTINUED)",null,null,null,null,null,null,null,null,null,null,null,null,null,null,null,"E.  PROGRAMS AND SERVICES FOR ELs AND THEIR FAMILIES (CONTINUED)",null,null,null,null,null,null,null,null,null,null,null,null,null,null,null,"E.  PROGRAMS AND SERVICES FOR ELs AND THEIR FAMILIES (CONTINUED)",null,null,null,null,null,null,null,null,null,null,null,null,null,null,null,"E.  PROGRAMS AND SERVICES FOR ELs AND THEIR FAMILIES (CONTINUED)",null,null,null,null,null,null,null,null,null,null,null,null,null,null,null,"E.  PROGRAMS AND SERVICES FOR ELs AND THEIR FAMILIES (CONTINUED)",null,null,null,null,null,null,null,null,null,null,null,null,null,null,null,"E.  PROGRAMS AND SERVICES FOR ELs AND THEIR FAMILIES (CONTINUED)",null,null,null,null,null,null,null,null,null,null,null,null,null,null,null,"E.  PROGRAMS AND SERVICES FOR ELs AND THEIR FAMILIES (CONTINUED)",null,null,null,null,null,null,null,null,null,null,null,null,null,null,null,"E.  PROGRAMS AND SERVICES FOR ELs AND THEIR FAMILIES (CONTINUED)",null,null,null,null,null,null,null,null,null,null,null,null,null,null,null,"E.  PROGRAMS AND SERVICES FOR ELs AND THEIR FAMILIES (CONTINUED)",null,null,null,null,null,null,null,null,null,null,null,null,null,null,null,"E.  PROGRAMS AND SERVICES FOR ELs AND THEIR FAMILIES (CONTINUED)",null,null,null,null,null,null,null,null,null,null,null,null,null,null,null,"E.  PROGRAMS AND SERVICES FOR ELs AND THEIR FAMILIES (CONTINUED)",null,null,null,null,null,null,null,null,null,null,null,null,null,null,null,"E.  PROGRAMS AND SERVICES FOR ELs AND THEIR FAMILIES (CONTINUED)",null,null,null,null,null,null,null,null,null,null,null,null,null,null,null,"E.  PROGRAMS AND SERVICES FOR ELs AND THEIR FAMILIES (CONTINUED)",null,null,null,null,null,null,null,null,null,null,null,null,null,null,null,"E.  PROGRAMS AND SERVICES FOR ELs AND THEIR FAMILIES (CONTINUED)",null,null,null,null,null,null,null,null,null,null,null,null,null,null,null,"E.  PROGRAMS AND SERVICES FOR ELs AND THEIR FAMILIES (CONTINUED)",null,null,null,null,null,null,null,null,null,null,null,null,null,null,null,"E.  PROGRAMS AND SERVICES FOR ELs AND THEIR FAMILIES (CONTINUED)",null,null,null,null,null,null,null,null,null,null,null,null,null,null,null,"E.  PROGRAMS AND SERVICES FOR ELs AND THEIR FAMILIES (CONTINUED)",null,null,null,null,null,null,null,null,null,null,null,null,null,null,null,"E.  PROGRAMS AND SERVICES FOR ELs AND THEIR FAMILIES (CONTINUED)",null,null,null,null,null,null,null,null,null,null,null,null,null,null,null,"E.  PROGRAMS AND SERVICES FOR ELs AND THEIR FAMILIES (CONTINUED)",null,null,null,null,null,null,null,null,null,null,null,null,null,null,null,"E.  PROGRAMS AND SERVICES FOR ELs AND THEIR FAMILIES (CONTINUED)",null,null,null,null,null,null,null,null,null,null,null,null,null,null,null,"E.  PROGRAMS AND SERVICES FOR ELs AND THEIR FAMILIES (CONTINUED)",null,null,null,null,null,null,null,null,null,null,null,null,null,null,null,"E.  PROGRAMS AND SERVICES FOR ELs AND THEIR FAMILIES (CONTINUED)",null,null,null,null,null,null,null,null,null,null,null,null,null,null,null,"E.  PROGRAMS AND SERVICES FOR ELs AND THEIR FAMILIES (CONTINUED)",null,null,null,null,null,null,null,null,null,null,null,null,null,null,null,"E.  PROGRAMS AND SERVICES FOR ELs AND THEIR FAMILIES (CONTINUED)",null,null,null,null,null,null,null,null,null,null,null,null,null,null,null,"E.  PROGRAMS AND SERVICES FOR ELs AND THEIR FAMILIES (CONTINUED)",null,null,null,null,null,null,null,null,null,null,null,null,null,null,null,"E.  PROGRAMS AND SERVICES FOR ELs AND THEIR FAMILIES (CONTINUED)",null,null,null,null,null,null,null,null,null,null,null,null,null,null,null,"E.  PROGRAMS AND SERVICES FOR ELs AND THEIR FAMILIES (CONTINUED)",null,null,null,null,null,null,null,null,null,null,null,null,null,null,null,"E.  PROGRAMS AND SERVICES FOR ELs AND THEIR FAMILIES (CONTINUED)",null,null,null,null,null,null,null,null,null,null,null,null,null,null,null,"E.  PROGRAMS AND SERVICES FOR ELs AND THEIR FAMILIES (CONTINUED)",null,null,null,null,null,null,null,null,null,null,null,null,null,null,null,"E.  PROGRAMS AND SERVICES FOR ELs AND THEIR FAMILIES (CONTINUED)",null,null,null,null,null,null,null,null,null,null,null,null,null,null,null,"E.  PROGRAMS AND SERVICES FOR ELs AND THEIR FAMILIES (CONTINUED)",null,null,null,null,null,null,null,null,null,null,null,null,null,null,null,"E.  PROGRAMS AND SERVICES FOR ELs AND THEIR FAMILIES (CONTINUED)",null,null,null,null,null,null,null,null,null,null,null,null,null,null,null,"E.  PROGRAMS AND SERVICES FOR ELs AND THEIR FAMILIES (CONTINUED)",null,null,null,null,null,null,null,null,null,null,null,null,null,null,null,"E.  PROGRAMS AND SERVICES FOR ELs AND THEIR FAMILIES (CONTINUED)",null,null,null,null,null,null,null,null,null,null,null,null,null,null,null,"E.  PROGRAMS AND SERVICES FOR ELs AND THEIR FAMILIES (CONTINUED)",null,null,null,null,null,null,null,null,null,null,null,null,null,null,null,"E.  PROGRAMS AND SERVICES FOR ELs AND THEIR FAMILIES (CONTINUED)",null,null,null,null,null,null,null,null,null,null,null,null,null,null,null,"E.  PROGRAMS AND SERVICES FOR ELs AND THEIR FAMILIES (CONTINUED)",null,null,null,null,null,null,null,null,null,null,null,null,null,null,null,"E.  PROGRAMS AND SERVICES FOR ELs AND THEIR FAMILIES (CONTINUED)",null,null,null,null,null,null,null,null,null,null,null,null,null,null,null,"E.  PROGRAMS AND SERVICES FOR ELs AND THEIR FAMILIES (CONTINUED)",null,null,null,null,null,null,null,null,null,null,null,null,null,null,null,"E.  PROGRAMS AND SERVICES FOR ELs AND THEIR FAMILIES (CONTINUED)",null,null,null,null,null,null,null,null,null,null,null,null,null,null,null,"E.  PROGRAMS AND SERVICES FOR ELs AND THEIR FAMILIES (CONTINUED)",null,null,null,null,null,null,null,null,null,null,null,null,null,null,null,"E.  PROGRAMS AND SERVICES FOR ELs AND THEIR FAMILIES (CONTINUED)",null,null,null,null,null,null,null,null,null,null,null,null,null,null,null,"E.  PROGRAMS AND SERVICES FOR ELs AND THEIR FAMILIES (CONTINUED)",null,null,null,null,null,null,null,null,null,null,null,null,null,null,null,"E.  PROGRAMS AND SERVICES FOR ELs AND THEIR FAMILIES (CONTINUED)",null,null,null,null,null,null,null,null,null,null,null,null,null,null,null,"E.  PROGRAMS AND SERVICES FOR ELs AND THEIR FAMILIES (CONTINUED)",null,null,null,null,null,null,null,null,null,null,null,null,null,null,null,"E.  PROGRAMS AND SERVICES FOR ELs AND THEIR FAMILIES (CONTINUED)",null,null,null,null,null,null,null,null,null,null,null,null,null,null,null,"E.  PROGRAMS AND SERVICES FOR ELs AND THEIR FAMILIES (CONTINUED)",null,null,null,null,null,null,null,null,null,null,null,null,null,null,null,"E.  PROGRAMS AND SERVICES FOR ELs AND THEIR FAMILIES (CONTINUED)",null,null,null,null,null,null,null,null,null,null,null,null,null,null,null,"E.  PROGRAMS AND SERVICES FOR ELs AND THEIR FAMILIES (CONTINUED)",null,null,null,null,null,null,null,null,null,null,null,null,null,null,null,"E.  PROGRAMS AND SERVICES FOR ELs AND THEIR FAMILIES (CONTINUED)",null,null,null,null,null,null,null,null,null,null,null,null,null,null,null,"E.  PROGRAMS AND SERVICES FOR ELs AND THEIR FAMILIES (CONTINUED)",null,null,null,null,null,null,null,null,null,null,null,null,null,null,null,"E.  PROGRAMS AND SERVICES FOR ELs AND THEIR FAMILIES (CONTINUED)",null,null,null,null,null,null,null,null,null,null,null,null,null,null,null,"E.  PROGRAMS AND SERVICES FOR ELs AND THEIR FAMILIES (CONTINUED)",null,null,null,null,null,null,null,null,null,null,null,null,null,null,null,"E.  PROGRAMS AND SERVICES FOR ELs AND THEIR FAMILIES (CONTINUED)",null,null,null,null,null,null,null,null,null,null,null,null,null,null,null,"E.  PROGRAMS AND SERVICES FOR ELs AND THEIR FAMILIES (CONTINUED)",null,null,null,null,null,null,null,null,null,null,null,null,null,null,null,"E.  PROGRAMS AND SERVICES FOR ELs AND THEIR FAMILIES (CONTINUED)",null,null,null,null,null,null,null,null,null,null,null,null,null,null,null,"E.  PROGRAMS AND SERVICES FOR ELs AND THEIR FAMILIES (CONTINUED)",null,null,null,null,null,null,null,null,null,null,null,null,null,null,null,"E.  PROGRAMS AND SERVICES FOR ELs AND THEIR FAMILIES (CONTINUED)",null,null,null,null,null,null,null,null,null,null,null,null,null,null,null,"E.  PROGRAMS AND SERVICES FOR ELs AND THEIR FAMILIES (CONTINUED)",null,null,null,null,null,null,null,null,null,null,null,null,null,null,null,"E.  PROGRAMS AND SERVICES FOR ELs AND THEIR FAMILIES (CONTINUED)",null,null,null,null,null,null,null,null,null,null,null,null,null,null,null,"E.  PROGRAMS AND SERVICES FOR ELs AND THEIR FAMILIES (CONTINUED)",null,null,null,null,null,null,null,null,null,null,null,null,null,null,null,"E.  PROGRAMS AND SERVICES FOR ELs AND THEIR FAMILIES (CONTINUED)",null,null,null,null,null,null,null,null,null,null,null,null,null,null,null,"E.  PROGRAMS AND SERVICES FOR ELs AND THEIR FAMILIES (CONTINUED)",null,null,null,null,null,null,null,null,null,null,null,null,null,null,null,"E.  PROGRAMS AND SERVICES FOR ELs AND THEIR FAMILIES (CONTINUED)",null,null,null,null,null,null,null,null,null,null,null,null,null,null,null,"E.  PROGRAMS AND SERVICES FOR ELs AND THEIR FAMILIES (CONTINUED)",null,null,null,null,null,null,null,null,null,null,null,null,null,null,null,"E.  PROGRAMS AND SERVICES FOR ELs AND THEIR FAMILIES (CONTINUED)",null,null,null,null,null,null,null,null,null,null,null,null,null,null,null,"E.  PROGRAMS AND SERVICES FOR ELs AND THEIR FAMILIES (CONTINUED)",null,null,null,null,null,null,null,null,null,null,null,null,null,null,null,"E.  PROGRAMS AND SERVICES FOR ELs AND THEIR FAMILIES (CONTINUED)",null,null,null,null,null,null,null,null,null,null,null,null,null,null,null,"E.  PROGRAMS AND SERVICES FOR ELs AND THEIR FAMILIES (CONTINUED)",null,null,null,null,null,null,null,null,null,null,null,null,null,null,null,"E.  PROGRAMS AND SERVICES FOR ELs AND THEIR FAMILIES (CONTINUED)",null,null,null,null,null,null,null,null,null,null,null,null,null,null,null,"E.  PROGRAMS AND SERVICES FOR ELs AND THEIR FAMILIES (CONTINUED)",null,null,null,null,null,null,null,null,null,null,null,null,null,null,null,"E.  PROGRAMS AND SERVICES FOR ELs AND THEIR FAMILIES (CONTINUED)",null,null,null,null,null,null,null,null,null,null,null,null,null,null,null,"E.  PROGRAMS AND SERVICES FOR ELs AND THEIR FAMILIES (CONTINUED)",null,null,null,null,null,null,null,null,null,null,null,null,null,null,null,"E.  PROGRAMS AND SERVICES FOR ELs AND THEIR FAMILIES (CONTINUED)",null,null,null,null,null,null,null,null,null,null,null,null,null,null,null,"E.  PROGRAMS AND SERVICES FOR ELs AND THEIR FAMILIES (CONTINUED)",null,null,null,null,null,null,null,null,null,null,null,null,null,null,null,"E.  PROGRAMS AND SERVICES FOR ELs AND THEIR FAMILIES (CONTINUED)",null,null,null,null,null,null,null,null,null,null,null,null,null,null,null,"E.  PROGRAMS AND SERVICES FOR ELs AND THEIR FAMILIES (CONTINUED)",null,null,null,null,null,null,null,null,null,null,null,null,null,null,null,"E.  PROGRAMS AND SERVICES FOR ELs AND THEIR FAMILIES (CONTINUED)",null,null,null,null,null,null,null,null,null,null,null,null,null,null,null,"E.  PROGRAMS AND SERVICES FOR ELs AND THEIR FAMILIES (CONTINUED)",null,null,null,null,null,null,null,null,null,null,null,null,null,null,null,"E.  PROGRAMS AND SERVICES FOR ELs AND THEIR FAMILIES (CONTINUED)",null,null,null,null,null,null,null,null,null,null,null,null,null,null,null,"E.  PROGRAMS AND SERVICES FOR ELs AND THEIR FAMILIES (CONTINUED)",null,null,null,null,null,null,null,null,null,null,null,null,null,null,null,"E.  PROGRAMS AND SERVICES FOR ELs AND THEIR FAMILIES (CONTINUED)",null,null,null,null,null,null,null,null,null,null,null,null,null,null,null,"E.  PROGRAMS AND SERVICES FOR ELs AND THEIR FAMILIES (CONTINUED)",null,null,null,null,null,null,null,null,null,null,null,null,null,null,null,"E.  PROGRAMS AND SERVICES FOR ELs AND THEIR FAMILIES (CONTINUED)",null,null,null,null,null,null,null,null,null,null,null,null,null,null,null,"E.  PROGRAMS AND SERVICES FOR ELs AND THEIR FAMILIES (CONTINUED)",null,null,null,null,null,null,null,null,null,null,null,null,null,null,null,"E.  PROGRAMS AND SERVICES FOR ELs AND THEIR FAMILIES (CONTINUED)",null,null,null,null,null,null,null,null,null,null,null,null,null,null,null,"E.  PROGRAMS AND SERVICES FOR ELs AND THEIR FAMILIES (CONTINUED)",null,null,null,null,null,null,null,null,null,null,null,null,null,null,null,"E.  PROGRAMS AND SERVICES FOR ELs AND THEIR FAMILIES (CONTINUED)",null,null,null,null,null,null,null,null,null,null,null,null,null,null,null,"E.  PROGRAMS AND SERVICES FOR ELs AND THEIR FAMILIES (CONTINUED)",null,null,null,null,null,null,null,null,null,null,null,null,null,null,null,"E.  PROGRAMS AND SERVICES FOR ELs AND THEIR FAMILIES (CONTINUED)",null,null,null,null,null,null,null,null,null,null,null,null,null,null,null,"E.  PROGRAMS AND SERVICES FOR ELs AND THEIR FAMILIES (CONTINUED)",null,null,null,null,null,null,null,null,null,null,null,null,null,null,null,"E.  PROGRAMS AND SERVICES FOR ELs AND THEIR FAMILIES (CONTINUED)",null,null,null,null,null,null,null,null,null,null,null,null,null,null,null,"E.  PROGRAMS AND SERVICES FOR ELs AND THEIR FAMILIES (CONTINUED)",null,null,null,null,null,null,null,null,null,null,null,null,null,null,null,"E.  PROGRAMS AND SERVICES FOR ELs AND THEIR FAMILIES (CONTINUED)",null,null,null,null,null,null,null,null,null,null,null,null,null,null,null,"E.  PROGRAMS AND SERVICES FOR ELs AND THEIR FAMILIES (CONTINUED)",null,null,null,null,null,null,null,null,null,null,null,null,null,null,null,"E.  PROGRAMS AND SERVICES FOR ELs AND THEIR FAMILIES (CONTINUED)",null,null,null,null,null,null,null,null,null,null,null,null,null,null,null,"E.  PROGRAMS AND SERVICES FOR ELs AND THEIR FAMILIES (CONTINUED)",null,null,null,null,null,null,null,null,null,null,null,null,null,null,null,"E.  PROGRAMS AND SERVICES FOR ELs AND THEIR FAMILIES (CONTINUED)",null,null,null,null,null,null,null,null,null,null,null,null,null,null,null,"E.  PROGRAMS AND SERVICES FOR ELs AND THEIR FAMILIES (CONTINUED)",null,null,null,null,null,null,null,null,null,null,null,null,null,null,null,"E.  PROGRAMS AND SERVICES FOR ELs AND THEIR FAMILIES (CONTINUED)",null,null,null,null,null,null,null,null,null,null,null,null,null,null,null,"E.  PROGRAMS AND SERVICES FOR ELs AND THEIR FAMILIES (CONTINUED)",null,null,null,null,null,null,null,null,null,null,null,null,null,null,null,"E.  PROGRAMS AND SERVICES FOR ELs AND THEIR FAMILIES (CONTINUED)",null,null,null,null,null,null,null,null,null,null,null,null,null,null,null,"E.  PROGRAMS AND SERVICES FOR ELs AND THEIR FAMILIES (CONTINUED)",null,null,null,null,null,null,null,null,null,null,null,null,null,null,null,"E.  PROGRAMS AND SERVICES FOR ELs AND THEIR FAMILIES (CONTINUED)",null,null,null,null,null,null,null,null,null,null,null,null,null,null,null,"E.  PROGRAMS AND SERVICES FOR ELs AND THEIR FAMILIES (CONTINUED)",null,null,null,null,null,null,null,null,null,null,null,null,null,null,null,"E.  PROGRAMS AND SERVICES FOR ELs AND THEIR FAMILIES (CONTINUED)",null,null,null,null,null,null,null,null,null,null,null,null,null,null,null,"E.  PROGRAMS AND SERVICES FOR ELs AND THEIR FAMILIES (CONTINUED)",null,null,null,null,null,null,null,null,null,null,null,null,null,null,null,"E.  PROGRAMS AND SERVICES FOR ELs AND THEIR FAMILIES (CONTINUED)",null,null,null,null,null,null,null,null,null,null,null,null,null,null,null,"E.  PROGRAMS AND SERVICES FOR ELs AND THEIR FAMILIES (CONTINUED)",null,null,null,null,null,null,null,null,null,null,null,null,null,null,null,"E.  PROGRAMS AND SERVICES FOR ELs AND THEIR FAMILIES (CONTINUED)",null,null,null,null,null,null,null,null,null,null,null,null,null,null,null,"E.  PROGRAMS AND SERVICES FOR ELs AND THEIR FAMILIES (CONTINUED)",null,null,null,null,null,null,null,null,null,null,null,null,null,null,null,"E.  PROGRAMS AND SERVICES FOR ELs AND THEIR FAMILIES (CONTINUED)",null,null,null,null,null,null,null,null,null,null,null,null,null,null,null,"E.  PROGRAMS AND SERVICES FOR ELs AND THEIR FAMILIES (CONTINUED)",null,null,null,null,null,null,null,null,null,null,null,null,null,null,null,"E.  PROGRAMS AND SERVICES FOR ELs AND THEIR FAMILIES (CONTINUED)",null,null,null,null,null,null,null,null,null,null,null,null,null,null,null,"E.  PROGRAMS AND SERVICES FOR ELs AND THEIR FAMILIES (CONTINUED)",null,null,null,null,null,null,null,null,null,null,null,null,null,null,null,"E.  PROGRAMS AND SERVICES FOR ELs AND THEIR FAMILIES (CONTINUED)",null,null,null,null,null,null,null,null,null,null,null,null,null,null,null,"E.  PROGRAMS AND SERVICES FOR ELs AND THEIR FAMILIES (CONTINUED)",null,null,null,null,null,null,null,null,null,null,null,null,null,null,null,"E.  PROGRAMS AND SERVICES FOR ELs AND THEIR FAMILIES (CONTINUED)",null,null,null,null,null,null,null,null,null,null,null,null,null,null,null,"E.  PROGRAMS AND SERVICES FOR ELs AND THEIR FAMILIES (CONTINUED)",null,null,null,null,null,null,null,null,null,null,null,null,null,null,null,"E.  PROGRAMS AND SERVICES FOR ELs AND THEIR FAMILIES (CONTINUED)",null,null,null,null,null,null,null,null,null,null,null,null,null,null,null,"E.  PROGRAMS AND SERVICES FOR ELs AND THEIR FAMILIES (CONTINUED)",null,null,null,null,null,null,null,null,null,null,null,null,null,null,null,"E.  PROGRAMS AND SERVICES FOR ELs AND THEIR FAMILIES (CONTINUED)",null,null,null,null,null,null,null,null,null,null,null,null,null,null,null,"E.  PROGRAMS AND SERVICES FOR ELs AND THEIR FAMILIES (CONTINUED)",null,null,null,null,null,null,null,null,null,null,null,null,null,null,null,"E.  PROGRAMS AND SERVICES FOR ELs AND THEIR FAMILIES (CONTINUED)",null,null,null,null,null,null,null,null,null,null,null,null,null,null,null,"E.  PROGRAMS AND SERVICES FOR ELs AND THEIR FAMILIES (CONTINUED)",null,null,null,null,null,null,null,null,null,null,null,null,null,null,null,"E.  PROGRAMS AND SERVICES FOR ELs AND THEIR FAMILIES (CONTINUED)",null,null,null,null,null,null,null,null,null,null,null,null,null,null,null,"E.  PROGRAMS AND SERVICES FOR ELs AND THEIR FAMILIES (CONTINUED)",null,null,null,null,null,null,null,null,null,null,null,null,null,null,null,"E.  PROGRAMS AND SERVICES FOR ELs AND THEIR FAMILIES (CONTINUED)",null,null,null,null,null,null,null,null,null,null,null,null,null,null,null,"E.  PROGRAMS AND SERVICES FOR ELs AND THEIR FAMILIES (CONTINUED)",null,null,null,null,null,null,null,null,null,null,null,null,null,null,null,"E.  PROGRAMS AND SERVICES FOR ELs AND THEIR FAMILIES (CONTINUED)",null,null,null,null,null,null,null,null,null,null,null,null,null,null,null,"E.  PROGRAMS AND SERVICES FOR ELs AND THEIR FAMILIES (CONTINUED)",null,null,null,null,null,null,null,null,null,null,null,null,null,null,null,"E.  PROGRAMS AND SERVICES FOR ELs AND THEIR FAMILIES (CONTINUED)",null,null,null,null,null,null,null,null,null,null,null,null,null,null,null,"E.  PROGRAMS AND SERVICES FOR ELs AND THEIR FAMILIES (CONTINUED)",null,null,null,null,null,null,null,null,null,null,null,null,null,null,null,"E.  PROGRAMS AND SERVICES FOR ELs AND THEIR FAMILIES (CONTINUED)",null,null,null,null,null,null,null,null,null,null,null,null,null,null,null,"E.  PROGRAMS AND SERVICES FOR ELs AND THEIR FAMILIES (CONTINUED)",null,null,null,null,null,null,null,null,null,null,null,null,null,null,null,"E.  PROGRAMS AND SERVICES FOR ELs AND THEIR FAMILIES (CONTINUED)",null,null,null,null,null,null,null,null,null,null,null,null,null,null,null,"E.  PROGRAMS AND SERVICES FOR ELs AND THEIR FAMILIES (CONTINUED)",null,null,null,null,null,null,null,null,null,null,null,null,null,null,null,"E.  PROGRAMS AND SERVICES FOR ELs AND THEIR FAMILIES (CONTINUED)",null,null,null,null,null,null,null,null,null,null,null,null,null,null,null,"E.  PROGRAMS AND SERVICES FOR ELs AND THEIR FAMILIES (CONTINUED)",null,null,null,null,null,null,null,null,null,null,null,null,null,null,null,"E.  PROGRAMS AND SERVICES FOR ELs AND THEIR FAMILIES (CONTINUED)",null,null,null,null,null,null,null,null,null,null,null,null,null,null,null,"E.  PROGRAMS AND SERVICES FOR ELs AND THEIR FAMILIES (CONTINUED)",null,null,null,null,null,null,null,null,null,null,null,null,null,null,null,"E.  PROGRAMS AND SERVICES FOR ELs AND THEIR FAMILIES (CONTINUED)",null,null,null,null,null,null,null,null,null,null,null,null,null,null,null,"E.  PROGRAMS AND SERVICES FOR ELs AND THEIR FAMILIES (CONTINUED)",null,null,null,null,null,null,null,null,null,null,null,null,null,null,null,"E.  PROGRAMS AND SERVICES FOR ELs AND THEIR FAMILIES (CONTINUED)",null,null,null,null,null,null,null,null,null,null,null,null,null,null,null,"E.  PROGRAMS AND SERVICES FOR ELs AND THEIR FAMILIES (CONTINUED)",null,null,null,null,null,null,null,null,null,null,null,null,null,null,null,"E.  PROGRAMS AND SERVICES FOR ELs AND THEIR FAMILIES (CONTINUED)",null,null,null,null,null,null,null,null,null,null,null,null,null,null,null,"E.  PROGRAMS AND SERVICES FOR ELs AND THEIR FAMILIES (CONTINUED)",null,null,null,null,null,null,null,null,null,null,null,null,null,null,null,"E.  PROGRAMS AND SERVICES FOR ELs AND THEIR FAMILIES (CONTINUED)",null,null,null,null,null,null,null,null,null,null,null,null,null,null,null,"E.  PROGRAMS AND SERVICES FOR ELs AND THEIR FAMILIES (CONTINUED)",null,null,null,null,null,null,null,null,null,null,null,null,null,null,null,"E.  PROGRAMS AND SERVICES FOR ELs AND THEIR FAMILIES (CONTINUED)",null,null,null,null,null,null,null,null,null,null,null,null,null,null,null,"E.  PROGRAMS AND SERVICES FOR ELs AND THEIR FAMILIES (CONTINUED)",null,null,null,null,null,null,null,null,null,null,null,null,null,null,null,"E.  PROGRAMS AND SERVICES FOR ELs AND THEIR FAMILIES (CONTINUED)",null,null,null,null,null,null,null,null,null,null,null,null,null,null,null,"E.  PROGRAMS AND SERVICES FOR ELs AND THEIR FAMILIES (CONTINUED)",null,null,null,null,null,null,null,null,null,null,null,null,null,null,null,"E.  PROGRAMS AND SERVICES FOR ELs AND THEIR FAMILIES (CONTINUED)",null,null,null,null,null,null,null,null,null,null,null,null,null,null,null,"E.  PROGRAMS AND SERVICES FOR ELs AND THEIR FAMILIES (CONTINUED)",null,null,null,null,null,null,null,null,null,null,null,null,null,null,null,"E.  PROGRAMS AND SERVICES FOR ELs AND THEIR FAMILIES (CONTINUED)",null,null,null,null,null,null,null,null,null,null,null,null,null,null,null,"E.  PROGRAMS AND SERVICES FOR ELs AND THEIR FAMILIES (CONTINUED)",null,null,null,null,null,null,null,null,null,null,null,null,null,null,null,"E.  PROGRAMS AND SERVICES FOR ELs AND THEIR FAMILIES (CONTINUED)",null,null,null,null,null,null,null,null,null,null,null,null,null,null,null,"E.  PROGRAMS AND SERVICES FOR ELs AND THEIR FAMILIES (CONTINUED)",null,null,null,null,null,null,null,null,null,null,null,null,null,null,null,"E.  PROGRAMS AND SERVICES FOR ELs AND THEIR FAMILIES (CONTINUED)",null,null,null,null,null,null,null,null,null,null,null,null,null,null,null,"E.  PROGRAMS AND SERVICES FOR ELs AND THEIR FAMILIES (CONTINUED)",null,null,null,null,null,null,null,null,null,null,null,null,null,null,null,"E.  PROGRAMS AND SERVICES FOR ELs AND THEIR FAMILIES (CONTINUED)",null,null,null,null,null,null,null,null,null,null,null,null,null,null,null,"E.  PROGRAMS AND SERVICES FOR ELs AND THEIR FAMILIES (CONTINUED)",null,null,null,null,null,null,null,null,null,null,null,null,null,null,null,"E.  PROGRAMS AND SERVICES FOR ELs AND THEIR FAMILIES (CONTINUED)",null,null,null,null,null,null,null,null,null,null,null,null,null,null,null,"E.  PROGRAMS AND SERVICES FOR ELs AND THEIR FAMILIES (CONTINUED)",null,null,null,null,null,null,null,null,null,null,null,null,null,null,null,"E.  PROGRAMS AND SERVICES FOR ELs AND THEIR FAMILIES (CONTINUED)",null,null,null,null,null,null,null,null,null,null,null,null,null,null,null,"E.  PROGRAMS AND SERVICES FOR ELs AND THEIR FAMILIES (CONTINUED)",null,null,null,null,null,null,null,null,null,null,null,null,null,null,null,"E.  PROGRAMS AND SERVICES FOR ELs AND THEIR FAMILIES (CONTINUED)",null,null,null,null,null,null,null,null,null,null,null,null,null,null,null,"E.  PROGRAMS AND SERVICES FOR ELs AND THEIR FAMILIES (CONTINUED)",null,null,null,null,null,null,null,null,null,null,null,null,null,null,null,"E.  PROGRAMS AND SERVICES FOR ELs AND THEIR FAMILIES (CONTINUED)",null,null,null,null,null,null,null,null,null,null,null,null,null,null,null,"E.  PROGRAMS AND SERVICES FOR ELs AND THEIR FAMILIES (CONTINUED)",null,null,null,null,null,null,null,null,null,null,null,null,null,null,null,"E.  PROGRAMS AND SERVICES FOR ELs AND THEIR FAMILIES (CONTINUED)",null,null,null,null,null,null,null,null,null,null,null,null,null,null,null,"E.  PROGRAMS AND SERVICES FOR ELs AND THEIR FAMILIES (CONTINUED)",null,null,null,null,null,null,null,null,null,null,null,null,null,null,null,"E.  PROGRAMS AND SERVICES FOR ELs AND THEIR FAMILIES (CONTINUED)",null,null,null,null,null,null,null,null,null,null,null,null,null,null,null,"E.  PROGRAMS AND SERVICES FOR ELs AND THEIR FAMILIES (CONTINUED)",null,null,null,null,null,null,null,null,null,null,null,null,null,null,null,"E.  PROGRAMS AND SERVICES FOR ELs AND THEIR FAMILIES (CONTINUED)",null,null,null,null,null,null,null,null,null,null,null,null,null,null,null,"E.  PROGRAMS AND SERVICES FOR ELs AND THEIR FAMILIES (CONTINUED)",null,null,null,null,null,null,null,null,null,null,null,null,null,null,null,"E.  PROGRAMS AND SERVICES FOR ELs AND THEIR FAMILIES (CONTINUED)",null,null,null,null,null,null,null,null,null,null,null,null,null,null,null,"E.  PROGRAMS AND SERVICES FOR ELs AND THEIR FAMILIES (CONTINUED)",null,null,null,null,null,null,null,null,null,null,null,null,null,null,null,"E.  PROGRAMS AND SERVICES FOR ELs AND THEIR FAMILIES (CONTINUED)",null,null,null,null,null,null,null,null,null,null,null,null,null,null,null,"E.  PROGRAMS AND SERVICES FOR ELs AND THEIR FAMILIES (CONTINUED)",null,null,null,null,null,null,null,null,null,null,null,null,null,null,null,"E.  PROGRAMS AND SERVICES FOR ELs AND THEIR FAMILIES (CONTINUED)",null,null,null,null,null,null,null,null,null,null,null,null,null,null,null,"E.  PROGRAMS AND SERVICES FOR ELs AND THEIR FAMILIES (CONTINUED)",null,null,null,null,null,null,null,null,null,null,null,null,null,null,null,"E.  PROGRAMS AND SERVICES FOR ELs AND THEIR FAMILIES (CONTINUED)",null,null,null,null,null,null,null,null,null,null,null,null,null,null,null,"E.  PROGRAMS AND SERVICES FOR ELs AND THEIR FAMILIES (CONTINUED)",null,null,null,null,null,null,null,null,null,null,null,null,null,null,null,"E.  PROGRAMS AND SERVICES FOR ELs AND THEIR FAMILIES (CONTINUED)",null,null,null,null,null,null,null,null,null,null,null,null,null,null,null,"E.  PROGRAMS AND SERVICES FOR ELs AND THEIR FAMILIES (CONTINUED)",null,null,null,null,null,null,null,null,null,null,null,null,null,null,null,"E.  PROGRAMS AND SERVICES FOR ELs AND THEIR FAMILIES (CONTINUED)",null,null,null,null,null,null,null,null,null,null,null,null,null,null,null,"E.  PROGRAMS AND SERVICES FOR ELs AND THEIR FAMILIES (CONTINUED)",null,null,null,null,null,null,null,null,null,null,null,null,null,null,null,"E.  PROGRAMS AND SERVICES FOR ELs AND THEIR FAMILIES (CONTINUED)",null,null,null,null,null,null,null,null,null,null,null,null,null,null,null,"E.  PROGRAMS AND SERVICES FOR ELs AND THEIR FAMILIES (CONTINUED)",null,null,null,null,null,null,null,null,null,null,null,null,null,null,null,"E.  PROGRAMS AND SERVICES FOR ELs AND THEIR FAMILIES (CONTINUED)",null,null,null,null,null,null,null,null,null,null,null,null,null,null,null,"E.  PROGRAMS AND SERVICES FOR ELs AND THEIR FAMILIES (CONTINUED)",null,null,null,null,null,null,null,null,null,null,null,null,null,null,null,"E.  PROGRAMS AND SERVICES FOR ELs AND THEIR FAMILIES (CONTINUED)",null,null,null,null,null,null,null,null,null,null,null,null,null,null,null,"E.  PROGRAMS AND SERVICES FOR ELs AND THEIR FAMILIES (CONTINUED)",null,null,null,null,null,null,null,null,null,null,null,null,null,null,null,"E.  PROGRAMS AND SERVICES FOR ELs AND THEIR FAMILIES (CONTINUED)",null,null,null,null,null,null,null,null,null,null,null,null,null,null,null,"E.  PROGRAMS AND SERVICES FOR ELs AND THEIR FAMILIES (CONTINUED)",null,null,null,null,null,null,null,null,null,null,null,null,null,null,null,"E.  PROGRAMS AND SERVICES FOR ELs AND THEIR FAMILIES (CONTINUED)",null,null,null,null,null,null,null,null,null,null,null,null,null,null,null,"E.  PROGRAMS AND SERVICES FOR ELs AND THEIR FAMILIES (CONTINUED)",null,null,null,null,null,null,null,null,null,null,null,null,null,null,null,"E.  PROGRAMS AND SERVICES FOR ELs AND THEIR FAMILIES (CONTINUED)",null,null,null,null,null,null,null,null,null,null,null,null,null,null,null,"E.  PROGRAMS AND SERVICES FOR ELs AND THEIR FAMILIES (CONTINUED)",null,null,null,null,null,null,null,null,null,null,null,null,null,null,null,"E.  PROGRAMS AND SERVICES FOR ELs AND THEIR FAMILIES (CONTINUED)",null,null,null,null,null,null,null,null,null,null,null,null,null,null,null,"E.  PROGRAMS AND SERVICES FOR ELs AND THEIR FAMILIES (CONTINUED)",null,null,null,null,null,null,null,null,null,null,null,null,null,null,null,"E.  PROGRAMS AND SERVICES FOR ELs AND THEIR FAMILIES (CONTINUED)",null,null,null,null,null,null,null,null,null,null,null,null,null,null,null,"E.  PROGRAMS AND SERVICES FOR ELs AND THEIR FAMILIES (CONTINUED)",null,null,null,null,null,null,null,null,null,null,null,null,null,null,null,"E.  PROGRAMS AND SERVICES FOR ELs AND THEIR FAMILIES (CONTINUED)",null,null,null,null,null,null,null,null,null,null,null,null,null,null,null,"E.  PROGRAMS AND SERVICES FOR ELs AND THEIR FAMILIES (CONTINUED)",null,null,null,null,null,null,null,null,null,null,null,null,null,null,null,"E.  PROGRAMS AND SERVICES FOR ELs AND THEIR FAMILIES (CONTINUED)",null,null,null,null,null,null,null,null,null,null,null,null,null,null,null,"E.  PROGRAMS AND SERVICES FOR ELs AND THEIR FAMILIES (CONTINUED)",null,null,null,null,null,null,null,null,null,null,null,null,null,null,null,"E.  PROGRAMS AND SERVICES FOR ELs AND THEIR FAMILIES (CONTINUED)",null,null,null,null,null,null,null,null,null,null,null,null,null,null,null,"E.  PROGRAMS AND SERVICES FOR ELs AND THEIR FAMILIES (CONTINUED)",null,null,null,null,null,null,null,null,null,null,null,null,null,null,null,"E.  PROGRAMS AND SERVICES FOR ELs AND THEIR FAMILIES (CONTINUED)",null,null,null,null,null,null,null,null,null,null,null,null,null,null,null,"E.  PROGRAMS AND SERVICES FOR ELs AND THEIR FAMILIES (CONTINUED)",null,null,null,null,null,null,null,null,null,null,null,null,null,null,null,"E.  PROGRAMS AND SERVICES FOR ELs AND THEIR FAMILIES (CONTINUED)",null,null,null,null,null,null,null,null,null,null,null,null,null,null,null,"E.  PROGRAMS AND SERVICES FOR ELs AND THEIR FAMILIES (CONTINUED)",null,null,null,null,null,null,null,null,null,null,null,null,null,null,null,"E.  PROGRAMS AND SERVICES FOR ELs AND THEIR FAMILIES (CONTINUED)",null,null,null,null,null,null,null,null,null,null,null,null,null,null,null,"E.  PROGRAMS AND SERVICES FOR ELs AND THEIR FAMILIES (CONTINUED)",null,null,null,null,null,null,null,null,null,null,null,null,null,null,null,"E.  PROGRAMS AND SERVICES FOR ELs AND THEIR FAMILIES (CONTINUED)",null,null,null,null,null,null,null,null,null,null,null,null,null,null,null,"E.  PROGRAMS AND SERVICES FOR ELs AND THEIR FAMILIES (CONTINUED)",null,null,null,null,null,null,null,null,null,null,null,null,null,null,null,"E.  PROGRAMS AND SERVICES FOR ELs AND THEIR FAMILIES (CONTINUED)",null,null,null,null,null,null,null,null,null,null,null,null,null,null,null,"E.  PROGRAMS AND SERVICES FOR ELs AND THEIR FAMILIES (CONTINUED)",null,null,null,null,null,null,null,null,null,null,null,null,null,null,null,"E.  PROGRAMS AND SERVICES FOR ELs AND THEIR FAMILIES (CONTINUED)",null,null,null,null,null,null,null,null,null,null,null,null,null,null,null,"E.  PROGRAMS AND SERVICES FOR ELs AND THEIR FAMILIES (CONTINUED)",null,null,null,null,null,null,null,null,null,null,null,null,null,null,null,"E.  PROGRAMS AND SERVICES FOR ELs AND THEIR FAMILIES (CONTINUED)",null,null,null,null,null,null,null,null,null,null,null,null,null,null,null,"E.  PROGRAMS AND SERVICES FOR ELs AND THEIR FAMILIES (CONTINUED)",null,null,null,null,null,null,null,null,null,null,null,null,null,null,null,"E.  PROGRAMS AND SERVICES FOR ELs AND THEIR FAMILIES (CONTINUED)",null,null,null,null,null,null,null,null,null,null,null,null,null,null,null,"E.  PROGRAMS AND SERVICES FOR ELs AND THEIR FAMILIES (CONTINUED)",null,null,null,null,null,null,null,null,null,null,null,null,null,null,null,"E.  PROGRAMS AND SERVICES FOR ELs AND THEIR FAMILIES (CONTINUED)",null,null,null,null,null,null,null,null,null,null,null,null,null,null,null,"E.  PROGRAMS AND SERVICES FOR ELs AND THEIR FAMILIES (CONTINUED)",null,null,null,null,null,null,null,null,null,null,null,null,null,null,null,"E.  PROGRAMS AND SERVICES FOR ELs AND THEIR FAMILIES (CONTINUED)",null,null,null,null,null,null,null,null,null,null,null,null,null,null,null,"E.  PROGRAMS AND SERVICES FOR ELs AND THEIR FAMILIES (CONTINUED)",null,null,null,null,null,null,null,null,null,null,null,null,null,null,null,"E.  PROGRAMS AND SERVICES FOR ELs AND THEIR FAMILIES (CONTINUED)",null,null,null,null,null,null,null,null,null,null,null,null,null,null,null,"E.  PROGRAMS AND SERVICES FOR ELs AND THEIR FAMILIES (CONTINUED)",null,null,null,null,null,null,null,null,null,null,null,null,null,null,null,"E.  PROGRAMS AND SERVICES FOR ELs AND THEIR FAMILIES (CONTINUED)",null,null,null,null,null,null,null,null,null,null,null,null,null,null,null,"E.  PROGRAMS AND SERVICES FOR ELs AND THEIR FAMILIES (CONTINUED)",null,null,null,null,null,null,null,null,null,null,null,null,null,null,null,"E.  PROGRAMS AND SERVICES FOR ELs AND THEIR FAMILIES (CONTINUED)",null,null,null,null,null,null,null,null,null,null,null,null,null,null,null,"E.  PROGRAMS AND SERVICES FOR ELs AND THEIR FAMILIES (CONTINUED)",null,null,null,null,null,null,null,null,null,null,null,null,null,null,null,"E.  PROGRAMS AND SERVICES FOR ELs AND THEIR FAMILIES (CONTINUED)",null,null,null,null,null,null,null,null,null,null,null,null,null,null,null,"E.  PROGRAMS AND SERVICES FOR ELs AND THEIR FAMILIES (CONTINUED)",null,null,null,null,null,null,null,null,null,null,null,null,null,null,null,"E.  PROGRAMS AND SERVICES FOR ELs AND THEIR FAMILIES (CONTINUED)",null,null,null,null,null,null,null,null,null,null,null,null,null,null,null,"E.  PROGRAMS AND SERVICES FOR ELs AND THEIR FAMILIES (CONTINUED)",null,null,null,null,null,null,null,null,null,null,null,null,null,null,null,"E.  PROGRAMS AND SERVICES FOR ELs AND THEIR FAMILIES (CONTINUED)",null,null,null,null,null,null,null,null,null,null,null,null,null,null,null,"E.  PROGRAMS AND SERVICES FOR ELs AND THEIR FAMILIES (CONTINUED)",null,null,null,null,null,null,null,null,null,null,null,null,null,null,null,"E.  PROGRAMS AND SERVICES FOR ELs AND THEIR FAMILIES (CONTINUED)",null,null,null,null,null,null,null,null,null,null,null,null,null,null,null,"E.  PROGRAMS AND SERVICES FOR ELs AND THEIR FAMILIES (CONTINUED)",null,null,null,null,null,null,null,null,null,null,null,null,null,null,null,"E.  PROGRAMS AND SERVICES FOR ELs AND THEIR FAMILIES (CONTINUED)",null,null,null,null,null,null,null,null,null,null,null,null,null,null,null,"E.  PROGRAMS AND SERVICES FOR ELs AND THEIR FAMILIES (CONTINUED)",null,null,null,null,null,null,null,null,null,null,null,null,null,null,null,"E.  PROGRAMS AND SERVICES FOR ELs AND THEIR FAMILIES (CONTINUED)",null,null,null,null,null,null,null,null,null,null,null,null,null,null,null,"E.  PROGRAMS AND SERVICES FOR ELs AND THEIR FAMILIES (CONTINUED)",null,null,null,null,null,null,null,null,null,null,null,null,null,null,null,"E.  PROGRAMS AND SERVICES FOR ELs AND THEIR FAMILIES (CONTINUED)",null,null,null,null,null,null,null,null,null,null,null,null,null,null,null,"E.  PROGRAMS AND SERVICES FOR ELs AND THEIR FAMILIES (CONTINUED)",null,null,null,null,null,null,null,null,null,null,null,null,null,null,null,"E.  PROGRAMS AND SERVICES FOR ELs AND THEIR FAMILIES (CONTINUED)",null,null,null,null,null,null,null,null,null,null,null,null,null,null,null,"E.  PROGRAMS AND SERVICES FOR ELs AND THEIR FAMILIES (CONTINUED)",null,null,null,null,null,null,null,null,null,null,null,null,null,null,null,"E.  PROGRAMS AND SERVICES FOR ELs AND THEIR FAMILIES (CONTINUED)",null,null,null,null,null,null,null,null,null,null,null,null,null,null,null,"E.  PROGRAMS AND SERVICES FOR ELs AND THEIR FAMILIES (CONTINUED)",null,null,null,null,null,null,null,null,null,null,null,null,null,null,null,"E.  PROGRAMS AND SERVICES FOR ELs AND THEIR FAMILIES (CONTINUED)",null,null,null,null,null,null,null,null,null,null,null,null,null,null,null,"E.  PROGRAMS AND SERVICES FOR ELs AND THEIR FAMILIES (CONTINUED)",null,null,null,null,null,null,null,null,null,null,null,null,null,null,null,"E.  PROGRAMS AND SERVICES FOR ELs AND THEIR FAMILIES (CONTINUED)",null,null,null,null,null,null,null,null,null,null,null,null,null,null,null,"E.  PROGRAMS AND SERVICES FOR ELs AND THEIR FAMILIES (CONTINUED)",null,null,null,null,null,null,null,null,null,null,null,null,null,null,null,"E.  PROGRAMS AND SERVICES FOR ELs AND THEIR FAMILIES (CONTINUED)",null,null,null,null,null,null,null,null,null,null,null,null,null,null,null,"E.  PROGRAMS AND SERVICES FOR ELs AND THEIR FAMILIES (CONTINUED)",null,null,null,null,null,null,null,null,null,null,null,null,null,null,null,"E.  PROGRAMS AND SERVICES FOR ELs AND THEIR FAMILIES (CONTINUED)",null,null,null,null,null,null,null,null,null,null,null,null,null,null,null,"E.  PROGRAMS AND SERVICES FOR ELs AND THEIR FAMILIES (CONTINUED)",null,null,null,null,null,null,null,null,null,null,null,null,null,null,null,"E.  PROGRAMS AND SERVICES FOR ELs AND THEIR FAMILIES (CONTINUED)",null,null,null,null,null,null,null,null,null,null,null,null,null,null,null,"E.  PROGRAMS AND SERVICES FOR ELs AND THEIR FAMILIES (CONTINUED)",null,null,null,null,null,null,null,null,null,null,null,null,null,null,null,"E.  PROGRAMS AND SERVICES FOR ELs AND THEIR FAMILIES (CONTINUED)",null,null,null,null,null,null,null,null,null,null,null,null,null,null,null,"E.  PROGRAMS AND SERVICES FOR ELs AND THEIR FAMILIES (CONTINUED)",null,null,null,null,null,null,null,null,null,null,null,null,null,null,null,"E.  PROGRAMS AND SERVICES FOR ELs AND THEIR FAMILIES (CONTINUED)",null,null,null,null,null,null,null,null,null,null,null,null,null,null,null,"E.  PROGRAMS AND SERVICES FOR ELs AND THEIR FAMILIES (CONTINUED)",null,null,null,null,null,null,null,null,null,null,null,null,null,null,null,"E.  PROGRAMS AND SERVICES FOR ELs AND THEIR FAMILIES (CONTINUED)",null,null,null,null,null,null,null,null,null,null,null,null,null,null,null,"E.  PROGRAMS AND SERVICES FOR ELs AND THEIR FAMILIES (CONTINUED)",null,null,null,null,null,null,null,null,null,null,null,null,null,null,null,"E.  PROGRAMS AND SERVICES FOR ELs AND THEIR FAMILIES (CONTINUED)",null,null,null,null,null,null,null,null,null,null,null,null,null,null,null,"E.  PROGRAMS AND SERVICES FOR ELs AND THEIR FAMILIES (CONTINUED)",null,null,null,null,null,null,null,null,null,null,null,null,null,null,null,"E.  PROGRAMS AND SERVICES FOR ELs AND THEIR FAMILIES (CONTINUED)",null,null,null,null,null,null,null,null,null,null,null,null,null,null,null,"E.  PROGRAMS AND SERVICES FOR ELs AND THEIR FAMILIES (CONTINUED)",null,null,null,null,null,null,null,null,null,null,null,null,null,null,null,"E.  PROGRAMS AND SERVICES FOR ELs AND THEIR FAMILIES (CONTINUED)",null,null,null,null,null,null,null,null,null,null,null,null,null,null,null,"E.  PROGRAMS AND SERVICES FOR ELs AND THEIR FAMILIES (CONTINUED)",null,null,null,null,null,null,null,null,null,null,null,null,null,null,null,"E.  PROGRAMS AND SERVICES FOR ELs AND THEIR FAMILIES (CONTINUED)",null,null,null,null,null,null,null,null,null,null,null,null,null,null,null,"E.  PROGRAMS AND SERVICES FOR ELs AND THEIR FAMILIES (CONTINUED)",null,null,null,null,null,null,null,null,null,null,null,null,null,null,null,"E.  PROGRAMS AND SERVICES FOR ELs AND THEIR FAMILIES (CONTINUED)",null,null,null,null,null,null,null,null,null,null,null,null,null,null,null,"E.  PROGRAMS AND SERVICES FOR ELs AND THEIR FAMILIES (CONTINUED)",null,null,null,null,null,null,null,null,null,null,null,null,null,null,null,"E.  PROGRAMS AND SERVICES FOR ELs AND THEIR FAMILIES (CONTINUED)",null,null,null,null,null,null,null,null,null,null,null,null,null,null,null,"E.  PROGRAMS AND SERVICES FOR ELs AND THEIR FAMILIES (CONTINUED)",null,null,null,null,null,null,null,null,null,null,null,null,null,null,null,"E.  PROGRAMS AND SERVICES FOR ELs AND THEIR FAMILIES (CONTINUED)",null,null,null,null,null,null,null,null,null,null,null,null,null,null,null,"E.  PROGRAMS AND SERVICES FOR ELs AND THEIR FAMILIES (CONTINUED)",null,null,null,null,null,null,null,null,null,null,null,null,null,null,null,"E.  PROGRAMS AND SERVICES FOR ELs AND THEIR FAMILIES (CONTINUED)",null,null,null,null,null,null,null,null,null,null,null,null,null,null,null,"E.  PROGRAMS AND SERVICES FOR ELs AND THEIR FAMILIES (CONTINUED)",null,null,null,null,null,null,null,null,null,null,null,null,null,null,null,"E.  PROGRAMS AND SERVICES FOR ELs AND THEIR FAMILIES (CONTINUED)",null,null,null,null,null,null,null,null,null,null,null,null,null,null,null,"E.  PROGRAMS AND SERVICES FOR ELs AND THEIR FAMILIES (CONTINUED)",null,null,null,null,null,null,null,null,null,null,null,null,null,null,null,"E.  PROGRAMS AND SERVICES FOR ELs AND THEIR FAMILIES (CONTINUED)",null,null,null,null,null,null,null,null,null,null,null,null,null,null,null,"E.  PROGRAMS AND SERVICES FOR ELs AND THEIR FAMILIES (CONTINUED)",null,null,null,null,null,null,null,null,null,null,null,null,null,null,null,"E.  PROGRAMS AND SERVICES FOR ELs AND THEIR FAMILIES (CONTINUED)",null,null,null,null,null,null,null,null,null,null,null,null,null,null,null,"E.  PROGRAMS AND SERVICES FOR ELs AND THEIR FAMILIES (CONTINUED)",null,null,null,null,null,null,null,null,null,null,null,null,null,null,null,"E.  PROGRAMS AND SERVICES FOR ELs AND THEIR FAMILIES (CONTINUED)",null,null,null,null,null,null,null,null,null,null,null,null,null,null,null,"E.  PROGRAMS AND SERVICES FOR ELs AND THEIR FAMILIES (CONTINUED)",null,null,null,null,null,null,null,null,null,null,null,null,null,null,null,"E.  PROGRAMS AND SERVICES FOR ELs AND THEIR FAMILIES (CONTINUED)",null,null,null,null,null,null,null,null,null,null,null,null,null,null,null,"E.  PROGRAMS AND SERVICES FOR ELs AND THEIR FAMILIES (CONTINUED)",null,null,null,null,null,null,null,null,null,null,null,null,null,null,null,"E.  PROGRAMS AND SERVICES FOR ELs AND THEIR FAMILIES (CONTINUED)",null,null,null,null,null,null,null,null,null,null,null,null,null,null,null,"E.  PROGRAMS AND SERVICES FOR ELs AND THEIR FAMILIES (CONTINUED)",null,null,null,null,null,null,null,null,null,null,null,null,null,null,null,"E.  PROGRAMS AND SERVICES FOR ELs AND THEIR FAMILIES (CONTINUED)",null,null,null,null,null,null,null,null,null,null,null,null,null,null,null,"E.  PROGRAMS AND SERVICES FOR ELs AND THEIR FAMILIES (CONTINUED)",null,null,null,null,null,null,null,null,null,null,null,null,null,null,null,"E.  PROGRAMS AND SERVICES FOR ELs AND THEIR FAMILIES (CONTINUED)",null,null,null,null,null,null,null,null,null,null,null,null,null,null,null,"E.  PROGRAMS AND SERVICES FOR ELs AND THEIR FAMILIES (CONTINUED)",null,null,null,null,null,null,null,null,null,null,null,null,null,null,null,"E.  PROGRAMS AND SERVICES FOR ELs AND THEIR FAMILIES (CONTINUED)",null,null,null,null,null,null,null,null,null,null,null,null,null,null,null,"E.  PROGRAMS AND SERVICES FOR ELs AND THEIR FAMILIES (CONTINUED)",null,null,null,null,null,null,null,null,null,null,null,null,null,null,null,"E.  PROGRAMS AND SERVICES FOR ELs AND THEIR FAMILIES (CONTINUED)",null,null,null,null,null,null,null,null,null,null,null,null,null,null,null,"E.  PROGRAMS AND SERVICES FOR ELs AND THEIR FAMILIES (CONTINUED)",null,null,null,null,null,null,null,null,null,null,null,null,null,null,null,"E.  PROGRAMS AND SERVICES FOR ELs AND THEIR FAMILIES (CONTINUED)",null,null,null,null,null,null,null,null,null,null,null,null,null,null,null,"E.  PROGRAMS AND SERVICES FOR ELs AND THEIR FAMILIES (CONTINUED)",null,null,null,null,null,null,null,null,null,null,null,null,null,null,null,"E.  PROGRAMS AND SERVICES FOR ELs AND THEIR FAMILIES (CONTINUED)",null,null,null,null,null,null,null,null,null,null,null,null,null,null,null,"E.  PROGRAMS AND SERVICES FOR ELs AND THEIR FAMILIES (CONTINUED)",null,null,null,null,null,null,null,null,null,null,null,null,null,null,null,"E.  PROGRAMS AND SERVICES FOR ELs AND THEIR FAMILIES (CONTINUED)",null,null,null,null,null,null,null,null,null,null,null,null,null,null,null,"E.  PROGRAMS AND SERVICES FOR ELs AND THEIR FAMILIES (CONTINUED)",null,null,null,null,null,null,null,null,null,null,null,null,null,null,null,"E.  PROGRAMS AND SERVICES FOR ELs AND THEIR FAMILIES (CONTINUED)",null,null,null,null,null,null,null,null,null,null,null,null,null,null,null,"E.  PROGRAMS AND SERVICES FOR ELs AND THEIR FAMILIES (CONTINUED)",null,null,null,null,null,null,null,null,null,null,null,null,null,null,null,"E.  PROGRAMS AND SERVICES FOR ELs AND THEIR FAMILIES (CONTINUED)",null,null,null,null,null,null,null,null,null,null,null,null,null,null,null,"E.  PROGRAMS AND SERVICES FOR ELs AND THEIR FAMILIES (CONTINUED)",null,null,null,null,null,null,null,null,null,null,null,null,null,null,null,"E.  PROGRAMS AND SERVICES FOR ELs AND THEIR FAMILIES (CONTINUED)",null,null,null,null,null,null,null,null,null,null,null,null,null,null,null,"E.  PROGRAMS AND SERVICES FOR ELs AND THEIR FAMILIES (CONTINUED)",null,null,null,null,null,null,null,null,null,null,null,null,null,null,null,"E.  PROGRAMS AND SERVICES FOR ELs AND THEIR FAMILIES (CONTINUED)",null,null,null,null,null,null,null,null,null,null,null,null,null,null,null,"E.  PROGRAMS AND SERVICES FOR ELs AND THEIR FAMILIES (CONTINUED)",null,null,null,null,null,null,null,null,null,null,null,null,null,null,null,"E.  PROGRAMS AND SERVICES FOR ELs AND THEIR FAMILIES (CONTINUED)",null,null,null,null,null,null,null,null,null,null,null,null,null,null,null,"E.  PROGRAMS AND SERVICES FOR ELs AND THEIR FAMILIES (CONTINUED)",null,null,null,null,null,null,null,null,null,null,null,null,null,null,null,"E.  PROGRAMS AND SERVICES FOR ELs AND THEIR FAMILIES (CONTINUED)",null,null,null,null,null,null,null,null,null,null,null,null,null,null,null,"E.  PROGRAMS AND SERVICES FOR ELs AND THEIR FAMILIES (CONTINUED)",null,null,null,null,null,null,null,null,null,null,null,null,null,null,null,"E.  PROGRAMS AND SERVICES FOR ELs AND THEIR FAMILIES (CONTINUED)",null,null,null,null,null,null,null,null,null,null,null,null,null,null,null,"E.  PROGRAMS AND SERVICES FOR ELs AND THEIR FAMILIES (CONTINUED)",null,null,null,null,null,null,null,null,null,null,null,null,null,null,null,"E.  PROGRAMS AND SERVICES FOR ELs AND THEIR FAMILIES (CONTINUED)",null,null,null,null,null,null,null,null,null,null,null,null,null,null,null,"E.  PROGRAMS AND SERVICES FOR ELs AND THEIR FAMILIES (CONTINUED)",null,null,null,null,null,null,null,null,null,null,null,null,null,null,null,"E.  PROGRAMS AND SERVICES FOR ELs AND THEIR FAMILIES (CONTINUED)",null,null,null,null,null,null,null,null,null,null,null,null,null,null,null,"E.  PROGRAMS AND SERVICES FOR ELs AND THEIR FAMILIES (CONTINUED)",null,null,null,null,null,null,null,null,null,null,null,null,null,null,null,"E.  PROGRAMS AND SERVICES FOR ELs AND THEIR FAMILIES (CONTINUED)",null,null,null,null,null,null,null,null,null,null,null,null,null,null,null,"E.  PROGRAMS AND SERVICES FOR ELs AND THEIR FAMILIES (CONTINUED)",null,null,null,null,null,null,null,null,null,null,null,null,null,null,null,"E.  PROGRAMS AND SERVICES FOR ELs AND THEIR FAMILIES (CONTINUED)",null,null,null,null,null,null,null,null,null,null,null,null,null,null,null,"E.  PROGRAMS AND SERVICES FOR ELs AND THEIR FAMILIES (CONTINUED)",null,null,null,null,null,null,null,null,null,null,null,null,null,null,null,"E.  PROGRAMS AND SERVICES FOR ELs AND THEIR FAMILIES (CONTINUED)",null,null,null,null,null,null,null,null,null,null,null,null,null,null,null,"E.  PROGRAMS AND SERVICES FOR ELs AND THEIR FAMILIES (CONTINUED)",null,null,null,null,null,null,null,null,null,null,null,null,null,null,null,"E.  PROGRAMS AND SERVICES FOR ELs AND THEIR FAMILIES (CONTINUED)",null,null,null,null,null,null,null,null,null,null,null,null,null,null,null,"E.  PROGRAMS AND SERVICES FOR ELs AND THEIR FAMILIES (CONTINUED)",null,null,null,null,null,null,null,null,null,null,null,null,null,null,null,"E.  PROGRAMS AND SERVICES FOR ELs AND THEIR FAMILIES (CONTINUED)",null,null,null,null,null,null,null,null,null,null,null,null,null,null,null,"E.  PROGRAMS AND SERVICES FOR ELs AND THEIR FAMILIES (CONTINUED)",null,null,null,null,null,null,null,null,null,null,null,null,null,null,null,"E.  PROGRAMS AND SERVICES FOR ELs AND THEIR FAMILIES (CONTINUED)",null,null,null,null,null,null,null,null,null,null,null,null,null,null,null,"E.  PROGRAMS AND SERVICES FOR ELs AND THEIR FAMILIES (CONTINUED)",null,null,null,null,null,null,null,null,null,null,null,null,null,null,null,"E.  PROGRAMS AND SERVICES FOR ELs AND THEIR FAMILIES (CONTINUED)",null,null,null,null,null,null,null,null,null,null,null,null,null,null,null,"E.  PROGRAMS AND SERVICES FOR ELs AND THEIR FAMILIES (CONTINUED)",null,null,null,null,null,null,null,null,null,null,null,null,null,null,null,"E.  PROGRAMS AND SERVICES FOR ELs AND THEIR FAMILIES (CONTINUED)",null,null,null,null,null,null,null,null,null,null,null,null,null,null,null,"E.  PROGRAMS AND SERVICES FOR ELs AND THEIR FAMILIES (CONTINUED)",null,null,null,null,null,null,null,null,null,null,null,null,null,null,null,"E.  PROGRAMS AND SERVICES FOR ELs AND THEIR FAMILIES (CONTINUED)",null,null,null,null,null,null,null,null,null,null,null,null,null,null,null,"E.  PROGRAMS AND SERVICES FOR ELs AND THEIR FAMILIES (CONTINUED)",null,null,null,null,null,null,null,null,null,null,null,null,null,null,null,"E.  PROGRAMS AND SERVICES FOR ELs AND THEIR FAMILIES (CONTINUED)",null,null,null,null,null,null,null,null,null,null,null,null,null,null,null,"E.  PROGRAMS AND SERVICES FOR ELs AND THEIR FAMILIES (CONTINUED)",null,null,null,null,null,null,null,null,null,null,null,null,null,null,null,"E.  PROGRAMS AND SERVICES FOR ELs AND THEIR FAMILIES (CONTINUED)",null,null,null,null,null,null,null,null,null,null,null,null,null,null,null,"E.  PROGRAMS AND SERVICES FOR ELs AND THEIR FAMILIES (CONTINUED)",null,null,null,null,null,null,null,null,null,null,null,null,null,null,null,"E.  PROGRAMS AND SERVICES FOR ELs AND THEIR FAMILIES (CONTINUED)",null,null,null,null,null,null,null,null,null,null,null,null,null,null,null,"E.  PROGRAMS AND SERVICES FOR ELs AND THEIR FAMILIES (CONTINUED)",null,null,null,null,null,null,null,null,null,null,null,null,null,null,null,"E.  PROGRAMS AND SERVICES FOR ELs AND THEIR FAMILIES (CONTINUED)",null,null,null,null,null,null,null,null,null,null,null,null,null,null,null,"E.  PROGRAMS AND SERVICES FOR ELs AND THEIR FAMILIES (CONTINUED)",null,null,null,null,null,null,null,null,null,null,null,null,null,null,null,"E.  PROGRAMS AND SERVICES FOR ELs AND THEIR FAMILIES (CONTINUED)",null,null,null,null,null,null,null,null,null,null,null,null,null,null,null,"E.  PROGRAMS AND SERVICES FOR ELs AND THEIR FAMILIES (CONTINUED)",null,null,null,null,null,null,null,null,null,null,null,null,null,null,null,"E.  PROGRAMS AND SERVICES FOR ELs AND THEIR FAMILIES (CONTINUED)",null,null,null,null,null,null,null,null,null,null,null,null,null,null,null,"E.  PROGRAMS AND SERVICES FOR ELs AND THEIR FAMILIES (CONTINUED)",null,null,null,null,null,null,null,null,null,null,null,null,null,null,null,"E.  PROGRAMS AND SERVICES FOR ELs AND THEIR FAMILIES (CONTINUED)",null,null,null,null,null,null,null,null,null,null,null,null,null,null,null,"E.  PROGRAMS AND SERVICES FOR ELs AND THEIR FAMILIES (CONTINUED)",null,null,null,null,null,null,null,null,null,null,null,null,null,null,null,"E.  PROGRAMS AND SERVICES FOR ELs AND THEIR FAMILIES (CONTINUED)",null,null,null,null,null,null,null,null,null,null,null,null,null,null,null,"E.  PROGRAMS AND SERVICES FOR ELs AND THEIR FAMILIES (CONTINUED)",null,null,null,null,null,null,null,null,null,null,null,null,null,null,null,"E.  PROGRAMS AND SERVICES FOR ELs AND THEIR FAMILIES (CONTINUED)",null,null,null,null,null,null,null,null,null,null,null,null,null,null,null,"E.  PROGRAMS AND SERVICES FOR ELs AND THEIR FAMILIES (CONTINUED)",null,null,null,null,null,null,null,null,null,null,null,null,null,null,null,"E.  PROGRAMS AND SERVICES FOR ELs AND THEIR FAMILIES (CONTINUED)",null,null,null,null,null,null,null,null,null,null,null,null,null,null,null,"E.  PROGRAMS AND SERVICES FOR ELs AND THEIR FAMILIES (CONTINUED)",null,null,null,null,null,null,null,null,null,null,null,null,null,null,null,"E.  PROGRAMS AND SERVICES FOR ELs AND THEIR FAMILIES (CONTINUED)",null,null,null,null,null,null,null,null,null,null,null,null,null,null,null,"E.  PROGRAMS AND SERVICES FOR ELs AND THEIR FAMILIES (CONTINUED)",null,null,null,null,null,null,null,null,null,null,null,null,null,null,null,"E.  PROGRAMS AND SERVICES FOR ELs AND THEIR FAMILIES (CONTINUED)",null,null,null,null,null,null,null,null,null,null,null,null,null,null,null,"E.  PROGRAMS AND SERVICES FOR ELs AND THEIR FAMILIES (CONTINUED)",null,null,null,null,null,null,null,null,null,null,null,null,null,null,null,"E.  PROGRAMS AND SERVICES FOR ELs AND THEIR FAMILIES (CONTINUED)",null,null,null,null,null,null,null,null,null,null,null,null,null,null,null,"E.  PROGRAMS AND SERVICES FOR ELs AND THEIR FAMILIES (CONTINUED)",null,null,null,null,null,null,null,null,null,null,null,null,null,null,null,"E.  PROGRAMS AND SERVICES FOR ELs AND THEIR FAMILIES (CONTINUED)",null,null,null,null,null,null,null,null,null,null,null,null,null,null,null,"E.  PROGRAMS AND SERVICES FOR ELs AND THEIR FAMILIES (CONTINUED)",null,null,null,null,null,null,null,null,null,null,null,null,null,null,null,"E.  PROGRAMS AND SERVICES FOR ELs AND THEIR FAMILIES (CONTINUED)",null,null,null,null,null,null,null,null,null,null,null,null,null,null,null,"E.  PROGRAMS AND SERVICES FOR ELs AND THEIR FAMILIES (CONTINUED)",null,null,null,null,null,null,null,null,null,null,null,null,null,null,null,"E.  PROGRAMS AND SERVICES FOR ELs AND THEIR FAMILIES (CONTINUED)",null,null,null,null,null,null,null,null,null,null,null,null,null,null,null,"E.  PROGRAMS AND SERVICES FOR ELs AND THEIR FAMILIES (CONTINUED)",null,null,null,null,null,null,null,null,null,null,null,null,null,null,null,"E.  PROGRAMS AND SERVICES FOR ELs AND THEIR FAMILIES (CONTINUED)",null,null,null,null,null,null,null,null,null,null,null,null,null,null,null,"E.  PROGRAMS AND SERVICES FOR ELs AND THEIR FAMILIES (CONTINUED)",null,null,null,null,null,null,null,null,null,null,null,null,null,null,null,"E.  PROGRAMS AND SERVICES FOR ELs AND THEIR FAMILIES (CONTINUED)",null,null,null,null,null,null,null,null,null,null,null,null,null,null,null,"E.  PROGRAMS AND SERVICES FOR ELs AND THEIR FAMILIES (CONTINUED)",null,null,null,null,null,null,null,null,null,null,null,null,null,null,null,"E.  PROGRAMS AND SERVICES FOR ELs AND THEIR FAMILIES (CONTINUED)",null,null,null,null,null,null,null,null,null,null,null,null,null,null,null,"E.  PROGRAMS AND SERVICES FOR ELs AND THEIR FAMILIES (CONTINUED)",null,null,null,null,null,null,null,null,null,null,null,null,null,null,null,"E.  PROGRAMS AND SERVICES FOR ELs AND THEIR FAMILIES (CONTINUED)",null,null,null,null,null,null,null,null,null,null,null,null,null,null,null,"E.  PROGRAMS AND SERVICES FOR ELs AND THEIR FAMILIES (CONTINUED)",null,null,null,null,null,null,null,null,null,null,null,null,null,null,null,"E.  PROGRAMS AND SERVICES FOR ELs AND THEIR FAMILIES (CONTINUED)",null,null,null,null,null,null,null,null,null,null,null,null,null,null,null,"E.  PROGRAMS AND SERVICES FOR ELs AND THEIR FAMILIES (CONTINUED)",null,null,null,null,null,null,null,null,null,null,null,null,null,null,null,"E.  PROGRAMS AND SERVICES FOR ELs AND THEIR FAMILIES (CONTINUED)",null,null,null,null,null,null,null,null,null,null,null,null,null,null,null,"E.  PROGRAMS AND SERVICES FOR ELs AND THEIR FAMILIES (CONTINUED)",null,null,null,null,null,null,null,null,null,null,null,null,null,null,null,"E.  PROGRAMS AND SERVICES FOR ELs AND THEIR FAMILIES (CONTINUED)",null,null,null,null,null,null,null,null,null,null,null,null,null,null,null,"E.  PROGRAMS AND SERVICES FOR ELs AND THEIR FAMILIES (CONTINUED)",null,null,null,null,null,null,null,null,null,null,null,null,null,null,null,"E.  PROGRAMS AND SERVICES FOR ELs AND THEIR FAMILIES (CONTINUED)",null,null,null,null,null,null,null,null,null,null,null,null,null,null,null,"E.  PROGRAMS AND SERVICES FOR ELs AND THEIR FAMILIES (CONTINUED)",null,null,null,null,null,null,null,null,null,null,null,null,null,null,null,"E.  PROGRAMS AND SERVICES FOR ELs AND THEIR FAMILIES (CONTINUED)",null,null,null,null,null,null,null,null,null,null,null,null,null,null,null,"E.  PROGRAMS AND SERVICES FOR ELs AND THEIR FAMILIES (CONTINUED)",null,null,null,null,null,null,null,null,null,null,null,null,null,null,null,"E.  PROGRAMS AND SERVICES FOR ELs AND THEIR FAMILIES (CONTINUED)",null,null,null,null,null,null,null,null,null,null,null,null,null,null,null,"E.  PROGRAMS AND SERVICES FOR ELs AND THEIR FAMILIES (CONTINUED)",null,null,null,null,null,null,null,null,null,null,null,null,null,null,null,"E.  PROGRAMS AND SERVICES FOR ELs AND THEIR FAMILIES (CONTINUED)",null,null,null,null,null,null,null,null,null,null,null,null,null,null,null,"E.  PROGRAMS AND SERVICES FOR ELs AND THEIR FAMILIES (CONTINUED)",null,null,null,null,null,null,null,null,null,null,null,null,null,null,null,"E.  PROGRAMS AND SERVICES FOR ELs AND THEIR FAMILIES (CONTINUED)",null,null,null,null,null,null,null,null,null,null,null,null,null,null,null,"E.  PROGRAMS AND SERVICES FOR ELs AND THEIR FAMILIES (CONTINUED)",null,null,null,null,null,null,null,null,null,null,null,null,null,null,null,"E.  PROGRAMS AND SERVICES FOR ELs AND THEIR FAMILIES (CONTINUED)",null,null,null,null,null,null,null,null,null,null,null,null,null,null,null,"E.  PROGRAMS AND SERVICES FOR ELs AND THEIR FAMILIES (CONTINUED)",null,null,null,null,null,null,null,null,null,null,null,null,null,null,null,"E.  PROGRAMS AND SERVICES FOR ELs AND THEIR FAMILIES (CONTINUED)",null,null,null,null,null,null,null,null,null,null,null,null,null,null,null,"E.  PROGRAMS AND SERVICES FOR ELs AND THEIR FAMILIES (CONTINUED)",null,null,null,null,null,null,null,null,null,null,null,null,null,null,null,"E.  PROGRAMS AND SERVICES FOR ELs AND THEIR FAMILIES (CONTINUED)",null,null,null,null,null,null,null,null,null,null,null,null,null,null,null,"E.  PROGRAMS AND SERVICES FOR ELs AND THEIR FAMILIES (CONTINUED)",null,null,null,null,null,null,null,null,null,null,null,null,null,null,null,"E.  PROGRAMS AND SERVICES FOR ELs AND THEIR FAMILIES (CONTINUED)",null,null,null,null,null,null,null,null,null,null,null,null,null,null,null,"E.  PROGRAMS AND SERVICES FOR ELs AND THEIR FAMILIES (CONTINUED)",null,null,null,null,null,null,null,null,null,null,null,null,null,null,null,"E.  PROGRAMS AND SERVICES FOR ELs AND THEIR FAMILIES (CONTINUED)",null,null,null,null,null,null,null,null,null,null,null,null,null,null,null,"E.  PROGRAMS AND SERVICES FOR ELs AND THEIR FAMILIES (CONTINUED)",null,null,null,null,null,null,null,null,null,null,null,null,null,null,null,"E.  PROGRAMS AND SERVICES FOR ELs AND THEIR FAMILIES (CONTINUED)",null,null,null,null,null,null,null,null,null,null,null,null,null,null,null,"E.  PROGRAMS AND SERVICES FOR ELs AND THEIR FAMILIES (CONTINUED)",null,null,null,null,null,null,null,null,null,null,null,null,null,null,null,"E.  PROGRAMS AND SERVICES FOR ELs AND THEIR FAMILIES (CONTINUED)",null,null,null,null,null,null,null,null,null,null,null,null,null,null,null,"E.  PROGRAMS AND SERVICES FOR ELs AND THEIR FAMILIES (CONTINUED)",null,null,null,null,null,null,null,null,null,null,null,null,null,null,null,"E.  PROGRAMS AND SERVICES FOR ELs AND THEIR FAMILIES (CONTINUED)",null,null,null,null,null,null,null,null,null,null,null,null,null,null,null,"E.  PROGRAMS AND SERVICES FOR ELs AND THEIR FAMILIES (CONTINUED)",null,null,null,null,null,null,null,null,null,null,null,null,null,null,null,"E.  PROGRAMS AND SERVICES FOR ELs AND THEIR FAMILIES (CONTINUED)",null,null,null,null,null,null,null,null,null,null,null,null,null,null,null,"E.  PROGRAMS AND SERVICES FOR ELs AND THEIR FAMILIES (CONTINUED)",null,null,null,null,null,null,null,null,null,null,null,null,null,null,null,"E.  PROGRAMS AND SERVICES FOR ELs AND THEIR FAMILIES (CONTINUED)",null,null,null,null,null,null,null,null,null,null,null,null,null,null,null,"E.  PROGRAMS AND SERVICES FOR ELs AND THEIR FAMILIES (CONTINUED)",null,null,null,null,null,null,null,null,null,null,null,null,null,null,null,"E.  PROGRAMS AND SERVICES FOR ELs AND THEIR FAMILIES (CONTINUED)",null,null,null,null,null,null,null,null,null,null,null,null,null,null,null,"E.  PROGRAMS AND SERVICES FOR ELs AND THEIR FAMILIES (CONTINUED)",null,null,null,null,null,null,null,null,null,null,null,null,null,null,null,"E.  PROGRAMS AND SERVICES FOR ELs AND THEIR FAMILIES (CONTINUED)",null,null,null,null,null,null,null,null,null,null,null,null,null,null,null,"E.  PROGRAMS AND SERVICES FOR ELs AND THEIR FAMILIES (CONTINUED)",null,null,null,null,null,null,null,null,null,null,null,null,null,null,null,"E.  PROGRAMS AND SERVICES FOR ELs AND THEIR FAMILIES (CONTINUED)",null,null,null,null,null,null,null,null,null,null,null,null,null,null,null,"E.  PROGRAMS AND SERVICES FOR ELs AND THEIR FAMILIES (CONTINUED)",null,null,null,null,null,null,null,null,null,null,null,null,null,null,null,"E.  PROGRAMS AND SERVICES FOR ELs AND THEIR FAMILIES (CONTINUED)",null,null,null,null,null,null,null,null,null,null,null,null,null,null,null,"E.  PROGRAMS AND SERVICES FOR ELs AND THEIR FAMILIES (CONTINUED)",null,null,null,null,null,null,null,null,null,null,null,null,null,null,null,"E.  PROGRAMS AND SERVICES FOR ELs AND THEIR FAMILIES (CONTINUED)",null,null,null,null,null,null,null,null,null,null,null,null,null,null,null,"E.  PROGRAMS AND SERVICES FOR ELs AND THEIR FAMILIES (CONTINUED)",null,null,null,null,null,null,null,null,null,null,null,null,null,null,null,"E.  PROGRAMS AND SERVICES FOR ELs AND THEIR FAMILIES (CONTINUED)",null,null,null,null,null,null,null,null,null,null,null,null,null,null,null,"E.  PROGRAMS AND SERVICES FOR ELs AND THEIR FAMILIES (CONTINUED)",null,null,null,null,null,null,null,null,null,null,null,null,null,null,null,"E.  PROGRAMS AND SERVICES FOR ELs AND THEIR FAMILIES (CONTINUED)",null,null,null,null,null,null,null,null,null,null,null,null,null,null,null,"E.  PROGRAMS AND SERVICES FOR ELs AND THEIR FAMILIES (CONTINUED)",null,null,null,null,null,null,null,null,null,null,null,null,null,null,null,"E.  PROGRAMS AND SERVICES FOR ELs AND THEIR FAMILIES (CONTINUED)",null,null,null,null,null,null,null,null,null,null,null,null,null,null,null,"E.  PROGRAMS AND SERVICES FOR ELs AND THEIR FAMILIES (CONTINUED)",null,null,null,null,null,null,null,null,null,null,null,null,null,null,null,"E.  PROGRAMS AND SERVICES FOR ELs AND THEIR FAMILIES (CONTINUED)",null,null,null,null,null,null,null,null,null,null,null,null,null,null,null,"E.  PROGRAMS AND SERVICES FOR ELs AND THEIR FAMILIES (CONTINUED)",null,null,null,null,null,null,null,null,null,null,null,null,null,null,null,"E.  PROGRAMS AND SERVICES FOR ELs AND THEIR FAMILIES (CONTINUED)",null,null,null,null,null,null,null,null,null,null,null,null,null,null,null,"E.  PROGRAMS AND SERVICES FOR ELs AND THEIR FAMILIES (CONTINUED)",null,null,null,null,null,null,null,null,null,null,null,null,null,null,null,"E.  PROGRAMS AND SERVICES FOR ELs AND THEIR FAMILIES (CONTINUED)",null,null,null,null,null,null,null,null,null,null,null,null,null,null,null,"E.  PROGRAMS AND SERVICES FOR ELs AND THEIR FAMILIES (CONTINUED)",null,null,null,null,null,null,null,null,null,null,null,null,null,null,null,"E.  PROGRAMS AND SERVICES FOR ELs AND THEIR FAMILIES (CONTINUED)",null,null,null,null,null,null,null,null,null,null,null,null,null,null,null,"E.  PROGRAMS AND SERVICES FOR ELs AND THEIR FAMILIES (CONTINUED)",null,null,null,null,null,null,null,null,null,null,null,null,null,null,null,"E.  PROGRAMS AND SERVICES FOR ELs AND THEIR FAMILIES (CONTINUED)",null,null,null,null,null,null,null,null,null,null,null,null,null,null,null,"E.  PROGRAMS AND SERVICES FOR ELs AND THEIR FAMILIES (CONTINUED)",null,null,null,null,null,null,null,null,null,null,null,null,null,null,null,"E.  PROGRAMS AND SERVICES FOR ELs AND THEIR FAMILIES (CONTINUED)",null,null,null,null,null,null,null,null,null,null,null,null,null,null,null,"E.  PROGRAMS AND SERVICES FOR ELs AND THEIR FAMILIES (CONTINUED)",null,null,null,null,null,null,null,null,null,null,null,null,null,null,null,"E.  PROGRAMS AND SERVICES FOR ELs AND THEIR FAMILIES (CONTINUED)",null,null,null,null,null,null,null,null,null,null,null,null,null,null,null,"E.  PROGRAMS AND SERVICES FOR ELs AND THEIR FAMILIES (CONTINUED)",null,null,null,null,null,null,null,null,null,null,null,null,null,null,null,"E.  PROGRAMS AND SERVICES FOR ELs AND THEIR FAMILIES (CONTINUED)",null,null,null,null,null,null,null,null,null,null,null,null,null,null,null,"E.  PROGRAMS AND SERVICES FOR ELs AND THEIR FAMILIES (CONTINUED)",null,null,null,null,null,null,null,null,null,null,null,null,null,null,null,"E.  PROGRAMS AND SERVICES FOR ELs AND THEIR FAMILIES (CONTINUED)",null,null,null,null,null,null,null,null,null,null,null,null,null,null,null,"E.  PROGRAMS AND SERVICES FOR ELs AND THEIR FAMILIES (CONTINUED)",null,null,null,null,null,null,null,null,null,null,null,null,null,null,null,"E.  PROGRAMS AND SERVICES FOR ELs AND THEIR FAMILIES (CONTINUED)",null,null,null,null,null,null,null,null,null,null,null,null,null,null,null,"E.  PROGRAMS AND SERVICES FOR ELs AND THEIR FAMILIES (CONTINUED)",null,null,null,null,null,null,null,null,null,null,null,null,null,null,null,"E.  PROGRAMS AND SERVICES FOR ELs AND THEIR FAMILIES (CONTINUED)",null,null,null,null,null,null,null,null,null,null,null,null,null,null,null,"E.  PROGRAMS AND SERVICES FOR ELs AND THEIR FAMILIES (CONTINUED)",null,null,null,null,null,null,null,null,null,null,null,null,null,null,null,"E.  PROGRAMS AND SERVICES FOR ELs AND THEIR FAMILIES (CONTINUED)",null,null,null,null,null,null,null,null,null,null,null,null,null,null,null,"E.  PROGRAMS AND SERVICES FOR ELs AND THEIR FAMILIES (CONTINUED)",null,null,null,null,null,null,null,null,null,null,null,null,null,null,null,"E.  PROGRAMS AND SERVICES FOR ELs AND THEIR FAMILIES (CONTINUED)",null,null,null,null,null,null,null,null,null,null,null,null,null,null,null,"E.  PROGRAMS AND SERVICES FOR ELs AND THEIR FAMILIES (CONTINUED)",null,null,null,null,null,null,null,null,null,null,null,null,null,null,null,"E.  PROGRAMS AND SERVICES FOR ELs AND THEIR FAMILIES (CONTINUED)",null,null,null,null,null,null,null,null,null,null,null,null,null,null,null,"E.  PROGRAMS AND SERVICES FOR ELs AND THEIR FAMILIES (CONTINUED)",null,null,null,null,null,null,null,null,null,null,null,null,null,null,null,"E.  PROGRAMS AND SERVICES FOR ELs AND THEIR FAMILIES (CONTINUED)",null,null,null,null,null,null,null,null,null,null,null,null,null,null,null,"E.  PROGRAMS AND SERVICES FOR ELs AND THEIR FAMILIES (CONTINUED)",null,null,null,null,null,null,null,null,null,null,null,null,null,null,null,"E.  PROGRAMS AND SERVICES FOR ELs AND THEIR FAMILIES (CONTINUED)",null,null,null,null,null,null,null,null,null,null,null,null,null,null,null,"E.  PROGRAMS AND SERVICES FOR ELs AND THEIR FAMILIES (CONTINUED)",null,null,null,null,null,null,null,null,null,null,null,null,null,null,null,"E.  PROGRAMS AND SERVICES FOR ELs AND THEIR FAMILIES (CONTINUED)",null,null,null,null,null,null,null,null,null,null,null,null,null,null,null,"E.  PROGRAMS AND SERVICES FOR ELs AND THEIR FAMILIES (CONTINUED)",null,null,null,null,null,null,null,null,null,null,null,null,null,null,null,"E.  PROGRAMS AND SERVICES FOR ELs AND THEIR FAMILIES (CONTINUED)",null,null,null,null,null,null,null,null,null,null,null,null,null,null,null,"E.  PROGRAMS AND SERVICES FOR ELs AND THEIR FAMILIES (CONTINUED)",null,null,null,null,null,null,null,null,null,null,null,null,null,null,null,"E.  PROGRAMS AND SERVICES FOR ELs AND THEIR FAMILIES (CONTINUED)",null,null,null,null,null,null,null,null,null,null,null,null,null,null,null,"E.  PROGRAMS AND SERVICES FOR ELs AND THEIR FAMILIES (CONTINUED)",null,null,null,null,null,null,null,null,null,null,null,null,null,null,null,"E.  PROGRAMS AND SERVICES FOR ELs AND THEIR FAMILIES (CONTINUED)",null,null,null,null,null,null,null,null,null,null,null,null,null,null,null,"E.  PROGRAMS AND SERVICES FOR ELs AND THEIR FAMILIES (CONTINUED)",null,null,null,null,null,null,null,null,null,null,null,null,null,null,null,"E.  PROGRAMS AND SERVICES FOR ELs AND THEIR FAMILIES (CONTINUED)",null,null,null,null,null,null,null,null,null,null,null,null,null,null,null,"E.  PROGRAMS AND SERVICES FOR ELs AND THEIR FAMILIES (CONTINUED)",null,null,null,null,null,null,null,null,null,null,null,null,null,null,null,"E.  PROGRAMS AND SERVICES FOR ELs AND THEIR FAMILIES (CONTINUED)",null,null,null,null,null,null,null,null,null,null,null,null,null,null,null,"E.  PROGRAMS AND SERVICES FOR ELs AND THEIR FAMILIES (CONTINUED)",null,null,null,null,null,null,null,null,null,null,null,null,null,null,null,"E.  PROGRAMS AND SERVICES FOR ELs AND THEIR FAMILIES (CONTINUED)",null,null,null,null,null,null,null,null,null,null,null,null,null,null,null,"E.  PROGRAMS AND SERVICES FOR ELs AND THEIR FAMILIES (CONTINUED)",null,null,null,null,null,null,null,null,null,null,null,null,null,null,null,"E.  PROGRAMS AND SERVICES FOR ELs AND THEIR FAMILIES (CONTINUED)",null,null,null,null,null,null,null,null,null,null,null,null,null,null,null,"E.  PROGRAMS AND SERVICES FOR ELs AND THEIR FAMILIES (CONTINUED)",null,null,null,null,null,null,null,null,null,null,null,null,null,null,null,"E.  PROGRAMS AND SERVICES FOR ELs AND THEIR FAMILIES (CONTINUED)",null,null,null,null,null,null,null,null,null,null,null,null,null,null,null,"E.  PROGRAMS AND SERVICES FOR ELs AND THEIR FAMILIES (CONTINUED)",null,null,null,null,null,null,null,null,null,null,null,null,null,null,null,"E.  PROGRAMS AND SERVICES FOR ELs AND THEIR FAMILIES (CONTINUED)",null,null,null,null,null,null,null,null,null,null,null,null,null,null,null,"E.  PROGRAMS AND SERVICES FOR ELs AND THEIR FAMILIES (CONTINUED)",null,null,null,null,null,null,null,null,null,null,null,null,null,null,null,"E.  PROGRAMS AND SERVICES FOR ELs AND THEIR FAMILIES (CONTINUED)",null,null,null,null,null,null,null,null,null,null,null,null,null,null,null,"E.  PROGRAMS AND SERVICES FOR ELs AND THEIR FAMILIES (CONTINUED)",null,null,null,null,null,null,null,null,null,null,null,null,null,null,null,"E.  PROGRAMS AND SERVICES FOR ELs AND THEIR FAMILIES (CONTINUED)",null,null,null,null,null,null,null,null,null,null,null,null,null,null,null,"E.  PROGRAMS AND SERVICES FOR ELs AND THEIR FAMILIES (CONTINUED)",null,null,null,null,null,null,null,null,null,null,null,null,null,null,null,"E.  PROGRAMS AND SERVICES FOR ELs AND THEIR FAMILIES (CONTINUED)",null,null,null,null,null,null,null,null,null,null,null,null,null,null,null,"E.  PROGRAMS AND SERVICES FOR ELs AND THEIR FAMILIES (CONTINUED)",null,null,null,null,null,null,null,null,null,null,null,null,null,null,null,"E.  PROGRAMS AND SERVICES FOR ELs AND THEIR FAMILIES (CONTINUED)",null,null,null,null,null,null,null,null,null,null,null,null,null,null,null,"E.  PROGRAMS AND SERVICES FOR ELs AND THEIR FAMILIES (CONTINUED)",null,null,null,null,null,null,null,null,null,null,null,null,null,null,null,"E.  PROGRAMS AND SERVICES FOR ELs AND THEIR FAMILIES (CONTINUED)",null,null,null,null,null,null,null,null,null,null,null,null,null,null,null,"E.  PROGRAMS AND SERVICES FOR ELs AND THEIR FAMILIES (CONTINUED)",null,null,null,null,null,null,null,null,null,null,null,null,null,null,null,"E.  PROGRAMS AND SERVICES FOR ELs AND THEIR FAMILIES (CONTINUED)",null,null,null,null,null,null,null,null,null,null,null,null,null,null,null,"E.  PROGRAMS AND SERVICES FOR ELs AND THEIR FAMILIES (CONTINUED)",null,null,null,null,null,null,null,null,null,null,null,null,null,null,null,"E.  PROGRAMS AND SERVICES FOR ELs AND THEIR FAMILIES (CONTINUED)",null,null,null,null,null,null,null,null,null,null,null,null,null,null,null,"E.  PROGRAMS AND SERVICES FOR ELs AND THEIR FAMILIES (CONTINUED)",null,null,null,null,null,null,null,null,null,null,null,null,null,null,null,"E.  PROGRAMS AND SERVICES FOR ELs AND THEIR FAMILIES (CONTINUED)",null,null,null,null,null,null,null,null,null,null,null,null,null,null,null,"E.  PROGRAMS AND SERVICES FOR ELs AND THEIR FAMILIES (CONTINUED)",null,null,null,null,null,null,null,null,null,null,null,null,null,null,null,"E.  PROGRAMS AND SERVICES FOR ELs AND THEIR FAMILIES (CONTINUED)",null,null,null,null,null,null,null,null,null,null,null,null,null,null,null,"E.  PROGRAMS AND SERVICES FOR ELs AND THEIR FAMILIES (CONTINUED)",null,null,null,null,null,null,null,null,null,null,null,null,null,null,null,"E.  PROGRAMS AND SERVICES FOR ELs AND THEIR FAMILIES (CONTINUED)",null,null,null,null,null,null,null,null,null,null,null,null,null,null,null,"E.  PROGRAMS AND SERVICES FOR ELs AND THEIR FAMILIES (CONTINUED)",null,null,null,null,null,null,null,null,null,null,null,null,null,null,null,"E.  PROGRAMS AND SERVICES FOR ELs AND THEIR FAMILIES (CONTINUED)",null,null,null,null,null,null,null,null,null,null,null,null,null,null,null,"E.  PROGRAMS AND SERVICES FOR ELs AND THEIR FAMILIES (CONTINUED)",null,null,null,null,null,null,null,null,null,null,null,null,null,null,null,"E.  PROGRAMS AND SERVICES FOR ELs AND THEIR FAMILIES (CONTINUED)",null,null,null,null,null,null,null,null,null,null,null,null,null,null,null,"E.  PROGRAMS AND SERVICES FOR ELs AND THEIR FAMILIES (CONTINUED)",null,null,null,null,null,null,null,null,null,null,null,null,null,null,null,"E.  PROGRAMS AND SERVICES FOR ELs AND THEIR FAMILIES (CONTINUED)",null,null,null,null,null,null,null,null,null,null,null,null,null,null,null,"E.  PROGRAMS AND SERVICES FOR ELs AND THEIR FAMILIES (CONTINUED)",null,null,null,null,null,null,null,null,null,null,null,null,null,null,null,"E.  PROGRAMS AND SERVICES FOR ELs AND THEIR FAMILIES (CONTINUED)",null,null,null,null,null,null,null,null,null,null,null,null,null,null,null,"E.  PROGRAMS AND SERVICES FOR ELs AND THEIR FAMILIES (CONTINUED)",null,null,null,null,null,null,null,null,null,null,null,null,null,null,null,"E.  PROGRAMS AND SERVICES FOR ELs AND THEIR FAMILIES (CONTINUED)",null,null,null,null,null,null,null,null,null,null,null,null,null,null,null,"E.  PROGRAMS AND SERVICES FOR ELs AND THEIR FAMILIES (CONTINUED)",null,null,null,null,null,null,null,null,null,null,null,null,null,null,null,"E.  PROGRAMS AND SERVICES FOR ELs AND THEIR FAMILIES (CONTINUED)",null,null,null,null,null,null,null,null,null,null,null,null,null,null,null,"E.  PROGRAMS AND SERVICES FOR ELs AND THEIR FAMILIES (CONTINUED)",null,null,null,null,null,null,null,null,null,null,null,null,null,null,null,"E.  PROGRAMS AND SERVICES FOR ELs AND THEIR FAMILIES (CONTINUED)",null,null,null,null,null,null,null,null,null,null,null,null,null,null,null,"E.  PROGRAMS AND SERVICES FOR ELs AND THEIR FAMILIES (CONTINUED)",null,null,null,null,null,null,null,null,null,null,null,null,null,null,null,"E.  PROGRAMS AND SERVICES FOR ELs AND THEIR FAMILIES (CONTINUED)",null,null,null,null,null,null,null,null,null,null,null,null,null,null,null,"E.  PROGRAMS AND SERVICES FOR ELs AND THEIR FAMILIES (CONTINUED)",null,null,null,null,null,null,null,null,null,null,null,null,null,null,null,"E.  PROGRAMS AND SERVICES FOR ELs AND THEIR FAMILIES (CONTINUED)",null,null,null,null,null,null,null,null,null,null,null,null,null,null,null,"E.  PROGRAMS AND SERVICES FOR ELs AND THEIR FAMILIES (CONTINUED)",null,null,null,null,null,null,null,null,null,null,null,null,null,null,null,"E.  PROGRAMS AND SERVICES FOR ELs AND THEIR FAMILIES (CONTINUED)",null,null,null,null,null,null,null,null,null,null,null,null,null,null,null,"E.  PROGRAMS AND SERVICES FOR ELs AND THEIR FAMILIES (CONTINUED)",null,null,null,null,null,null,null,null,null,null,null,null,null,null,null,"E.  PROGRAMS AND SERVICES FOR ELs AND THEIR FAMILIES (CONTINUED)",null,null,null,null,null,null,null,null,null,null,null,null,null,null,null,"E.  PROGRAMS AND SERVICES FOR ELs AND THEIR FAMILIES (CONTINUED)",null,null,null,null,null,null,null,null,null,null,null,null,null,null,null,"E.  PROGRAMS AND SERVICES FOR ELs AND THEIR FAMILIES (CONTINUED)",null,null,null,null,null,null,null,null,null,null,null,null,null,null,null,"E.  PROGRAMS AND SERVICES FOR ELs AND THEIR FAMILIES (CONTINUED)",null,null,null,null,null,null,null,null,null,null,null,null,null,null,null,"E.  PROGRAMS AND SERVICES FOR ELs AND THEIR FAMILIES (CONTINUED)",null,null,null,null,null,null,null,null,null,null,null,null,null,null,null,"E.  PROGRAMS AND SERVICES FOR ELs AND THEIR FAMILIES (CONTINUED)",null,null,null,null,null,null,null,null,null,null,null,null,null,null,null,"E.  PROGRAMS AND SERVICES FOR ELs AND THEIR FAMILIES (CONTINUED)",null,null,null,null,null,null,null,null,null,null,null,null,null,null,null,"E.  PROGRAMS AND SERVICES FOR ELs AND THEIR FAMILIES (CONTINUED)",null,null,null,null,null,null,null,null,null,null,null,null,null,null,null,"E.  PROGRAMS AND SERVICES FOR ELs AND THEIR FAMILIES (CONTINUED)",null,null,null,null,null,null,null,null,null,null,null,null,null,null,null,"E.  PROGRAMS AND SERVICES FOR ELs AND THEIR FAMILIES (CONTINUED)",null,null,null,null,null,null,null,null,null,null,null,null,null,null,null,"E.  PROGRAMS AND SERVICES FOR ELs AND THEIR FAMILIES (CONTINUED)",null,null,null,null,null,null,null,null,null,null,null,null,null,null,null,"E.  PROGRAMS AND SERVICES FOR ELs AND THEIR FAMILIES (CONTINUED)",null,null,null,null,null,null,null,null,null,null,null,null,null,null,null,"E.  PROGRAMS AND SERVICES FOR ELs AND THEIR FAMILIES (CONTINUED)",null,null,null,null,null,null,null,null,null,null,null,null,null,null,null,"E.  PROGRAMS AND SERVICES FOR ELs AND THEIR FAMILIES (CONTINUED)",null,null,null,null,null,null,null,null,null,null,null,null,null,null,null,"E.  PROGRAMS AND SERVICES FOR ELs AND THEIR FAMILIES (CONTINUED)",null,null,null,null,null,null,null,null,null,null,null,null,null,null,null,"E.  PROGRAMS AND SERVICES FOR ELs AND THEIR FAMILIES (CONTINUED)",null,null,null,null,null,null,null,null,null,null,null,null,null,null,null,"E.  PROGRAMS AND SERVICES FOR ELs AND THEIR FAMILIES (CONTINUED)",null,null,null,null,null,null,null,null,null,null,null,null,null,null,null,"E.  PROGRAMS AND SERVICES FOR ELs AND THEIR FAMILIES (CONTINUED)",null,null,null,null,null,null,null,null,null,null,null,null,null,null,null,"E.  PROGRAMS AND SERVICES FOR ELs AND THEIR FAMILIES (CONTINUED)",null,null,null,null,null,null,null,null,null,null,null,null,null,null,null,"E.  PROGRAMS AND SERVICES FOR ELs AND THEIR FAMILIES (CONTINUED)",null,null,null,null,null,null,null,null,null,null,null,null,null,null,null,"E.  PROGRAMS AND SERVICES FOR ELs AND THEIR FAMILIES (CONTINUED)",null,null,null,null,null,null,null,null,null,null,null,null,null,null,null,"E.  PROGRAMS AND SERVICES FOR ELs AND THEIR FAMILIES (CONTINUED)",null,null,null,null,null,null,null,null,null,null,null,null,null,null,null,"E.  PROGRAMS AND SERVICES FOR ELs AND THEIR FAMILIES (CONTINUED)",null,null,null,null,null,null,null,null,null,null,null,null,null,null,null,"E.  PROGRAMS AND SERVICES FOR ELs AND THEIR FAMILIES (CONTINUED)",null,null,null,null,null,null,null,null,null,null,null,null,null,null,null,"E.  PROGRAMS AND SERVICES FOR ELs AND THEIR FAMILIES (CONTINUED)",null,null,null,null,null,null,null,null,null,null,null,null,null,null,null,"E.  PROGRAMS AND SERVICES FOR ELs AND THEIR FAMILIES (CONTINUED)",null,null,null,null,null,null,null,null,null,null,null,null,null,null,null,"E.  PROGRAMS AND SERVICES FOR ELs AND THEIR FAMILIES (CONTINUED)",null,null,null,null,null,null,null,null,null,null,null,null,null,null,null,"E.  PROGRAMS AND SERVICES FOR ELs AND THEIR FAMILIES (CONTINUED)",null,null,null,null,null,null,null,null,null,null,null,null,null,null,null,"E.  PROGRAMS AND SERVICES FOR ELs AND THEIR FAMILIES (CONTINUED)",null,null,null,null,null,null,null,null,null,null,null,null,null,null,null,"E.  PROGRAMS AND SERVICES FOR ELs AND THEIR FAMILIES (CONTINUED)",null,null,null,null,null,null,null,null,null,null,null,null,null,null,null,"E.  PROGRAMS AND SERVICES FOR ELs AND THEIR FAMILIES (CONTINUED)",null,null,null,null,null,null,null,null,null,null,null,null,null,null,null,"E.  PROGRAMS AND SERVICES FOR ELs AND THEIR FAMILIES (CONTINUED)",null,null,null,null,null,null,null,null,null,null,null,null,null,null,null,"E.  PROGRAMS AND SERVICES FOR ELs AND THEIR FAMILIES (CONTINUED)",null,null,null,null,null,null,null,null,null,null,null,null,null,null,null,"E.  PROGRAMS AND SERVICES FOR ELs AND THEIR FAMILIES (CONTINUED)",null,null,null,null,null,null,null,null,null,null,null,null,null,null,null,"E.  PROGRAMS AND SERVICES FOR ELs AND THEIR FAMILIES (CONTINUED)",null,null,null,null,null,null,null,null,null,null,null,null,null,null,null,"E.  PROGRAMS AND SERVICES FOR ELs AND THEIR FAMILIES (CONTINUED)",null,null,null,null,null,null,null,null,null,null,null,null,null,null,null,"E.  PROGRAMS AND SERVICES FOR ELs AND THEIR FAMILIES (CONTINUED)",null,null,null,null,null,null,null,null,null,null,null,null,null,null,null,"E.  PROGRAMS AND SERVICES FOR ELs AND THEIR FAMILIES (CONTINUED)",null,null,null,null,null,null,null,null,null,null,null,null,null,null,null,"E.  PROGRAMS AND SERVICES FOR ELs AND THEIR FAMILIES (CONTINUED)",null,null,null,null,null,null,null,null,null,null,null,null,null,null,null,"E.  PROGRAMS AND SERVICES FOR ELs AND THEIR FAMILIES (CONTINUED)",null,null,null,null,null,null,null,null,null,null,null,null,null,null,null,"E.  PROGRAMS AND SERVICES FOR ELs AND THEIR FAMILIES (CONTINUED)",null,null,null,null,null,null,null,null,null,null,null,null,null,null,null,"E.  PROGRAMS AND SERVICES FOR ELs AND THEIR FAMILIES (CONTINUED)",null,null,null,null,null,null,null,null,null,null,null,null,null,null,null,"E.  PROGRAMS AND SERVICES FOR ELs AND THEIR FAMILIES (CONTINUED)",null,null,null,null,null,null,null,null,null,null,null,null,null,null,null,"E.  PROGRAMS AND SERVICES FOR ELs AND THEIR FAMILIES (CONTINUED)",null,null,null,null,null,null,null,null,null,null,null,null,null,null,null,"E.  PROGRAMS AND SERVICES FOR ELs AND THEIR FAMILIES (CONTINUED)",null,null,null,null,null,null,null,null,null,null,null,null,null,null,null,"E.  PROGRAMS AND SERVICES FOR ELs AND THEIR FAMILIES (CONTINUED)",null,null,null,null,null,null,null,null,null,null,null,null,null,null,null,"E.  PROGRAMS AND SERVICES FOR ELs AND THEIR FAMILIES (CONTINUED)",null,null,null,null,null,null,null,null,null,null,null,null,null,null,null,"E.  PROGRAMS AND SERVICES FOR ELs AND THEIR FAMILIES (CONTINUED)",null,null,null,null,null,null,null,null,null,null,null,null,null,null,null,"E.  PROGRAMS AND SERVICES FOR ELs AND THEIR FAMILIES (CONTINUED)",null,null,null,null,null,null,null,null,null,null,null,null,null,null,null,"E.  PROGRAMS AND SERVICES FOR ELs AND THEIR FAMILIES (CONTINUED)",null,null,null,null,null,null,null,null,null,null,null,null,null,null,null,"E.  PROGRAMS AND SERVICES FOR ELs AND THEIR FAMILIES (CONTINUED)",null,null,null,null,null,null,null,null,null,null,null,null,null,null,null,"E.  PROGRAMS AND SERVICES FOR ELs AND THEIR FAMILIES (CONTINUED)",null,null,null,null,null,null,null,null,null,null,null,null,null,null,null,"E.  PROGRAMS AND SERVICES FOR ELs AND THEIR FAMILIES (CONTINUED)",null,null,null,null,null,null,null,null,null,null,null,null,null,null,null,"E.  PROGRAMS AND SERVICES FOR ELs AND THEIR FAMILIES (CONTINUED)",null,null,null,null,null,null,null,null,null,null,null,null,null,null,null,"E.  PROGRAMS AND SERVICES FOR ELs AND THEIR FAMILIES (CONTINUED)",null,null,null,null,null,null,null,null,null,null,null,null,null,null,null,"E.  PROGRAMS AND SERVICES FOR ELs AND THEIR FAMILIES (CONTINUED)",null,null,null,null,null,null,null,null,null,null,null,null,null,null,null,"E.  PROGRAMS AND SERVICES FOR ELs AND THEIR FAMILIES (CONTINUED)",null,null,null,null,null,null,null,null,null,null,null,null,null,null,null,"E.  PROGRAMS AND SERVICES FOR ELs AND THEIR FAMILIES (CONTINUED)",null,null,null,null,null,null,null,null,null,null,null,null,null,null,null,"E.  PROGRAMS AND SERVICES FOR ELs AND THEIR FAMILIES (CONTINUED)",null,null,null,null,null,null,null,null,null,null,null,null,null,null,null,"E.  PROGRAMS AND SERVICES FOR ELs AND THEIR FAMILIES (CONTINUED)",null,null,null,null,null,null,null,null,null,null,null,null,null,null,null,"E.  PROGRAMS AND SERVICES FOR ELs AND THEIR FAMILIES (CONTINUED)",null,null,null,null,null,null,null,null,null,null,null,null,null,null,null,"E.  PROGRAMS AND SERVICES FOR ELs AND THEIR FAMILIES (CONTINUED)",null,null,null,null,null,null,null,null,null,null,null,null,null,null,null,"E.  PROGRAMS AND SERVICES FOR ELs AND THEIR FAMILIES (CONTINUED)",null,null,null,null,null,null,null,null,null,null,null,null,null,null,null,"E.  PROGRAMS AND SERVICES FOR ELs AND THEIR FAMILIES (CONTINUED)",null,null,null,null,null,null,null,null,null,null,null,null,null,null,null,"E.  PROGRAMS AND SERVICES FOR ELs AND THEIR FAMILIES (CONTINUED)",null,null,null,null,null,null,null,null,null,null,null,null,null,null,null,"E.  PROGRAMS AND SERVICES FOR ELs AND THEIR FAMILIES (CONTINUED)",null,null,null,null,null,null,null,null,null,null,null,null,null,null,null,"E.  PROGRAMS AND SERVICES FOR ELs AND THEIR FAMILIES (CONTINUED)",null,null,null,null,null,null,null,null,null,null,null,null,null,null,null,"E.  PROGRAMS AND SERVICES FOR ELs AND THEIR FAMILIES (CONTINUED)",null,null,null,null,null,null,null,null,null,null,null,null,null,null,null,"E.  PROGRAMS AND SERVICES FOR ELs AND THEIR FAMILIES (CONTINUED)",null,null,null,null,null,null,null,null,null,null,null,null,null,null,null,"E.  PROGRAMS AND SERVICES FOR ELs AND THEIR FAMILIES (CONTINUED)",null,null,null,null,null,null,null,null,null,null,null,null,null,null,null,"E.  PROGRAMS AND SERVICES FOR ELs AND THEIR FAMILIES (CONTINUED)",null,null,null,null,null,null,null,null,null,null,null,null,null,null,null,"E.  PROGRAMS AND SERVICES FOR ELs AND THEIR FAMILIES (CONTINUED)",null,null,null,null,null,null,null,null,null,null,null,null,null,null,null,"E.  PROGRAMS AND SERVICES FOR ELs AND THEIR FAMILIES (CONTINUED)",null,null,null,null,null,null,null,null,null,null,null,null,null,null,null,"E.  PROGRAMS AND SERVICES FOR ELs AND THEIR FAMILIES (CONTINUED)",null,null,null,null,null,null,null,null,null,null,null,null,null,null,null,"E.  PROGRAMS AND SERVICES FOR ELs AND THEIR FAMILIES (CONTINUED)",null,null,null,null,null,null,null,null,null,null,null,null,null,null,null,"E.  PROGRAMS AND SERVICES FOR ELs AND THEIR FAMILIES (CONTINUED)",null,null,null,null,null,null,null,null,null,null,null,null,null,null,null,"E.  PROGRAMS AND SERVICES FOR ELs AND THEIR FAMILIES (CONTINUED)",null,null,null,null,null,null,null,null,null,null,null,null,null,null,null,"E.  PROGRAMS AND SERVICES FOR ELs AND THEIR FAMILIES (CONTINUED)",null,null,null,null,null,null,null,null,null,null,null,null,null,null,null,"E.  PROGRAMS AND SERVICES FOR ELs AND THEIR FAMILIES (CONTINUED)",null,null,null,null,null,null,null,null,null,null,null,null,null,null,null,"E.  PROGRAMS AND SERVICES FOR ELs AND THEIR FAMILIES (CONTINUED)",null,null,null,null,null,null,null,null,null,null,null,null,null,null,null,"E.  PROGRAMS AND SERVICES FOR ELs AND THEIR FAMILIES (CONTINUED)",null,null,null,null,null,null,null,null,null,null,null,null,null,null,null,"E.  PROGRAMS AND SERVICES FOR ELs AND THEIR FAMILIES (CONTINUED)",null,null,null,null,null,null,null,null,null,null,null,null,null,null,null,"E.  PROGRAMS AND SERVICES FOR ELs AND THEIR FAMILIES (CONTINUED)",null,null,null,null,null,null,null,null,null,null,null,null,null,null,null,"E.  PROGRAMS AND SERVICES FOR ELs AND THEIR FAMILIES (CONTINUED)",null,null,null,null,null,null,null,null,null,null,null,null,null,null,null,"E.  PROGRAMS AND SERVICES FOR ELs AND THEIR FAMILIES (CONTINUED)",null,null,null,null,null,null,null,null,null,null,null,null,null,null,null,"E.  PROGRAMS AND SERVICES FOR ELs AND THEIR FAMILIES (CONTINUED)",null,null,null,null,null,null,null,null,null,null,null,null,null,null,null,"E.  PROGRAMS AND SERVICES FOR ELs AND THEIR FAMILIES (CONTINUED)",null,null,null,null,null,null,null,null,null,null,null,null,null,null,null,"E.  PROGRAMS AND SERVICES FOR ELs AND THEIR FAMILIES (CONTINUED)",null,null,null,null,null,null,null,null,null,null,null,null,null,null,null,"E.  PROGRAMS AND SERVICES FOR ELs AND THEIR FAMILIES (CONTINUED)",null,null,null,null,null,null,null,null,null,null,null,null,null,null,null,"E.  PROGRAMS AND SERVICES FOR ELs AND THEIR FAMILIES (CONTINUED)",null,null,null,null,null,null,null,null,null,null,null,null,null,null,null,"E.  PROGRAMS AND SERVICES FOR ELs AND THEIR FAMILIES (CONTINUED)",null,null,null,null,null,null,null,null,null,null,null,null,null,null,null,"E.  PROGRAMS AND SERVICES FOR ELs AND THEIR FAMILIES (CONTINUED)",null,null,null,null,null,null,null,null,null,null,null,null,null,null,null,"E.  PROGRAMS AND SERVICES FOR ELs AND THEIR FAMILIES (CONTINUED)",null,null,null,null,null,null,null,null,null,null,null,null,null,null,null,"E.  PROGRAMS AND SERVICES FOR ELs AND THEIR FAMILIES (CONTINUED)",null,null,null,null,null,null,null,null,null,null,null,null,null,null,null,"E.  PROGRAMS AND SERVICES FOR ELs AND THEIR FAMILIES (CONTINUED)",null,null,null,null,null,null,null,null,null,null,null,null,null,null,null,"E.  PROGRAMS AND SERVICES FOR ELs AND THEIR FAMILIES (CONTINUED)",null,null,null,null,null,null,null,null,null,null,null,null,null,null,null,"E.  PROGRAMS AND SERVICES FOR ELs AND THEIR FAMILIES (CONTINUED)",null,null,null,null,null,null,null,null,null,null,null,null,null,null,null,"E.  PROGRAMS AND SERVICES FOR ELs AND THEIR FAMILIES (CONTINUED)",null,null,null,null,null,null,null,null,null,null,null,null,null,null,null,"E.  PROGRAMS AND SERVICES FOR ELs AND THEIR FAMILIES (CONTINUED)",null,null,null,null,null,null,null,null,null,null,null,null,null,null,null,"E.  PROGRAMS AND SERVICES FOR ELs AND THEIR FAMILIES (CONTINUED)",null,null,null,null,null,null,null,null,null,null,null,null,null,null,null,"E.  PROGRAMS AND SERVICES FOR ELs AND THEIR FAMILIES (CONTINUED)",null,null,null,null,null,null,null,null,null,null,null,null,null,null,null,"E.  PROGRAMS AND SERVICES FOR ELs AND THEIR FAMILIES (CONTINUED)",null,null,null,null,null,null,null,null,null,null,null,null,null,null,null,"E.  PROGRAMS AND SERVICES FOR ELs AND THEIR FAMILIES (CONTINUED)",null,null,null,null,null,null,null,null,null,null,null,null,null,null,null,"E.  PROGRAMS AND SERVICES FOR ELs AND THEIR FAMILIES (CONTINUED)",null,null,null,null,null,null,null,null,null,null,null,null,null,null,null,"E.  PROGRAMS AND SERVICES FOR ELs AND THEIR FAMILIES (CONTINUED)",null,null,null,null,null,null,null,null,null,null,null,null,null,null,null,"E.  PROGRAMS AND SERVICES FOR ELs AND THEIR FAMILIES (CONTINUED)",null,null,null,null,null,null,null,null,null,null,null,null,null,null,null,"E.  PROGRAMS AND SERVICES FOR ELs AND THEIR FAMILIES (CONTINUED)",null,null,null,null,null,null,null,null,null,null,null,null,null,null,null,"E.  PROGRAMS AND SERVICES FOR ELs AND THEIR FAMILIES (CONTINUED)",null,null,null,null,null,null,null,null,null,null,null,null,null,null,null,"E.  PROGRAMS AND SERVICES FOR ELs AND THEIR FAMILIES (CONTINUED)",null,null,null,null,null,null,null,null,null,null,null,null,null,null,null,"E.  PROGRAMS AND SERVICES FOR ELs AND THEIR FAMILIES (CONTINUED)",null,null,null,null,null,null,null,null,null,null,null,null,null,null,null,"E.  PROGRAMS AND SERVICES FOR ELs AND THEIR FAMILIES (CONTINUED)",null,null,null,null,null,null,null,null,null,null,null,null,null,null,null,"E.  PROGRAMS AND SERVICES FOR ELs AND THEIR FAMILIES (CONTINUED)",null,null,null,null,null,null,null,null,null,null,null,null,null,null,null,"E.  PROGRAMS AND SERVICES FOR ELs AND THEIR FAMILIES (CONTINUED)",null,null,null,null,null,null,null,null,null,null,null,null,null,null,null,"E.  PROGRAMS AND SERVICES FOR ELs AND THEIR FAMILIES (CONTINUED)",null,null,null,null,null,null,null,null,null,null,null,null,null,null,null,"E.  PROGRAMS AND SERVICES FOR ELs AND THEIR FAMILIES (CONTINUED)",null,null,null,null,null,null,null,null,null,null,null,null,null,null,null,"E.  PROGRAMS AND SERVICES FOR ELs AND THEIR FAMILIES (CONTINUED)",null,null,null,null,null,null,null,null,null,null,null,null,null,null,null,"E.  PROGRAMS AND SERVICES FOR ELs AND THEIR FAMILIES (CONTINUED)",null,null,null,null,null,null,null,null,null,null,null,null,null,null,null,"E.  PROGRAMS AND SERVICES FOR ELs AND THEIR FAMILIES (CONTINUED)",null,null,null,null,null,null,null,null,null,null,null,null,null,null,null,"E.  PROGRAMS AND SERVICES FOR ELs AND THEIR FAMILIES (CONTINUED)",null,null,null,null,null,null,null,null,null,null,null,null,null,null,null,"E.  PROGRAMS AND SERVICES FOR ELs AND THEIR FAMILIES (CONTINUED)",null,null,null,null,null,null,null,null,null,null,null,null,null,null,null,"E.  PROGRAMS AND SERVICES FOR ELs AND THEIR FAMILIES (CONTINUED)",null,null,null,null,null,null,null,null,null,null,null,null,null,null,null,"E.  PROGRAMS AND SERVICES FOR ELs AND THEIR FAMILIES (CONTINUED)",null,null,null,null,null,null,null,null,null,null,null,null,null,null,null,"E.  PROGRAMS AND SERVICES FOR ELs AND THEIR FAMILIES (CONTINUED)",null,null,null,null,null,null,null,null,null,null,null,null,null,null,null,"E.  PROGRAMS AND SERVICES FOR ELs AND THEIR FAMILIES (CONTINUED)",null,null,null,null,null,null,null,null,null,null,null,null,null,null,null,"E.  PROGRAMS AND SERVICES FOR ELs AND THEIR FAMILIES (CONTINUED)",null,null,null,null,null,null,null,null,null,null,null,null,null,null,null,"E.  PROGRAMS AND SERVICES FOR ELs AND THEIR FAMILIES (CONTINUED)",null,null,null,null,null,null,null,null,null,null,null,null,null,null,null,"E.  PROGRAMS AND SERVICES FOR ELs AND THEIR FAMILIES (CONTINUED)",null,null,null,null,null,null,null,null,null,null,null,null,null,null,null,"E.  PROGRAMS AND SERVICES FOR ELs AND THEIR FAMILIES (CONTINUED)",null,null,null,null,null,null,null,null,null,null,null,null,null,null,null,"E.  PROGRAMS AND SERVICES FOR ELs AND THEIR FAMILIES (CONTINUED)",null,null,null,null,null,null,null,null,null,null,null,null,null,null,null,"E.  PROGRAMS AND SERVICES FOR ELs AND THEIR FAMILIES (CONTINUED)",null,null,null,null,null,null,null,null,null,null,null,null,null,null,null,"E.  PROGRAMS AND SERVICES FOR ELs AND THEIR FAMILIES (CONTINUED)",null,null,null,null,null,null,null,null,null,null,null,null,null,null,null,"E.  PROGRAMS AND SERVICES FOR ELs AND THEIR FAMILIES (CONTINUED)",null,null,null,null,null,null,null,null,null,null,null,null,null,null,null,"E.  PROGRAMS AND SERVICES FOR ELs AND THEIR FAMILIES (CONTINUED)",null,null,null,null,null,null,null,null,null,null,null,null,null,null,null,"E.  PROGRAMS AND SERVICES FOR ELs AND THEIR FAMILIES (CONTINUED)",null,null,null,null,null,null,null,null,null,null,null,null,null,null,null,"E.  PROGRAMS AND SERVICES FOR ELs AND THEIR FAMILIES (CONTINUED)",null,null,null,null,null,null,null,null,null,null,null,null,null,null,null,"E.  PROGRAMS AND SERVICES FOR ELs AND THEIR FAMILIES (CONTINUED)",null,null,null,null,null,null,null,null,null,null,null,null,null,null,null,"E.  PROGRAMS AND SERVICES FOR ELs AND THEIR FAMILIES (CONTINUED)",null,null,null,null,null,null,null,null,null,null,null,null,null,null,null,"E.  PROGRAMS AND SERVICES FOR ELs AND THEIR FAMILIES (CONTINUED)",null,null,null,null,null,null,null,null,null,null,null,null,null,null,null,"E.  PROGRAMS AND SERVICES FOR ELs AND THEIR FAMILIES (CONTINUED)",null,null,null,null,null,null,null,null,null,null,null,null,null,null,null,"E.  PROGRAMS AND SERVICES FOR ELs AND THEIR FAMILIES (CONTINUED)",null,null,null,null,null,null,null,null,null,null,null,null,null,null,null,"E.  PROGRAMS AND SERVICES FOR ELs AND THEIR FAMILIES (CONTINUED)",null,null,null,null,null,null,null,null,null,null,null,null,null,null,null,"E.  PROGRAMS AND SERVICES FOR ELs AND THEIR FAMILIES (CONTINUED)",null,null,null,null,null,null,null,null,null,null,null,null,null,null,null,"E.  PROGRAMS AND SERVICES FOR ELs AND THEIR FAMILIES (CONTINUED)",null,null,null,null,null,null,null,null,null,null,null,null,null,null,null,"E.  PROGRAMS AND SERVICES FOR ELs AND THEIR FAMILIES (CONTINUED)",null,null,null,null,null,null,null,null,null,null,null,null,null,null,null,"E.  PROGRAMS AND SERVICES FOR ELs AND THEIR FAMILIES (CONTINUED)",null,null,null,null,null,null,null,null,null,null,null,null,null,null,null,"E.  PROGRAMS AND SERVICES FOR ELs AND THEIR FAMILIES (CONTINUED)",null,null,null,null,null,null,null,null,null,null,null,null,null,null,null,"E.  PROGRAMS AND SERVICES FOR ELs AND THEIR FAMILIES (CONTINUED)",null,null,null,null,null,null,null,null,null,null,null,null,null,null,null,"E.  PROGRAMS AND SERVICES FOR ELs AND THEIR FAMILIES (CONTINUED)",null,null,null,null,null,null,null,null,null,null,null,null,null,null,null,"E.  PROGRAMS AND SERVICES FOR ELs AND THEIR FAMILIES (CONTINUED)",null,null,null,null,null,null,null,null,null,null,null,null,null,null,null,"E.  PROGRAMS AND SERVICES FOR ELs AND THEIR FAMILIES (CONTINUED)",null,null,null,null,null,null,null,null,null,null,null,null,null,null,null,"E.  PROGRAMS AND SERVICES FOR ELs AND THEIR FAMILIES (CONTINUED)",null,null,null,null,null,null,null,null,null,null,null,null,null,null,null,"E.  PROGRAMS AND SERVICES FOR ELs AND THEIR FAMILIES (CONTINUED)",null,null,null,null,null,null,null,null,null,null,null,null,null,null,null,"E.  PROGRAMS AND SERVICES FOR ELs AND THEIR FAMILIES (CONTINUED)",null,null,null,null,null,null,null,null,null,null,null,null,null,null,null,"E.  PROGRAMS AND SERVICES FOR ELs AND THEIR FAMILIES (CONTINUED)",null,null,null,null,null,null,null,null,null,null,null,null,null,null,null,"E.  PROGRAMS AND SERVICES FOR ELs AND THEIR FAMILIES (CONTINUED)",null,null,null,null,null,null,null,null,null,null,null,null,null,null,null,"E.  PROGRAMS AND SERVICES FOR ELs AND THEIR FAMILIES (CONTINUED)",null,null,null,null,null,null,null,null,null,null,null,null,null,null,null,"E.  PROGRAMS AND SERVICES FOR ELs AND THEIR FAMILIES (CONTINUED)",null,null,null,null,null,null,null,null,null,null,null,null,null,null,null,"E.  PROGRAMS AND SERVICES FOR ELs AND THEIR FAMILIES (CONTINUED)",null,null,null,null,null,null,null,null,null,null,null,null,null,null,null,"E.  PROGRAMS AND SERVICES FOR ELs AND THEIR FAMILIES (CONTINUED)",null,null,null,null,null,null,null,null,null,null,null,null,null,null,null,"E.  PROGRAMS AND SERVICES FOR ELs AND THEIR FAMILIES (CONTINUED)",null,null,null,null,null,null,null,null,null,null,null,null,null,null,null,"E.  PROGRAMS AND SERVICES FOR ELs AND THEIR FAMILIES (CONTINUED)",null,null,null,null,null,null,null,null,null,null,null,null,null,null,null,"E.  PROGRAMS AND SERVICES FOR ELs AND THEIR FAMILIES (CONTINUED)",null,null,null,null,null,null,null,null,null,null,null,null,null,null,null,"E.  PROGRAMS AND SERVICES FOR ELs AND THEIR FAMILIES (CONTINUED)",null,null,null,null,null,null,null,null,null,null,null,null,null,null,null,"E.  PROGRAMS AND SERVICES FOR ELs AND THEIR FAMILIES (CONTINUED)",null,null,null,null,null,null,null,null,null,null,null,null,null,null,null,"E.  PROGRAMS AND SERVICES FOR ELs AND THEIR FAMILIES (CONTINUED)",null,null,null,null,null,null,null,null,null,null,null,null,null,null,null,"E.  PROGRAMS AND SERVICES FOR ELs AND THEIR FAMILIES (CONTINUED)",null,null,null,null,null,null,null,null,null,null,null,null,null,null,null,"E.  PROGRAMS AND SERVICES FOR ELs AND THEIR FAMILIES (CONTINUED)",null,null,null,null,null,null,null,null,null,null,null,null,null,null,null,"E.  PROGRAMS AND SERVICES FOR ELs AND THEIR FAMILIES (CONTINUED)",null,null,null,null,null,null,null,null,null,null,null,null,null,null,null,"E.  PROGRAMS AND SERVICES FOR ELs AND THEIR FAMILIES (CONTINUED)",null,null,null,null,null,null,null,null,null,null,null,null,null,null,null,"E.  PROGRAMS AND SERVICES FOR ELs AND THEIR FAMILIES (CONTINUED)",null,null,null,null,null,null,null,null,null,null,null,null,null,null,null,"E.  PROGRAMS AND SERVICES FOR ELs AND THEIR FAMILIES (CONTINUED)",null,null,null,null,null,null,null,null,null,null,null,null,null,null,null,"E.  PROGRAMS AND SERVICES FOR ELs AND THEIR FAMILIES (CONTINUED)",null,null,null,null,null,null,null,null,null,null,null,null,null,null,null,"E.  PROGRAMS AND SERVICES FOR ELs AND THEIR FAMILIES (CONTINUED)",null,null,null,null,null,null,null,null,null,null,null,null,null,null,null,"E.  PROGRAMS AND SERVICES FOR ELs AND THEIR FAMILIES (CONTINUED)",null,null,null,null,null,null,null,null,null,null,null,null,null,null,null,"E.  PROGRAMS AND SERVICES FOR ELs AND THEIR FAMILIES (CONTINUED)",null,null,null,null,null,null,null,null,null,null,null,null,null,null,null,"E.  PROGRAMS AND SERVICES FOR ELs AND THEIR FAMILIES (CONTINUED)",null,null,null,null,null,null,null,null,null,null,null,null,null,null,null,"E.  PROGRAMS AND SERVICES FOR ELs AND THEIR FAMILIES (CONTINUED)",null,null,null,null,null,null,null,null,null,null,null,null,null,null,null,"E.  PROGRAMS AND SERVICES FOR ELs AND THEIR FAMILIES (CONTINUED)",null,null,null,null,null,null,null,null,null,null,null,null,null,null,null,"E.  PROGRAMS AND SERVICES FOR ELs AND THEIR FAMILIES (CONTINUED)",null,null,null,null,null,null,null,null,null,null,null,null,null,null,null,"E.  PROGRAMS AND SERVICES FOR ELs AND THEIR FAMILIES (CONTINUED)",null,null,null,null,null,null,null,null,null,null,null,null,null,null,null,"E.  PROGRAMS AND SERVICES FOR ELs AND THEIR FAMILIES (CONTINUED)",null,null,null,null,null,null,null,null,null,null,null,null,null,null,null,"E.  PROGRAMS AND SERVICES FOR ELs AND THEIR FAMILIES (CONTINUED)",null,null,null,null,null,null,null,null,null,null,null,null,null,null,null,"E.  PROGRAMS AND SERVICES FOR ELs AND THEIR FAMILIES (CONTINUED)",null,null,null,null,null,null,null,null,null,null,null,null,null,null,null,"E.  PROGRAMS AND SERVICES FOR ELs AND THEIR FAMILIES (CONTINUED)",null,null,null,null,null,null,null,null,null,null,null,null,null,null,null,"E.  PROGRAMS AND SERVICES FOR ELs AND THEIR FAMILIES (CONTINUED)",null,null,null,null,null,null,null,null,null,null,null,null,null,null,null,"E.  PROGRAMS AND SERVICES FOR ELs AND THEIR FAMILIES (CONTINUED)",null,null,null,null,null,null,null,null,null,null,null,null,null,null,null,"E.  PROGRAMS AND SERVICES FOR ELs AND THEIR FAMILIES (CONTINUED)",null,null,null,null,null,null,null,null,null,null,null,null,null,null,null,"E.  PROGRAMS AND SERVICES FOR ELs AND THEIR FAMILIES (CONTINUED)",null,null,null,null,null,null,null,null,null,null,null,null,null,null,null,"E.  PROGRAMS AND SERVICES FOR ELs AND THEIR FAMILIES (CONTINUED)",null,null,null,null,null,null,null,null,null,null,null,null,null,null,null,"E.  PROGRAMS AND SERVICES FOR ELs AND THEIR FAMILIES (CONTINUED)",null,null,null,null,null,null,null,null,null,null,null,null,null,null,null,"E.  PROGRAMS AND SERVICES FOR ELs AND THEIR FAMILIES (CONTINUED)",null,null,null,null,null,null,null,null,null,null,null,null,null,null,null,"E.  PROGRAMS AND SERVICES FOR ELs AND THEIR FAMILIES (CONTINUED)",null,null,null,null,null,null,null,null,null,null,null,null,null,null,null,"E.  PROGRAMS AND SERVICES FOR ELs AND THEIR FAMILIES (CONTINUED)",null,null,null,null,null,null,null,null,null,null,null,null,null,null,null,"E.  PROGRAMS AND SERVICES FOR ELs AND THEIR FAMILIES (CONTINUED)",null,null,null,null,null,null,null,null,null,null,null,null,null,null,null,"E.  PROGRAMS AND SERVICES FOR ELs AND THEIR FAMILIES (CONTINUED)",null,null,null,null,null,null,null,null,null,null,null,null,null,null,null,"E.  PROGRAMS AND SERVICES FOR ELs AND THEIR FAMILIES (CONTINUED)",null,null,null,null,null,null,null,null,null,null,null,null,null,null,null,"E.  PROGRAMS AND SERVICES FOR ELs AND THEIR FAMILIES (CONTINUED)",null,null,null,null,null,null,null,null,null,null,null,null,null,null,null,"E.  PROGRAMS AND SERVICES FOR ELs AND THEIR FAMILIES (CONTINUED)",null,null,null,null,null,null,null,null,null,null,null,null,null,null,null,"E.  PROGRAMS AND SERVICES FOR ELs AND THEIR FAMILIES (CONTINUED)",null,null,null,null,null,null,null,null,null,null,null,null,null,null,null,"E.  PROGRAMS AND SERVICES FOR ELs AND THEIR FAMILIES (CONTINUED)",null,null,null,null,null,null,null,null,null,null,null,null,null,null,null,"E.  PROGRAMS AND SERVICES FOR ELs AND THEIR FAMILIES (CONTINUED)",null,null,null,null,null,null,null,null,null,null,null,null,null,null,null,"E.  PROGRAMS AND SERVICES FOR ELs AND THEIR FAMILIES (CONTINUED)",null,null,null,null,null,null,null,null,null,null,null,null,null,null,null,"E.  PROGRAMS AND SERVICES FOR ELs AND THEIR FAMILIES (CONTINUED)",null,null,null,null,null,null,null,null,null,null,null,null,null,null,null,"E.  PROGRAMS AND SERVICES FOR ELs AND THEIR FAMILIES (CONTINUED)",null,null,null,null,null,null,null,null,null,null,null,null,null,null,null,"E.  PROGRAMS AND SERVICES FOR ELs AND THEIR FAMILIES (CONTINUED)",null,null,null,null,null,null,null,null,null,null,null,null,null,null,null,"E.  PROGRAMS AND SERVICES FOR ELs AND THEIR FAMILIES (CONTINUED)",null,null,null,null,null,null,null,null,null,null,null,null,null,null,null,"E.  PROGRAMS AND SERVICES FOR ELs AND THEIR FAMILIES (CONTINUED)",null,null,null,null,null,null,null,null,null,null,null,null,null,null,null,"E.  PROGRAMS AND SERVICES FOR ELs AND THEIR FAMILIES (CONTINUED)",null,null,null,null,null,null,null,null,null,null,null,null,null,null,null,"E.  PROGRAMS AND SERVICES FOR ELs AND THEIR FAMILIES (CONTINUED)",null,null,null,null,null,null,null,null,null,null,null,null,null,null,null,"E.  PROGRAMS AND SERVICES FOR ELs AND THEIR FAMILIES (CONTINUED)",null,null,null,null,null,null,null,null,null,null,null,null,null,null,null,"E.  PROGRAMS AND SERVICES FOR ELs AND THEIR FAMILIES (CONTINUED)",null,null,null,null,null,null,null,null,null,null,null,null,null,null,null,"E.  PROGRAMS AND SERVICES FOR ELs AND THEIR FAMILIES (CONTINUED)",null,null,null,null,null,null,null,null,null,null,null,null,null,null,null,"E.  PROGRAMS AND SERVICES FOR ELs AND THEIR FAMILIES (CONTINUED)",null,null,null,null,null,null,null,null,null,null,null,null,null,null,null,"E.  PROGRAMS AND SERVICES FOR ELs AND THEIR FAMILIES (CONTINUED)",null,null,null,null,null,null,null,null,null,null,null,null,null,null,null,"E.  PROGRAMS AND SERVICES FOR ELs AND THEIR FAMILIES (CONTINUED)",null,null,null,null,null,null,null,null,null,null,null,null,null,null,null,"E.  PROGRAMS AND SERVICES FOR ELs AND THEIR FAMILIES (CONTINUED)",null,null,null,null,null,null,null,null,null,null,null,null,null,null,null,"E.  PROGRAMS AND SERVICES FOR ELs AND THEIR FAMILIES (CONTINUED)",null,null,null,null,null,null,null,null,null,null,null,null,null,null,null,"E.  PROGRAMS AND SERVICES FOR ELs AND THEIR FAMILIES (CONTINUED)",null,null,null,null,null,null,null,null,null,null,null,null,null,null,null,"E.  PROGRAMS AND SERVICES FOR ELs AND THEIR FAMILIES (CONTINUED)",null,null,null,null,null,null,null,null,null,null,null,null,null,null,null,"E.  PROGRAMS AND SERVICES FOR ELs AND THEIR FAMILIES (CONTINUED)",null,null,null,null,null,null,null,null,null,null,null,null,null,null,null,"E.  PROGRAMS AND SERVICES FOR ELs AND THEIR FAMILIES (CONTINUED)",null,null,null,null,null,null,null,null,null,null,null,null,null,null,null,"E.  PROGRAMS AND SERVICES FOR ELs AND THEIR FAMILIES (CONTINUED)",null,null,null,null,null,null,null,null,null,null,null,null,null,null,null,"E.  PROGRAMS AND SERVICES FOR ELs AND THEIR FAMILIES (CONTINUED)",null,null,null,null,null,null,null,null,null,null,null,null,null,null,null,"E.  PROGRAMS AND SERVICES FOR ELs AND THEIR FAMILIES (CONTINUED)",null,null,null,null,null,null,null,null,null,null,null,null,null,null,null,"E.  PROGRAMS AND SERVICES FOR ELs AND THEIR FAMILIES (CONTINUED)",null,null,null,null,null,null,null,null,null,null,null,null,null,null,null,"E.  PROGRAMS AND SERVICES FOR ELs AND THEIR FAMILIES (CONTINUED)",null,null,null,null,null,null,null,null,null,null,null,null,null,null,null,"E.  PROGRAMS AND SERVICES FOR ELs AND THEIR FAMILIES (CONTINUED)",null,null,null,null,null,null,null,null,null,null,null,null,null,null,null,"E.  PROGRAMS AND SERVICES FOR ELs AND THEIR FAMILIES (CONTINUED)",null,null,null,null,null,null,null,null,null,null,null,null,null,null,null,"E.  PROGRAMS AND SERVICES FOR ELs AND THEIR FAMILIES (CONTINUED)",null,null,null,null,null,null,null,null,null,null,null,null,null,null,null,"E.  PROGRAMS AND SERVICES FOR ELs AND THEIR FAMILIES (CONTINUED)",null,null,null,null,null,null,null,null,null,null,null,null,null,null,null,"E.  PROGRAMS AND SERVICES FOR ELs AND THEIR FAMILIES (CONTINUED)",null,null,null,null,null,null,null,null,null,null,null,null,null,null,null,"E.  PROGRAMS AND SERVICES FOR ELs AND THEIR FAMILIES (CONTINUED)",null,null,null,null,null,null,null,null,null,null,null,null,null,null,null,"E.  PROGRAMS AND SERVICES FOR ELs AND THEIR FAMILIES (CONTINUED)",null,null,null,null,null,null,null,null,null,null,null,null,null,null,null,"E.  PROGRAMS AND SERVICES FOR ELs AND THEIR FAMILIES (CONTINUED)"]
["Box 6:  If applicable describe the LIEP modifications to be introduced to address specific concerns identified in the evaluation process."]
["For the 2019-2020 academic year, ACPS will pilot an “Advisory” approach to supplement services received through the ESOL ESL or ELD model. The purpose is to prevent Long-Term ELs from opting out of ESOL services. They would meet regularly with an ESOL-certified teacher to set language proficiency goals and ensure academic success. We hope this will empower students to obtain linguistic proficiency and avoid languishing in the ESOL program. A similar approach will be used to support Formerly ELs in selecting and utilizing classroom and testing accommodations, in order to ensure that they do not regress in their academic language acquisition. "]
[]
["Outreach to Limited English Proficient (LEP) Parents, Families, and Community Organizations: The division must communicate meaningfully with LEP parents, families, and community organizations, and must notify LEP parents in a timely fashion in a language they can understand about programs, services, or activities that are made available to the general student population. "]
[]
["Box 7:  Using Local and/or State Funds:  Describe how the division provides outreach to LEP parents and families in a language they can understand to allow them the opportunity to participate in their student’s education. "]
[" Helping families and schools bridge language barriers is the first step to opening two-way communication. ACPS hosts a central registration process at our International & ESOL Welcome Center, where we screen students to determine whether or not they qualify for ESOL services per Superintendent’s Memo #194-17. Additionally, we inform and empower families to ask for interpretation services, using “I Speak _____” cards. The ACPS International & ESOL Welcome Center has worked to improve the quality and depth of understanding related to the required best practices in interpretation and translation for our families. We reviewed and updated the ACPS Staff Resources: Interpretation or Translation Highlights, formalized our ACPS-vetted interpreter and translator training, and intentionally connect with all schools’ main Office Associates. Additionally, we partnered with our Learning, Engineering, Access, and Design (LEAD) department to leverage technology applications that overcome language barriers. Finally, our ACPS website has the option to be translated using Google, with a visual support to make it more noticeable to EL families. The ACPS International & ESOL Welcome Center has worked to improve the quality and depth of understanding related to the required best practices in interpretation and translation for our families. We reviewed and updated the ACPS Staff Resources: Interpretation or Translation Highlights, formalized our ACPS-vetted interpreter and translator training, and intentionally connect with all schools’ main Office Associates. Additionally, we partnered with our Learning, Engineering, Access, and Design (LEAD) department to leverage technology applications that overcome language barriers. Finally, our ACPS website has the option to be translated using Google, with a visual support to make it more noticeable to EL families. \n\n\n"]
[]
["Page 23"]
[null,null,null,null,"School Division:",null,{"$f":"'Title III Budget'!$A$16","v":"ALBEMARLE COUNTY PUBLIC SCHOOLS"},null,null,null,null,null,"Division Number:",null,null,{"$f":"'Title III Budget'!$H$16","v":2}]
[]
["E.  PROGRAMS AND SERVICES FOR ELs AND THEIR FAMILIES (CONTINUED)",null,null,null,null,null,null,null,null,null,null,null,null,null,null,null,null,null,null,null,null,null,null,null,null,null,null,null,null,null,null,null,"E.  PROGRAMS AND SERVICES FOR ELs AND THEIR FAMILIES (CONTINUED)",null,null,null,null,null,null,null,null,null,null,null,null,null,null,null,"E.  PROGRAMS AND SERVICES FOR ELs AND THEIR FAMILIES (CONTINUED)",null,null,null,null,null,null,null,null,null,null,null,null,null,null,null,"E.  PROGRAMS AND SERVICES FOR ELs AND THEIR FAMILIES (CONTINUED)",null,null,null,null,null,null,null,null,null,null,null,null,null,null,null,"E.  PROGRAMS AND SERVICES FOR ELs AND THEIR FAMILIES (CONTINUED)",null,null,null,null,null,null,null,null,null,null,null,null,null,null,null,"E.  PROGRAMS AND SERVICES FOR ELs AND THEIR FAMILIES (CONTINUED)",null,null,null,null,null,null,null,null,null,null,null,null,null,null,null,"E.  PROGRAMS AND SERVICES FOR ELs AND THEIR FAMILIES (CONTINUED)",null,null,null,null,null,null,null,null,null,null,null,null,null,null,null,"E.  PROGRAMS AND SERVICES FOR ELs AND THEIR FAMILIES (CONTINUED)",null,null,null,null,null,null,null,null,null,null,null,null,null,null,null,"E.  PROGRAMS AND SERVICES FOR ELs AND THEIR FAMILIES (CONTINUED)",null,null,null,null,null,null,null,null,null,null,null,null,null,null,null,"E.  PROGRAMS AND SERVICES FOR ELs AND THEIR FAMILIES (CONTINUED)",null,null,null,null,null,null,null,null,null,null,null,null,null,null,null,"E.  PROGRAMS AND SERVICES FOR ELs AND THEIR FAMILIES (CONTINUED)",null,null,null,null,null,null,null,null,null,null,null,null,null,null,null,"E.  PROGRAMS AND SERVICES FOR ELs AND THEIR FAMILIES (CONTINUED)",null,null,null,null,null,null,null,null,null,null,null,null,null,null,null,"E.  PROGRAMS AND SERVICES FOR ELs AND THEIR FAMILIES (CONTINUED)",null,null,null,null,null,null,null,null,null,null,null,null,null,null,null,"E.  PROGRAMS AND SERVICES FOR ELs AND THEIR FAMILIES (CONTINUED)",null,null,null,null,null,null,null,null,null,null,null,null,null,null,null,"E.  PROGRAMS AND SERVICES FOR ELs AND THEIR FAMILIES (CONTINUED)",null,null,null,null,null,null,null,null,null,null,null,null,null,null,null,"E.  PROGRAMS AND SERVICES FOR ELs AND THEIR FAMILIES (CONTINUED)",null,null,null,null,null,null,null,null,null,null,null,null,null,null,null,"E.  PROGRAMS AND SERVICES FOR ELs AND THEIR FAMILIES (CONTINUED)",null,null,null,null,null,null,null,null,null,null,null,null,null,null,null,"E.  PROGRAMS AND SERVICES FOR ELs AND THEIR FAMILIES (CONTINUED)",null,null,null,null,null,null,null,null,null,null,null,null,null,null,null,"E.  PROGRAMS AND SERVICES FOR ELs AND THEIR FAMILIES (CONTINUED)",null,null,null,null,null,null,null,null,null,null,null,null,null,null,null,"E.  PROGRAMS AND SERVICES FOR ELs AND THEIR FAMILIES (CONTINUED)",null,null,null,null,null,null,null,null,null,null,null,null,null,null,null,"E.  PROGRAMS AND SERVICES FOR ELs AND THEIR FAMILIES (CONTINUED)",null,null,null,null,null,null,null,null,null,null,null,null,null,null,null,"E.  PROGRAMS AND SERVICES FOR ELs AND THEIR FAMILIES (CONTINUED)",null,null,null,null,null,null,null,null,null,null,null,null,null,null,null,"E.  PROGRAMS AND SERVICES FOR ELs AND THEIR FAMILIES (CONTINUED)",null,null,null,null,null,null,null,null,null,null,null,null,null,null,null,"E.  PROGRAMS AND SERVICES FOR ELs AND THEIR FAMILIES (CONTINUED)",null,null,null,null,null,null,null,null,null,null,null,null,null,null,null,"E.  PROGRAMS AND SERVICES FOR ELs AND THEIR FAMILIES (CONTINUED)",null,null,null,null,null,null,null,null,null,null,null,null,null,null,null,"E.  PROGRAMS AND SERVICES FOR ELs AND THEIR FAMILIES (CONTINUED)",null,null,null,null,null,null,null,null,null,null,null,null,null,null,null,"E.  PROGRAMS AND SERVICES FOR ELs AND THEIR FAMILIES (CONTINUED)",null,null,null,null,null,null,null,null,null,null,null,null,null,null,null,"E.  PROGRAMS AND SERVICES FOR ELs AND THEIR FAMILIES (CONTINUED)",null,null,null,null,null,null,null,null,null,null,null,null,null,null,null,"E.  PROGRAMS AND SERVICES FOR ELs AND THEIR FAMILIES (CONTINUED)",null,null,null,null,null,null,null,null,null,null,null,null,null,null,null,"E.  PROGRAMS AND SERVICES FOR ELs AND THEIR FAMILIES (CONTINUED)",null,null,null,null,null,null,null,null,null,null,null,null,null,null,null,"E.  PROGRAMS AND SERVICES FOR ELs AND THEIR FAMILIES (CONTINUED)",null,null,null,null,null,null,null,null,null,null,null,null,null,null,null,"E.  PROGRAMS AND SERVICES FOR ELs AND THEIR FAMILIES (CONTINUED)",null,null,null,null,null,null,null,null,null,null,null,null,null,null,null,"E.  PROGRAMS AND SERVICES FOR ELs AND THEIR FAMILIES (CONTINUED)",null,null,null,null,null,null,null,null,null,null,null,null,null,null,null,"E.  PROGRAMS AND SERVICES FOR ELs AND THEIR FAMILIES (CONTINUED)",null,null,null,null,null,null,null,null,null,null,null,null,null,null,null,"E.  PROGRAMS AND SERVICES FOR ELs AND THEIR FAMILIES (CONTINUED)",null,null,null,null,null,null,null,null,null,null,null,null,null,null,null,"E.  PROGRAMS AND SERVICES FOR ELs AND THEIR FAMILIES (CONTINUED)",null,null,null,null,null,null,null,null,null,null,null,null,null,null,null,"E.  PROGRAMS AND SERVICES FOR ELs AND THEIR FAMILIES (CONTINUED)",null,null,null,null,null,null,null,null,null,null,null,null,null,null,null,"E.  PROGRAMS AND SERVICES FOR ELs AND THEIR FAMILIES (CONTINUED)",null,null,null,null,null,null,null,null,null,null,null,null,null,null,null,"E.  PROGRAMS AND SERVICES FOR ELs AND THEIR FAMILIES (CONTINUED)",null,null,null,null,null,null,null,null,null,null,null,null,null,null,null,"E.  PROGRAMS AND SERVICES FOR ELs AND THEIR FAMILIES (CONTINUED)",null,null,null,null,null,null,null,null,null,null,null,null,null,null,null,"E.  PROGRAMS AND SERVICES FOR ELs AND THEIR FAMILIES (CONTINUED)",null,null,null,null,null,null,null,null,null,null,null,null,null,null,null,"E.  PROGRAMS AND SERVICES FOR ELs AND THEIR FAMILIES (CONTINUED)",null,null,null,null,null,null,null,null,null,null,null,null,null,null,null,"E.  PROGRAMS AND SERVICES FOR ELs AND THEIR FAMILIES (CONTINUED)",null,null,null,null,null,null,null,null,null,null,null,null,null,null,null,"E.  PROGRAMS AND SERVICES FOR ELs AND THEIR FAMILIES (CONTINUED)",null,null,null,null,null,null,null,null,null,null,null,null,null,null,null,"E.  PROGRAMS AND SERVICES FOR ELs AND THEIR FAMILIES (CONTINUED)",null,null,null,null,null,null,null,null,null,null,null,null,null,null,null,"E.  PROGRAMS AND SERVICES FOR ELs AND THEIR FAMILIES (CONTINUED)",null,null,null,null,null,null,null,null,null,null,null,null,null,null,null,"E.  PROGRAMS AND SERVICES FOR ELs AND THEIR FAMILIES (CONTINUED)",null,null,null,null,null,null,null,null,null,null,null,null,null,null,null,"E.  PROGRAMS AND SERVICES FOR ELs AND THEIR FAMILIES (CONTINUED)",null,null,null,null,null,null,null,null,null,null,null,null,null,null,null,"E.  PROGRAMS AND SERVICES FOR ELs AND THEIR FAMILIES (CONTINUED)",null,null,null,null,null,null,null,null,null,null,null,null,null,null,null,"E.  PROGRAMS AND SERVICES FOR ELs AND THEIR FAMILIES (CONTINUED)",null,null,null,null,null,null,null,null,null,null,null,null,null,null,null,"E.  PROGRAMS AND SERVICES FOR ELs AND THEIR FAMILIES (CONTINUED)",null,null,null,null,null,null,null,null,null,null,null,null,null,null,null,"E.  PROGRAMS AND SERVICES FOR ELs AND THEIR FAMILIES (CONTINUED)",null,null,null,null,null,null,null,null,null,null,null,null,null,null,null,"E.  PROGRAMS AND SERVICES FOR ELs AND THEIR FAMILIES (CONTINUED)",null,null,null,null,null,null,null,null,null,null,null,null,null,null,null,"E.  PROGRAMS AND SERVICES FOR ELs AND THEIR FAMILIES (CONTINUED)",null,null,null,null,null,null,null,null,null,null,null,null,null,null,null,"E.  PROGRAMS AND SERVICES FOR ELs AND THEIR FAMILIES (CONTINUED)",null,null,null,null,null,null,null,null,null,null,null,null,null,null,null,"E.  PROGRAMS AND SERVICES FOR ELs AND THEIR FAMILIES (CONTINUED)",null,null,null,null,null,null,null,null,null,null,null,null,null,null,null,"E.  PROGRAMS AND SERVICES FOR ELs AND THEIR FAMILIES (CONTINUED)",null,null,null,null,null,null,null,null,null,null,null,null,null,null,null,"E.  PROGRAMS AND SERVICES FOR ELs AND THEIR FAMILIES (CONTINUED)",null,null,null,null,null,null,null,null,null,null,null,null,null,null,null,"E.  PROGRAMS AND SERVICES FOR ELs AND THEIR FAMILIES (CONTINUED)",null,null,null,null,null,null,null,null,null,null,null,null,null,null,null,"E.  PROGRAMS AND SERVICES FOR ELs AND THEIR FAMILIES (CONTINUED)",null,null,null,null,null,null,null,null,null,null,null,null,null,null,null,"E.  PROGRAMS AND SERVICES FOR ELs AND THEIR FAMILIES (CONTINUED)",null,null,null,null,null,null,null,null,null,null,null,null,null,null,null,"E.  PROGRAMS AND SERVICES FOR ELs AND THEIR FAMILIES (CONTINUED)",null,null,null,null,null,null,null,null,null,null,null,null,null,null,null,"E.  PROGRAMS AND SERVICES FOR ELs AND THEIR FAMILIES (CONTINUED)",null,null,null,null,null,null,null,null,null,null,null,null,null,null,null,"E.  PROGRAMS AND SERVICES FOR ELs AND THEIR FAMILIES (CONTINUED)",null,null,null,null,null,null,null,null,null,null,null,null,null,null,null,"E.  PROGRAMS AND SERVICES FOR ELs AND THEIR FAMILIES (CONTINUED)",null,null,null,null,null,null,null,null,null,null,null,null,null,null,null,"E.  PROGRAMS AND SERVICES FOR ELs AND THEIR FAMILIES (CONTINUED)",null,null,null,null,null,null,null,null,null,null,null,null,null,null,null,"E.  PROGRAMS AND SERVICES FOR ELs AND THEIR FAMILIES (CONTINUED)",null,null,null,null,null,null,null,null,null,null,null,null,null,null,null,"E.  PROGRAMS AND SERVICES FOR ELs AND THEIR FAMILIES (CONTINUED)",null,null,null,null,null,null,null,null,null,null,null,null,null,null,null,"E.  PROGRAMS AND SERVICES FOR ELs AND THEIR FAMILIES (CONTINUED)",null,null,null,null,null,null,null,null,null,null,null,null,null,null,null,"E.  PROGRAMS AND SERVICES FOR ELs AND THEIR FAMILIES (CONTINUED)",null,null,null,null,null,null,null,null,null,null,null,null,null,null,null,"E.  PROGRAMS AND SERVICES FOR ELs AND THEIR FAMILIES (CONTINUED)",null,null,null,null,null,null,null,null,null,null,null,null,null,null,null,"E.  PROGRAMS AND SERVICES FOR ELs AND THEIR FAMILIES (CONTINUED)",null,null,null,null,null,null,null,null,null,null,null,null,null,null,null,"E.  PROGRAMS AND SERVICES FOR ELs AND THEIR FAMILIES (CONTINUED)",null,null,null,null,null,null,null,null,null,null,null,null,null,null,null,"E.  PROGRAMS AND SERVICES FOR ELs AND THEIR FAMILIES (CONTINUED)",null,null,null,null,null,null,null,null,null,null,null,null,null,null,null,"E.  PROGRAMS AND SERVICES FOR ELs AND THEIR FAMILIES (CONTINUED)",null,null,null,null,null,null,null,null,null,null,null,null,null,null,null,"E.  PROGRAMS AND SERVICES FOR ELs AND THEIR FAMILIES (CONTINUED)",null,null,null,null,null,null,null,null,null,null,null,null,null,null,null,"E.  PROGRAMS AND SERVICES FOR ELs AND THEIR FAMILIES (CONTINUED)",null,null,null,null,null,null,null,null,null,null,null,null,null,null,null,"E.  PROGRAMS AND SERVICES FOR ELs AND THEIR FAMILIES (CONTINUED)",null,null,null,null,null,null,null,null,null,null,null,null,null,null,null,"E.  PROGRAMS AND SERVICES FOR ELs AND THEIR FAMILIES (CONTINUED)",null,null,null,null,null,null,null,null,null,null,null,null,null,null,null,"E.  PROGRAMS AND SERVICES FOR ELs AND THEIR FAMILIES (CONTINUED)",null,null,null,null,null,null,null,null,null,null,null,null,null,null,null,"E.  PROGRAMS AND SERVICES FOR ELs AND THEIR FAMILIES (CONTINUED)",null,null,null,null,null,null,null,null,null,null,null,null,null,null,null,"E.  PROGRAMS AND SERVICES FOR ELs AND THEIR FAMILIES (CONTINUED)",null,null,null,null,null,null,null,null,null,null,null,null,null,null,null,"E.  PROGRAMS AND SERVICES FOR ELs AND THEIR FAMILIES (CONTINUED)",null,null,null,null,null,null,null,null,null,null,null,null,null,null,null,"E.  PROGRAMS AND SERVICES FOR ELs AND THEIR FAMILIES (CONTINUED)",null,null,null,null,null,null,null,null,null,null,null,null,null,null,null,"E.  PROGRAMS AND SERVICES FOR ELs AND THEIR FAMILIES (CONTINUED)",null,null,null,null,null,null,null,null,null,null,null,null,null,null,null,"E.  PROGRAMS AND SERVICES FOR ELs AND THEIR FAMILIES (CONTINUED)",null,null,null,null,null,null,null,null,null,null,null,null,null,null,null,"E.  PROGRAMS AND SERVICES FOR ELs AND THEIR FAMILIES (CONTINUED)",null,null,null,null,null,null,null,null,null,null,null,null,null,null,null,"E.  PROGRAMS AND SERVICES FOR ELs AND THEIR FAMILIES (CONTINUED)",null,null,null,null,null,null,null,null,null,null,null,null,null,null,null,"E.  PROGRAMS AND SERVICES FOR ELs AND THEIR FAMILIES (CONTINUED)",null,null,null,null,null,null,null,null,null,null,null,null,null,null,null,"E.  PROGRAMS AND SERVICES FOR ELs AND THEIR FAMILIES (CONTINUED)",null,null,null,null,null,null,null,null,null,null,null,null,null,null,null,"E.  PROGRAMS AND SERVICES FOR ELs AND THEIR FAMILIES (CONTINUED)",null,null,null,null,null,null,null,null,null,null,null,null,null,null,null,"E.  PROGRAMS AND SERVICES FOR ELs AND THEIR FAMILIES (CONTINUED)",null,null,null,null,null,null,null,null,null,null,null,null,null,null,null,"E.  PROGRAMS AND SERVICES FOR ELs AND THEIR FAMILIES (CONTINUED)",null,null,null,null,null,null,null,null,null,null,null,null,null,null,null,"E.  PROGRAMS AND SERVICES FOR ELs AND THEIR FAMILIES (CONTINUED)",null,null,null,null,null,null,null,null,null,null,null,null,null,null,null,"E.  PROGRAMS AND SERVICES FOR ELs AND THEIR FAMILIES (CONTINUED)",null,null,null,null,null,null,null,null,null,null,null,null,null,null,null,"E.  PROGRAMS AND SERVICES FOR ELs AND THEIR FAMILIES (CONTINUED)",null,null,null,null,null,null,null,null,null,null,null,null,null,null,null,"E.  PROGRAMS AND SERVICES FOR ELs AND THEIR FAMILIES (CONTINUED)",null,null,null,null,null,null,null,null,null,null,null,null,null,null,null,"E.  PROGRAMS AND SERVICES FOR ELs AND THEIR FAMILIES (CONTINUED)",null,null,null,null,null,null,null,null,null,null,null,null,null,null,null,"E.  PROGRAMS AND SERVICES FOR ELs AND THEIR FAMILIES (CONTINUED)",null,null,null,null,null,null,null,null,null,null,null,null,null,null,null,"E.  PROGRAMS AND SERVICES FOR ELs AND THEIR FAMILIES (CONTINUED)",null,null,null,null,null,null,null,null,null,null,null,null,null,null,null,"E.  PROGRAMS AND SERVICES FOR ELs AND THEIR FAMILIES (CONTINUED)",null,null,null,null,null,null,null,null,null,null,null,null,null,null,null,"E.  PROGRAMS AND SERVICES FOR ELs AND THEIR FAMILIES (CONTINUED)",null,null,null,null,null,null,null,null,null,null,null,null,null,null,null,"E.  PROGRAMS AND SERVICES FOR ELs AND THEIR FAMILIES (CONTINUED)",null,null,null,null,null,null,null,null,null,null,null,null,null,null,null,"E.  PROGRAMS AND SERVICES FOR ELs AND THEIR FAMILIES (CONTINUED)",null,null,null,null,null,null,null,null,null,null,null,null,null,null,null,"E.  PROGRAMS AND SERVICES FOR ELs AND THEIR FAMILIES (CONTINUED)",null,null,null,null,null,null,null,null,null,null,null,null,null,null,null,"E.  PROGRAMS AND SERVICES FOR ELs AND THEIR FAMILIES (CONTINUED)",null,null,null,null,null,null,null,null,null,null,null,null,null,null,null,"E.  PROGRAMS AND SERVICES FOR ELs AND THEIR FAMILIES (CONTINUED)",null,null,null,null,null,null,null,null,null,null,null,null,null,null,null,"E.  PROGRAMS AND SERVICES FOR ELs AND THEIR FAMILIES (CONTINUED)",null,null,null,null,null,null,null,null,null,null,null,null,null,null,null,"E.  PROGRAMS AND SERVICES FOR ELs AND THEIR FAMILIES (CONTINUED)",null,null,null,null,null,null,null,null,null,null,null,null,null,null,null,"E.  PROGRAMS AND SERVICES FOR ELs AND THEIR FAMILIES (CONTINUED)",null,null,null,null,null,null,null,null,null,null,null,null,null,null,null,"E.  PROGRAMS AND SERVICES FOR ELs AND THEIR FAMILIES (CONTINUED)",null,null,null,null,null,null,null,null,null,null,null,null,null,null,null,"E.  PROGRAMS AND SERVICES FOR ELs AND THEIR FAMILIES (CONTINUED)",null,null,null,null,null,null,null,null,null,null,null,null,null,null,null,"E.  PROGRAMS AND SERVICES FOR ELs AND THEIR FAMILIES (CONTINUED)",null,null,null,null,null,null,null,null,null,null,null,null,null,null,null,"E.  PROGRAMS AND SERVICES FOR ELs AND THEIR FAMILIES (CONTINUED)",null,null,null,null,null,null,null,null,null,null,null,null,null,null,null,"E.  PROGRAMS AND SERVICES FOR ELs AND THEIR FAMILIES (CONTINUED)",null,null,null,null,null,null,null,null,null,null,null,null,null,null,null,"E.  PROGRAMS AND SERVICES FOR ELs AND THEIR FAMILIES (CONTINUED)",null,null,null,null,null,null,null,null,null,null,null,null,null,null,null,"E.  PROGRAMS AND SERVICES FOR ELs AND THEIR FAMILIES (CONTINUED)",null,null,null,null,null,null,null,null,null,null,null,null,null,null,null,"E.  PROGRAMS AND SERVICES FOR ELs AND THEIR FAMILIES (CONTINUED)",null,null,null,null,null,null,null,null,null,null,null,null,null,null,null,"E.  PROGRAMS AND SERVICES FOR ELs AND THEIR FAMILIES (CONTINUED)",null,null,null,null,null,null,null,null,null,null,null,null,null,null,null,"E.  PROGRAMS AND SERVICES FOR ELs AND THEIR FAMILIES (CONTINUED)",null,null,null,null,null,null,null,null,null,null,null,null,null,null,null,"E.  PROGRAMS AND SERVICES FOR ELs AND THEIR FAMILIES (CONTINUED)",null,null,null,null,null,null,null,null,null,null,null,null,null,null,null,"E.  PROGRAMS AND SERVICES FOR ELs AND THEIR FAMILIES (CONTINUED)",null,null,null,null,null,null,null,null,null,null,null,null,null,null,null,"E.  PROGRAMS AND SERVICES FOR ELs AND THEIR FAMILIES (CONTINUED)",null,null,null,null,null,null,null,null,null,null,null,null,null,null,null,"E.  PROGRAMS AND SERVICES FOR ELs AND THEIR FAMILIES (CONTINUED)",null,null,null,null,null,null,null,null,null,null,null,null,null,null,null,"E.  PROGRAMS AND SERVICES FOR ELs AND THEIR FAMILIES (CONTINUED)",null,null,null,null,null,null,null,null,null,null,null,null,null,null,null,"E.  PROGRAMS AND SERVICES FOR ELs AND THEIR FAMILIES (CONTINUED)",null,null,null,null,null,null,null,null,null,null,null,null,null,null,null,"E.  PROGRAMS AND SERVICES FOR ELs AND THEIR FAMILIES (CONTINUED)",null,null,null,null,null,null,null,null,null,null,null,null,null,null,null,"E.  PROGRAMS AND SERVICES FOR ELs AND THEIR FAMILIES (CONTINUED)",null,null,null,null,null,null,null,null,null,null,null,null,null,null,null,"E.  PROGRAMS AND SERVICES FOR ELs AND THEIR FAMILIES (CONTINUED)",null,null,null,null,null,null,null,null,null,null,null,null,null,null,null,"E.  PROGRAMS AND SERVICES FOR ELs AND THEIR FAMILIES (CONTINUED)",null,null,null,null,null,null,null,null,null,null,null,null,null,null,null,"E.  PROGRAMS AND SERVICES FOR ELs AND THEIR FAMILIES (CONTINUED)",null,null,null,null,null,null,null,null,null,null,null,null,null,null,null,"E.  PROGRAMS AND SERVICES FOR ELs AND THEIR FAMILIES (CONTINUED)",null,null,null,null,null,null,null,null,null,null,null,null,null,null,null,"E.  PROGRAMS AND SERVICES FOR ELs AND THEIR FAMILIES (CONTINUED)",null,null,null,null,null,null,null,null,null,null,null,null,null,null,null,"E.  PROGRAMS AND SERVICES FOR ELs AND THEIR FAMILIES (CONTINUED)",null,null,null,null,null,null,null,null,null,null,null,null,null,null,null,"E.  PROGRAMS AND SERVICES FOR ELs AND THEIR FAMILIES (CONTINUED)",null,null,null,null,null,null,null,null,null,null,null,null,null,null,null,"E.  PROGRAMS AND SERVICES FOR ELs AND THEIR FAMILIES (CONTINUED)",null,null,null,null,null,null,null,null,null,null,null,null,null,null,null,"E.  PROGRAMS AND SERVICES FOR ELs AND THEIR FAMILIES (CONTINUED)",null,null,null,null,null,null,null,null,null,null,null,null,null,null,null,"E.  PROGRAMS AND SERVICES FOR ELs AND THEIR FAMILIES (CONTINUED)",null,null,null,null,null,null,null,null,null,null,null,null,null,null,null,"E.  PROGRAMS AND SERVICES FOR ELs AND THEIR FAMILIES (CONTINUED)",null,null,null,null,null,null,null,null,null,null,null,null,null,null,null,"E.  PROGRAMS AND SERVICES FOR ELs AND THEIR FAMILIES (CONTINUED)",null,null,null,null,null,null,null,null,null,null,null,null,null,null,null,"E.  PROGRAMS AND SERVICES FOR ELs AND THEIR FAMILIES (CONTINUED)",null,null,null,null,null,null,null,null,null,null,null,null,null,null,null,"E.  PROGRAMS AND SERVICES FOR ELs AND THEIR FAMILIES (CONTINUED)",null,null,null,null,null,null,null,null,null,null,null,null,null,null,null,"E.  PROGRAMS AND SERVICES FOR ELs AND THEIR FAMILIES (CONTINUED)",null,null,null,null,null,null,null,null,null,null,null,null,null,null,null,"E.  PROGRAMS AND SERVICES FOR ELs AND THEIR FAMILIES (CONTINUED)",null,null,null,null,null,null,null,null,null,null,null,null,null,null,null,"E.  PROGRAMS AND SERVICES FOR ELs AND THEIR FAMILIES (CONTINUED)",null,null,null,null,null,null,null,null,null,null,null,null,null,null,null,"E.  PROGRAMS AND SERVICES FOR ELs AND THEIR FAMILIES (CONTINUED)",null,null,null,null,null,null,null,null,null,null,null,null,null,null,null,"E.  PROGRAMS AND SERVICES FOR ELs AND THEIR FAMILIES (CONTINUED)",null,null,null,null,null,null,null,null,null,null,null,null,null,null,null,"E.  PROGRAMS AND SERVICES FOR ELs AND THEIR FAMILIES (CONTINUED)",null,null,null,null,null,null,null,null,null,null,null,null,null,null,null,"E.  PROGRAMS AND SERVICES FOR ELs AND THEIR FAMILIES (CONTINUED)",null,null,null,null,null,null,null,null,null,null,null,null,null,null,null,"E.  PROGRAMS AND SERVICES FOR ELs AND THEIR FAMILIES (CONTINUED)",null,null,null,null,null,null,null,null,null,null,null,null,null,null,null,"E.  PROGRAMS AND SERVICES FOR ELs AND THEIR FAMILIES (CONTINUED)",null,null,null,null,null,null,null,null,null,null,null,null,null,null,null,"E.  PROGRAMS AND SERVICES FOR ELs AND THEIR FAMILIES (CONTINUED)",null,null,null,null,null,null,null,null,null,null,null,null,null,null,null,"E.  PROGRAMS AND SERVICES FOR ELs AND THEIR FAMILIES (CONTINUED)",null,null,null,null,null,null,null,null,null,null,null,null,null,null,null,"E.  PROGRAMS AND SERVICES FOR ELs AND THEIR FAMILIES (CONTINUED)",null,null,null,null,null,null,null,null,null,null,null,null,null,null,null,"E.  PROGRAMS AND SERVICES FOR ELs AND THEIR FAMILIES (CONTINUED)",null,null,null,null,null,null,null,null,null,null,null,null,null,null,null,"E.  PROGRAMS AND SERVICES FOR ELs AND THEIR FAMILIES (CONTINUED)",null,null,null,null,null,null,null,null,null,null,null,null,null,null,null,"E.  PROGRAMS AND SERVICES FOR ELs AND THEIR FAMILIES (CONTINUED)",null,null,null,null,null,null,null,null,null,null,null,null,null,null,null,"E.  PROGRAMS AND SERVICES FOR ELs AND THEIR FAMILIES (CONTINUED)",null,null,null,null,null,null,null,null,null,null,null,null,null,null,null,"E.  PROGRAMS AND SERVICES FOR ELs AND THEIR FAMILIES (CONTINUED)",null,null,null,null,null,null,null,null,null,null,null,null,null,null,null,"E.  PROGRAMS AND SERVICES FOR ELs AND THEIR FAMILIES (CONTINUED)",null,null,null,null,null,null,null,null,null,null,null,null,null,null,null,"E.  PROGRAMS AND SERVICES FOR ELs AND THEIR FAMILIES (CONTINUED)",null,null,null,null,null,null,null,null,null,null,null,null,null,null,null,"E.  PROGRAMS AND SERVICES FOR ELs AND THEIR FAMILIES (CONTINUED)",null,null,null,null,null,null,null,null,null,null,null,null,null,null,null,"E.  PROGRAMS AND SERVICES FOR ELs AND THEIR FAMILIES (CONTINUED)",null,null,null,null,null,null,null,null,null,null,null,null,null,null,null,"E.  PROGRAMS AND SERVICES FOR ELs AND THEIR FAMILIES (CONTINUED)",null,null,null,null,null,null,null,null,null,null,null,null,null,null,null,"E.  PROGRAMS AND SERVICES FOR ELs AND THEIR FAMILIES (CONTINUED)",null,null,null,null,null,null,null,null,null,null,null,null,null,null,null,"E.  PROGRAMS AND SERVICES FOR ELs AND THEIR FAMILIES (CONTINUED)",null,null,null,null,null,null,null,null,null,null,null,null,null,null,null,"E.  PROGRAMS AND SERVICES FOR ELs AND THEIR FAMILIES (CONTINUED)",null,null,null,null,null,null,null,null,null,null,null,null,null,null,null,"E.  PROGRAMS AND SERVICES FOR ELs AND THEIR FAMILIES (CONTINUED)",null,null,null,null,null,null,null,null,null,null,null,null,null,null,null,"E.  PROGRAMS AND SERVICES FOR ELs AND THEIR FAMILIES (CONTINUED)",null,null,null,null,null,null,null,null,null,null,null,null,null,null,null,"E.  PROGRAMS AND SERVICES FOR ELs AND THEIR FAMILIES (CONTINUED)",null,null,null,null,null,null,null,null,null,null,null,null,null,null,null,"E.  PROGRAMS AND SERVICES FOR ELs AND THEIR FAMILIES (CONTINUED)",null,null,null,null,null,null,null,null,null,null,null,null,null,null,null,"E.  PROGRAMS AND SERVICES FOR ELs AND THEIR FAMILIES (CONTINUED)",null,null,null,null,null,null,null,null,null,null,null,null,null,null,null,"E.  PROGRAMS AND SERVICES FOR ELs AND THEIR FAMILIES (CONTINUED)",null,null,null,null,null,null,null,null,null,null,null,null,null,null,null,"E.  PROGRAMS AND SERVICES FOR ELs AND THEIR FAMILIES (CONTINUED)",null,null,null,null,null,null,null,null,null,null,null,null,null,null,null,"E.  PROGRAMS AND SERVICES FOR ELs AND THEIR FAMILIES (CONTINUED)",null,null,null,null,null,null,null,null,null,null,null,null,null,null,null,"E.  PROGRAMS AND SERVICES FOR ELs AND THEIR FAMILIES (CONTINUED)",null,null,null,null,null,null,null,null,null,null,null,null,null,null,null,"E.  PROGRAMS AND SERVICES FOR ELs AND THEIR FAMILIES (CONTINUED)",null,null,null,null,null,null,null,null,null,null,null,null,null,null,null,"E.  PROGRAMS AND SERVICES FOR ELs AND THEIR FAMILIES (CONTINUED)",null,null,null,null,null,null,null,null,null,null,null,null,null,null,null,"E.  PROGRAMS AND SERVICES FOR ELs AND THEIR FAMILIES (CONTINUED)",null,null,null,null,null,null,null,null,null,null,null,null,null,null,null,"E.  PROGRAMS AND SERVICES FOR ELs AND THEIR FAMILIES (CONTINUED)",null,null,null,null,null,null,null,null,null,null,null,null,null,null,null,"E.  PROGRAMS AND SERVICES FOR ELs AND THEIR FAMILIES (CONTINUED)",null,null,null,null,null,null,null,null,null,null,null,null,null,null,null,"E.  PROGRAMS AND SERVICES FOR ELs AND THEIR FAMILIES (CONTINUED)",null,null,null,null,null,null,null,null,null,null,null,null,null,null,null,"E.  PROGRAMS AND SERVICES FOR ELs AND THEIR FAMILIES (CONTINUED)",null,null,null,null,null,null,null,null,null,null,null,null,null,null,null,"E.  PROGRAMS AND SERVICES FOR ELs AND THEIR FAMILIES (CONTINUED)",null,null,null,null,null,null,null,null,null,null,null,null,null,null,null,"E.  PROGRAMS AND SERVICES FOR ELs AND THEIR FAMILIES (CONTINUED)",null,null,null,null,null,null,null,null,null,null,null,null,null,null,null,"E.  PROGRAMS AND SERVICES FOR ELs AND THEIR FAMILIES (CONTINUED)",null,null,null,null,null,null,null,null,null,null,null,null,null,null,null,"E.  PROGRAMS AND SERVICES FOR ELs AND THEIR FAMILIES (CONTINUED)",null,null,null,null,null,null,null,null,null,null,null,null,null,null,null,"E.  PROGRAMS AND SERVICES FOR ELs AND THEIR FAMILIES (CONTINUED)",null,null,null,null,null,null,null,null,null,null,null,null,null,null,null,"E.  PROGRAMS AND SERVICES FOR ELs AND THEIR FAMILIES (CONTINUED)",null,null,null,null,null,null,null,null,null,null,null,null,null,null,null,"E.  PROGRAMS AND SERVICES FOR ELs AND THEIR FAMILIES (CONTINUED)",null,null,null,null,null,null,null,null,null,null,null,null,null,null,null,"E.  PROGRAMS AND SERVICES FOR ELs AND THEIR FAMILIES (CONTINUED)",null,null,null,null,null,null,null,null,null,null,null,null,null,null,null,"E.  PROGRAMS AND SERVICES FOR ELs AND THEIR FAMILIES (CONTINUED)",null,null,null,null,null,null,null,null,null,null,null,null,null,null,null,"E.  PROGRAMS AND SERVICES FOR ELs AND THEIR FAMILIES (CONTINUED)",null,null,null,null,null,null,null,null,null,null,null,null,null,null,null,"E.  PROGRAMS AND SERVICES FOR ELs AND THEIR FAMILIES (CONTINUED)",null,null,null,null,null,null,null,null,null,null,null,null,null,null,null,"E.  PROGRAMS AND SERVICES FOR ELs AND THEIR FAMILIES (CONTINUED)",null,null,null,null,null,null,null,null,null,null,null,null,null,null,null,"E.  PROGRAMS AND SERVICES FOR ELs AND THEIR FAMILIES (CONTINUED)",null,null,null,null,null,null,null,null,null,null,null,null,null,null,null,"E.  PROGRAMS AND SERVICES FOR ELs AND THEIR FAMILIES (CONTINUED)",null,null,null,null,null,null,null,null,null,null,null,null,null,null,null,"E.  PROGRAMS AND SERVICES FOR ELs AND THEIR FAMILIES (CONTINUED)",null,null,null,null,null,null,null,null,null,null,null,null,null,null,null,"E.  PROGRAMS AND SERVICES FOR ELs AND THEIR FAMILIES (CONTINUED)",null,null,null,null,null,null,null,null,null,null,null,null,null,null,null,"E.  PROGRAMS AND SERVICES FOR ELs AND THEIR FAMILIES (CONTINUED)",null,null,null,null,null,null,null,null,null,null,null,null,null,null,null,"E.  PROGRAMS AND SERVICES FOR ELs AND THEIR FAMILIES (CONTINUED)",null,null,null,null,null,null,null,null,null,null,null,null,null,null,null,"E.  PROGRAMS AND SERVICES FOR ELs AND THEIR FAMILIES (CONTINUED)",null,null,null,null,null,null,null,null,null,null,null,null,null,null,null,"E.  PROGRAMS AND SERVICES FOR ELs AND THEIR FAMILIES (CONTINUED)",null,null,null,null,null,null,null,null,null,null,null,null,null,null,null,"E.  PROGRAMS AND SERVICES FOR ELs AND THEIR FAMILIES (CONTINUED)",null,null,null,null,null,null,null,null,null,null,null,null,null,null,null,"E.  PROGRAMS AND SERVICES FOR ELs AND THEIR FAMILIES (CONTINUED)",null,null,null,null,null,null,null,null,null,null,null,null,null,null,null,"E.  PROGRAMS AND SERVICES FOR ELs AND THEIR FAMILIES (CONTINUED)",null,null,null,null,null,null,null,null,null,null,null,null,null,null,null,"E.  PROGRAMS AND SERVICES FOR ELs AND THEIR FAMILIES (CONTINUED)",null,null,null,null,null,null,null,null,null,null,null,null,null,null,null,"E.  PROGRAMS AND SERVICES FOR ELs AND THEIR FAMILIES (CONTINUED)",null,null,null,null,null,null,null,null,null,null,null,null,null,null,null,"E.  PROGRAMS AND SERVICES FOR ELs AND THEIR FAMILIES (CONTINUED)",null,null,null,null,null,null,null,null,null,null,null,null,null,null,null,"E.  PROGRAMS AND SERVICES FOR ELs AND THEIR FAMILIES (CONTINUED)",null,null,null,null,null,null,null,null,null,null,null,null,null,null,null,"E.  PROGRAMS AND SERVICES FOR ELs AND THEIR FAMILIES (CONTINUED)",null,null,null,null,null,null,null,null,null,null,null,null,null,null,null,"E.  PROGRAMS AND SERVICES FOR ELs AND THEIR FAMILIES (CONTINUED)",null,null,null,null,null,null,null,null,null,null,null,null,null,null,null,"E.  PROGRAMS AND SERVICES FOR ELs AND THEIR FAMILIES (CONTINUED)",null,null,null,null,null,null,null,null,null,null,null,null,null,null,null,"E.  PROGRAMS AND SERVICES FOR ELs AND THEIR FAMILIES (CONTINUED)",null,null,null,null,null,null,null,null,null,null,null,null,null,null,null,"E.  PROGRAMS AND SERVICES FOR ELs AND THEIR FAMILIES (CONTINUED)",null,null,null,null,null,null,null,null,null,null,null,null,null,null,null,"E.  PROGRAMS AND SERVICES FOR ELs AND THEIR FAMILIES (CONTINUED)",null,null,null,null,null,null,null,null,null,null,null,null,null,null,null,"E.  PROGRAMS AND SERVICES FOR ELs AND THEIR FAMILIES (CONTINUED)",null,null,null,null,null,null,null,null,null,null,null,null,null,null,null,"E.  PROGRAMS AND SERVICES FOR ELs AND THEIR FAMILIES (CONTINUED)",null,null,null,null,null,null,null,null,null,null,null,null,null,null,null,"E.  PROGRAMS AND SERVICES FOR ELs AND THEIR FAMILIES (CONTINUED)",null,null,null,null,null,null,null,null,null,null,null,null,null,null,null,"E.  PROGRAMS AND SERVICES FOR ELs AND THEIR FAMILIES (CONTINUED)",null,null,null,null,null,null,null,null,null,null,null,null,null,null,null,"E.  PROGRAMS AND SERVICES FOR ELs AND THEIR FAMILIES (CONTINUED)",null,null,null,null,null,null,null,null,null,null,null,null,null,null,null,"E.  PROGRAMS AND SERVICES FOR ELs AND THEIR FAMILIES (CONTINUED)",null,null,null,null,null,null,null,null,null,null,null,null,null,null,null,"E.  PROGRAMS AND SERVICES FOR ELs AND THEIR FAMILIES (CONTINUED)",null,null,null,null,null,null,null,null,null,null,null,null,null,null,null,"E.  PROGRAMS AND SERVICES FOR ELs AND THEIR FAMILIES (CONTINUED)",null,null,null,null,null,null,null,null,null,null,null,null,null,null,null,"E.  PROGRAMS AND SERVICES FOR ELs AND THEIR FAMILIES (CONTINUED)",null,null,null,null,null,null,null,null,null,null,null,null,null,null,null,"E.  PROGRAMS AND SERVICES FOR ELs AND THEIR FAMILIES (CONTINUED)",null,null,null,null,null,null,null,null,null,null,null,null,null,null,null,"E.  PROGRAMS AND SERVICES FOR ELs AND THEIR FAMILIES (CONTINUED)",null,null,null,null,null,null,null,null,null,null,null,null,null,null,null,"E.  PROGRAMS AND SERVICES FOR ELs AND THEIR FAMILIES (CONTINUED)",null,null,null,null,null,null,null,null,null,null,null,null,null,null,null,"E.  PROGRAMS AND SERVICES FOR ELs AND THEIR FAMILIES (CONTINUED)",null,null,null,null,null,null,null,null,null,null,null,null,null,null,null,"E.  PROGRAMS AND SERVICES FOR ELs AND THEIR FAMILIES (CONTINUED)",null,null,null,null,null,null,null,null,null,null,null,null,null,null,null,"E.  PROGRAMS AND SERVICES FOR ELs AND THEIR FAMILIES (CONTINUED)",null,null,null,null,null,null,null,null,null,null,null,null,null,null,null,"E.  PROGRAMS AND SERVICES FOR ELs AND THEIR FAMILIES (CONTINUED)",null,null,null,null,null,null,null,null,null,null,null,null,null,null,null,"E.  PROGRAMS AND SERVICES FOR ELs AND THEIR FAMILIES (CONTINUED)",null,null,null,null,null,null,null,null,null,null,null,null,null,null,null,"E.  PROGRAMS AND SERVICES FOR ELs AND THEIR FAMILIES (CONTINUED)",null,null,null,null,null,null,null,null,null,null,null,null,null,null,null,"E.  PROGRAMS AND SERVICES FOR ELs AND THEIR FAMILIES (CONTINUED)",null,null,null,null,null,null,null,null,null,null,null,null,null,null,null,"E.  PROGRAMS AND SERVICES FOR ELs AND THEIR FAMILIES (CONTINUED)",null,null,null,null,null,null,null,null,null,null,null,null,null,null,null,"E.  PROGRAMS AND SERVICES FOR ELs AND THEIR FAMILIES (CONTINUED)",null,null,null,null,null,null,null,null,null,null,null,null,null,null,null,"E.  PROGRAMS AND SERVICES FOR ELs AND THEIR FAMILIES (CONTINUED)",null,null,null,null,null,null,null,null,null,null,null,null,null,null,null,"E.  PROGRAMS AND SERVICES FOR ELs AND THEIR FAMILIES (CONTINUED)",null,null,null,null,null,null,null,null,null,null,null,null,null,null,null,"E.  PROGRAMS AND SERVICES FOR ELs AND THEIR FAMILIES (CONTINUED)",null,null,null,null,null,null,null,null,null,null,null,null,null,null,null,"E.  PROGRAMS AND SERVICES FOR ELs AND THEIR FAMILIES (CONTINUED)",null,null,null,null,null,null,null,null,null,null,null,null,null,null,null,"E.  PROGRAMS AND SERVICES FOR ELs AND THEIR FAMILIES (CONTINUED)",null,null,null,null,null,null,null,null,null,null,null,null,null,null,null,"E.  PROGRAMS AND SERVICES FOR ELs AND THEIR FAMILIES (CONTINUED)",null,null,null,null,null,null,null,null,null,null,null,null,null,null,null,"E.  PROGRAMS AND SERVICES FOR ELs AND THEIR FAMILIES (CONTINUED)",null,null,null,null,null,null,null,null,null,null,null,null,null,null,null,"E.  PROGRAMS AND SERVICES FOR ELs AND THEIR FAMILIES (CONTINUED)",null,null,null,null,null,null,null,null,null,null,null,null,null,null,null,"E.  PROGRAMS AND SERVICES FOR ELs AND THEIR FAMILIES (CONTINUED)",null,null,null,null,null,null,null,null,null,null,null,null,null,null,null,"E.  PROGRAMS AND SERVICES FOR ELs AND THEIR FAMILIES (CONTINUED)",null,null,null,null,null,null,null,null,null,null,null,null,null,null,null,"E.  PROGRAMS AND SERVICES FOR ELs AND THEIR FAMILIES (CONTINUED)",null,null,null,null,null,null,null,null,null,null,null,null,null,null,null,"E.  PROGRAMS AND SERVICES FOR ELs AND THEIR FAMILIES (CONTINUED)",null,null,null,null,null,null,null,null,null,null,null,null,null,null,null,"E.  PROGRAMS AND SERVICES FOR ELs AND THEIR FAMILIES (CONTINUED)",null,null,null,null,null,null,null,null,null,null,null,null,null,null,null,"E.  PROGRAMS AND SERVICES FOR ELs AND THEIR FAMILIES (CONTINUED)",null,null,null,null,null,null,null,null,null,null,null,null,null,null,null,"E.  PROGRAMS AND SERVICES FOR ELs AND THEIR FAMILIES (CONTINUED)",null,null,null,null,null,null,null,null,null,null,null,null,null,null,null,"E.  PROGRAMS AND SERVICES FOR ELs AND THEIR FAMILIES (CONTINUED)",null,null,null,null,null,null,null,null,null,null,null,null,null,null,null,"E.  PROGRAMS AND SERVICES FOR ELs AND THEIR FAMILIES (CONTINUED)",null,null,null,null,null,null,null,null,null,null,null,null,null,null,null,"E.  PROGRAMS AND SERVICES FOR ELs AND THEIR FAMILIES (CONTINUED)",null,null,null,null,null,null,null,null,null,null,null,null,null,null,null,"E.  PROGRAMS AND SERVICES FOR ELs AND THEIR FAMILIES (CONTINUED)",null,null,null,null,null,null,null,null,null,null,null,null,null,null,null,"E.  PROGRAMS AND SERVICES FOR ELs AND THEIR FAMILIES (CONTINUED)",null,null,null,null,null,null,null,null,null,null,null,null,null,null,null,"E.  PROGRAMS AND SERVICES FOR ELs AND THEIR FAMILIES (CONTINUED)",null,null,null,null,null,null,null,null,null,null,null,null,null,null,null,"E.  PROGRAMS AND SERVICES FOR ELs AND THEIR FAMILIES (CONTINUED)",null,null,null,null,null,null,null,null,null,null,null,null,null,null,null,"E.  PROGRAMS AND SERVICES FOR ELs AND THEIR FAMILIES (CONTINUED)",null,null,null,null,null,null,null,null,null,null,null,null,null,null,null,"E.  PROGRAMS AND SERVICES FOR ELs AND THEIR FAMILIES (CONTINUED)",null,null,null,null,null,null,null,null,null,null,null,null,null,null,null,"E.  PROGRAMS AND SERVICES FOR ELs AND THEIR FAMILIES (CONTINUED)",null,null,null,null,null,null,null,null,null,null,null,null,null,null,null,"E.  PROGRAMS AND SERVICES FOR ELs AND THEIR FAMILIES (CONTINUED)",null,null,null,null,null,null,null,null,null,null,null,null,null,null,null,"E.  PROGRAMS AND SERVICES FOR ELs AND THEIR FAMILIES (CONTINUED)",null,null,null,null,null,null,null,null,null,null,null,null,null,null,null,"E.  PROGRAMS AND SERVICES FOR ELs AND THEIR FAMILIES (CONTINUED)",null,null,null,null,null,null,null,null,null,null,null,null,null,null,null,"E.  PROGRAMS AND SERVICES FOR ELs AND THEIR FAMILIES (CONTINUED)",null,null,null,null,null,null,null,null,null,null,null,null,null,null,null,"E.  PROGRAMS AND SERVICES FOR ELs AND THEIR FAMILIES (CONTINUED)",null,null,null,null,null,null,null,null,null,null,null,null,null,null,null,"E.  PROGRAMS AND SERVICES FOR ELs AND THEIR FAMILIES (CONTINUED)",null,null,null,null,null,null,null,null,null,null,null,null,null,null,null,"E.  PROGRAMS AND SERVICES FOR ELs AND THEIR FAMILIES (CONTINUED)",null,null,null,null,null,null,null,null,null,null,null,null,null,null,null,"E.  PROGRAMS AND SERVICES FOR ELs AND THEIR FAMILIES (CONTINUED)",null,null,null,null,null,null,null,null,null,null,null,null,null,null,null,"E.  PROGRAMS AND SERVICES FOR ELs AND THEIR FAMILIES (CONTINUED)",null,null,null,null,null,null,null,null,null,null,null,null,null,null,null,"E.  PROGRAMS AND SERVICES FOR ELs AND THEIR FAMILIES (CONTINUED)",null,null,null,null,null,null,null,null,null,null,null,null,null,null,null,"E.  PROGRAMS AND SERVICES FOR ELs AND THEIR FAMILIES (CONTINUED)",null,null,null,null,null,null,null,null,null,null,null,null,null,null,null,"E.  PROGRAMS AND SERVICES FOR ELs AND THEIR FAMILIES (CONTINUED)",null,null,null,null,null,null,null,null,null,null,null,null,null,null,null,"E.  PROGRAMS AND SERVICES FOR ELs AND THEIR FAMILIES (CONTINUED)",null,null,null,null,null,null,null,null,null,null,null,null,null,null,null,"E.  PROGRAMS AND SERVICES FOR ELs AND THEIR FAMILIES (CONTINUED)",null,null,null,null,null,null,null,null,null,null,null,null,null,null,null,"E.  PROGRAMS AND SERVICES FOR ELs AND THEIR FAMILIES (CONTINUED)",null,null,null,null,null,null,null,null,null,null,null,null,null,null,null,"E.  PROGRAMS AND SERVICES FOR ELs AND THEIR FAMILIES (CONTINUED)",null,null,null,null,null,null,null,null,null,null,null,null,null,null,null,"E.  PROGRAMS AND SERVICES FOR ELs AND THEIR FAMILIES (CONTINUED)",null,null,null,null,null,null,null,null,null,null,null,null,null,null,null,"E.  PROGRAMS AND SERVICES FOR ELs AND THEIR FAMILIES (CONTINUED)",null,null,null,null,null,null,null,null,null,null,null,null,null,null,null,"E.  PROGRAMS AND SERVICES FOR ELs AND THEIR FAMILIES (CONTINUED)",null,null,null,null,null,null,null,null,null,null,null,null,null,null,null,"E.  PROGRAMS AND SERVICES FOR ELs AND THEIR FAMILIES (CONTINUED)",null,null,null,null,null,null,null,null,null,null,null,null,null,null,null,"E.  PROGRAMS AND SERVICES FOR ELs AND THEIR FAMILIES (CONTINUED)",null,null,null,null,null,null,null,null,null,null,null,null,null,null,null,"E.  PROGRAMS AND SERVICES FOR ELs AND THEIR FAMILIES (CONTINUED)",null,null,null,null,null,null,null,null,null,null,null,null,null,null,null,"E.  PROGRAMS AND SERVICES FOR ELs AND THEIR FAMILIES (CONTINUED)",null,null,null,null,null,null,null,null,null,null,null,null,null,null,null,"E.  PROGRAMS AND SERVICES FOR ELs AND THEIR FAMILIES (CONTINUED)",null,null,null,null,null,null,null,null,null,null,null,null,null,null,null,"E.  PROGRAMS AND SERVICES FOR ELs AND THEIR FAMILIES (CONTINUED)",null,null,null,null,null,null,null,null,null,null,null,null,null,null,null,"E.  PROGRAMS AND SERVICES FOR ELs AND THEIR FAMILIES (CONTINUED)",null,null,null,null,null,null,null,null,null,null,null,null,null,null,null,"E.  PROGRAMS AND SERVICES FOR ELs AND THEIR FAMILIES (CONTINUED)",null,null,null,null,null,null,null,null,null,null,null,null,null,null,null,"E.  PROGRAMS AND SERVICES FOR ELs AND THEIR FAMILIES (CONTINUED)",null,null,null,null,null,null,null,null,null,null,null,null,null,null,null,"E.  PROGRAMS AND SERVICES FOR ELs AND THEIR FAMILIES (CONTINUED)",null,null,null,null,null,null,null,null,null,null,null,null,null,null,null,"E.  PROGRAMS AND SERVICES FOR ELs AND THEIR FAMILIES (CONTINUED)",null,null,null,null,null,null,null,null,null,null,null,null,null,null,null,"E.  PROGRAMS AND SERVICES FOR ELs AND THEIR FAMILIES (CONTINUED)",null,null,null,null,null,null,null,null,null,null,null,null,null,null,null,"E.  PROGRAMS AND SERVICES FOR ELs AND THEIR FAMILIES (CONTINUED)",null,null,null,null,null,null,null,null,null,null,null,null,null,null,null,"E.  PROGRAMS AND SERVICES FOR ELs AND THEIR FAMILIES (CONTINUED)",null,null,null,null,null,null,null,null,null,null,null,null,null,null,null,"E.  PROGRAMS AND SERVICES FOR ELs AND THEIR FAMILIES (CONTINUED)",null,null,null,null,null,null,null,null,null,null,null,null,null,null,null,"E.  PROGRAMS AND SERVICES FOR ELs AND THEIR FAMILIES (CONTINUED)",null,null,null,null,null,null,null,null,null,null,null,null,null,null,null,"E.  PROGRAMS AND SERVICES FOR ELs AND THEIR FAMILIES (CONTINUED)",null,null,null,null,null,null,null,null,null,null,null,null,null,null,null,"E.  PROGRAMS AND SERVICES FOR ELs AND THEIR FAMILIES (CONTINUED)",null,null,null,null,null,null,null,null,null,null,null,null,null,null,null,"E.  PROGRAMS AND SERVICES FOR ELs AND THEIR FAMILIES (CONTINUED)",null,null,null,null,null,null,null,null,null,null,null,null,null,null,null,"E.  PROGRAMS AND SERVICES FOR ELs AND THEIR FAMILIES (CONTINUED)",null,null,null,null,null,null,null,null,null,null,null,null,null,null,null,"E.  PROGRAMS AND SERVICES FOR ELs AND THEIR FAMILIES (CONTINUED)",null,null,null,null,null,null,null,null,null,null,null,null,null,null,null,"E.  PROGRAMS AND SERVICES FOR ELs AND THEIR FAMILIES (CONTINUED)",null,null,null,null,null,null,null,null,null,null,null,null,null,null,null,"E.  PROGRAMS AND SERVICES FOR ELs AND THEIR FAMILIES (CONTINUED)",null,null,null,null,null,null,null,null,null,null,null,null,null,null,null,"E.  PROGRAMS AND SERVICES FOR ELs AND THEIR FAMILIES (CONTINUED)",null,null,null,null,null,null,null,null,null,null,null,null,null,null,null,"E.  PROGRAMS AND SERVICES FOR ELs AND THEIR FAMILIES (CONTINUED)",null,null,null,null,null,null,null,null,null,null,null,null,null,null,null,"E.  PROGRAMS AND SERVICES FOR ELs AND THEIR FAMILIES (CONTINUED)",null,null,null,null,null,null,null,null,null,null,null,null,null,null,null,"E.  PROGRAMS AND SERVICES FOR ELs AND THEIR FAMILIES (CONTINUED)",null,null,null,null,null,null,null,null,null,null,null,null,null,null,null,"E.  PROGRAMS AND SERVICES FOR ELs AND THEIR FAMILIES (CONTINUED)",null,null,null,null,null,null,null,null,null,null,null,null,null,null,null,"E.  PROGRAMS AND SERVICES FOR ELs AND THEIR FAMILIES (CONTINUED)",null,null,null,null,null,null,null,null,null,null,null,null,null,null,null,"E.  PROGRAMS AND SERVICES FOR ELs AND THEIR FAMILIES (CONTINUED)",null,null,null,null,null,null,null,null,null,null,null,null,null,null,null,"E.  PROGRAMS AND SERVICES FOR ELs AND THEIR FAMILIES (CONTINUED)",null,null,null,null,null,null,null,null,null,null,null,null,null,null,null,"E.  PROGRAMS AND SERVICES FOR ELs AND THEIR FAMILIES (CONTINUED)",null,null,null,null,null,null,null,null,null,null,null,null,null,null,null,"E.  PROGRAMS AND SERVICES FOR ELs AND THEIR FAMILIES (CONTINUED)",null,null,null,null,null,null,null,null,null,null,null,null,null,null,null,"E.  PROGRAMS AND SERVICES FOR ELs AND THEIR FAMILIES (CONTINUED)",null,null,null,null,null,null,null,null,null,null,null,null,null,null,null,"E.  PROGRAMS AND SERVICES FOR ELs AND THEIR FAMILIES (CONTINUED)",null,null,null,null,null,null,null,null,null,null,null,null,null,null,null,"E.  PROGRAMS AND SERVICES FOR ELs AND THEIR FAMILIES (CONTINUED)",null,null,null,null,null,null,null,null,null,null,null,null,null,null,null,"E.  PROGRAMS AND SERVICES FOR ELs AND THEIR FAMILIES (CONTINUED)",null,null,null,null,null,null,null,null,null,null,null,null,null,null,null,"E.  PROGRAMS AND SERVICES FOR ELs AND THEIR FAMILIES (CONTINUED)",null,null,null,null,null,null,null,null,null,null,null,null,null,null,null,"E.  PROGRAMS AND SERVICES FOR ELs AND THEIR FAMILIES (CONTINUED)",null,null,null,null,null,null,null,null,null,null,null,null,null,null,null,"E.  PROGRAMS AND SERVICES FOR ELs AND THEIR FAMILIES (CONTINUED)",null,null,null,null,null,null,null,null,null,null,null,null,null,null,null,"E.  PROGRAMS AND SERVICES FOR ELs AND THEIR FAMILIES (CONTINUED)",null,null,null,null,null,null,null,null,null,null,null,null,null,null,null,"E.  PROGRAMS AND SERVICES FOR ELs AND THEIR FAMILIES (CONTINUED)",null,null,null,null,null,null,null,null,null,null,null,null,null,null,null,"E.  PROGRAMS AND SERVICES FOR ELs AND THEIR FAMILIES (CONTINUED)",null,null,null,null,null,null,null,null,null,null,null,null,null,null,null,"E.  PROGRAMS AND SERVICES FOR ELs AND THEIR FAMILIES (CONTINUED)",null,null,null,null,null,null,null,null,null,null,null,null,null,null,null,"E.  PROGRAMS AND SERVICES FOR ELs AND THEIR FAMILIES (CONTINUED)",null,null,null,null,null,null,null,null,null,null,null,null,null,null,null,"E.  PROGRAMS AND SERVICES FOR ELs AND THEIR FAMILIES (CONTINUED)",null,null,null,null,null,null,null,null,null,null,null,null,null,null,null,"E.  PROGRAMS AND SERVICES FOR ELs AND THEIR FAMILIES (CONTINUED)",null,null,null,null,null,null,null,null,null,null,null,null,null,null,null,"E.  PROGRAMS AND SERVICES FOR ELs AND THEIR FAMILIES (CONTINUED)",null,null,null,null,null,null,null,null,null,null,null,null,null,null,null,"E.  PROGRAMS AND SERVICES FOR ELs AND THEIR FAMILIES (CONTINUED)",null,null,null,null,null,null,null,null,null,null,null,null,null,null,null,"E.  PROGRAMS AND SERVICES FOR ELs AND THEIR FAMILIES (CONTINUED)",null,null,null,null,null,null,null,null,null,null,null,null,null,null,null,"E.  PROGRAMS AND SERVICES FOR ELs AND THEIR FAMILIES (CONTINUED)",null,null,null,null,null,null,null,null,null,null,null,null,null,null,null,"E.  PROGRAMS AND SERVICES FOR ELs AND THEIR FAMILIES (CONTINUED)",null,null,null,null,null,null,null,null,null,null,null,null,null,null,null,"E.  PROGRAMS AND SERVICES FOR ELs AND THEIR FAMILIES (CONTINUED)",null,null,null,null,null,null,null,null,null,null,null,null,null,null,null,"E.  PROGRAMS AND SERVICES FOR ELs AND THEIR FAMILIES (CONTINUED)",null,null,null,null,null,null,null,null,null,null,null,null,null,null,null,"E.  PROGRAMS AND SERVICES FOR ELs AND THEIR FAMILIES (CONTINUED)",null,null,null,null,null,null,null,null,null,null,null,null,null,null,null,"E.  PROGRAMS AND SERVICES FOR ELs AND THEIR FAMILIES (CONTINUED)",null,null,null,null,null,null,null,null,null,null,null,null,null,null,null,"E.  PROGRAMS AND SERVICES FOR ELs AND THEIR FAMILIES (CONTINUED)",null,null,null,null,null,null,null,null,null,null,null,null,null,null,null,"E.  PROGRAMS AND SERVICES FOR ELs AND THEIR FAMILIES (CONTINUED)",null,null,null,null,null,null,null,null,null,null,null,null,null,null,null,"E.  PROGRAMS AND SERVICES FOR ELs AND THEIR FAMILIES (CONTINUED)",null,null,null,null,null,null,null,null,null,null,null,null,null,null,null,"E.  PROGRAMS AND SERVICES FOR ELs AND THEIR FAMILIES (CONTINUED)",null,null,null,null,null,null,null,null,null,null,null,null,null,null,null,"E.  PROGRAMS AND SERVICES FOR ELs AND THEIR FAMILIES (CONTINUED)",null,null,null,null,null,null,null,null,null,null,null,null,null,null,null,"E.  PROGRAMS AND SERVICES FOR ELs AND THEIR FAMILIES (CONTINUED)",null,null,null,null,null,null,null,null,null,null,null,null,null,null,null,"E.  PROGRAMS AND SERVICES FOR ELs AND THEIR FAMILIES (CONTINUED)",null,null,null,null,null,null,null,null,null,null,null,null,null,null,null,"E.  PROGRAMS AND SERVICES FOR ELs AND THEIR FAMILIES (CONTINUED)",null,null,null,null,null,null,null,null,null,null,null,null,null,null,null,"E.  PROGRAMS AND SERVICES FOR ELs AND THEIR FAMILIES (CONTINUED)",null,null,null,null,null,null,null,null,null,null,null,null,null,null,null,"E.  PROGRAMS AND SERVICES FOR ELs AND THEIR FAMILIES (CONTINUED)",null,null,null,null,null,null,null,null,null,null,null,null,null,null,null,"E.  PROGRAMS AND SERVICES FOR ELs AND THEIR FAMILIES (CONTINUED)",null,null,null,null,null,null,null,null,null,null,null,null,null,null,null,"E.  PROGRAMS AND SERVICES FOR ELs AND THEIR FAMILIES (CONTINUED)",null,null,null,null,null,null,null,null,null,null,null,null,null,null,null,"E.  PROGRAMS AND SERVICES FOR ELs AND THEIR FAMILIES (CONTINUED)",null,null,null,null,null,null,null,null,null,null,null,null,null,null,null,"E.  PROGRAMS AND SERVICES FOR ELs AND THEIR FAMILIES (CONTINUED)",null,null,null,null,null,null,null,null,null,null,null,null,null,null,null,"E.  PROGRAMS AND SERVICES FOR ELs AND THEIR FAMILIES (CONTINUED)",null,null,null,null,null,null,null,null,null,null,null,null,null,null,null,"E.  PROGRAMS AND SERVICES FOR ELs AND THEIR FAMILIES (CONTINUED)",null,null,null,null,null,null,null,null,null,null,null,null,null,null,null,"E.  PROGRAMS AND SERVICES FOR ELs AND THEIR FAMILIES (CONTINUED)",null,null,null,null,null,null,null,null,null,null,null,null,null,null,null,"E.  PROGRAMS AND SERVICES FOR ELs AND THEIR FAMILIES (CONTINUED)",null,null,null,null,null,null,null,null,null,null,null,null,null,null,null,"E.  PROGRAMS AND SERVICES FOR ELs AND THEIR FAMILIES (CONTINUED)",null,null,null,null,null,null,null,null,null,null,null,null,null,null,null,"E.  PROGRAMS AND SERVICES FOR ELs AND THEIR FAMILIES (CONTINUED)",null,null,null,null,null,null,null,null,null,null,null,null,null,null,null,"E.  PROGRAMS AND SERVICES FOR ELs AND THEIR FAMILIES (CONTINUED)",null,null,null,null,null,null,null,null,null,null,null,null,null,null,null,"E.  PROGRAMS AND SERVICES FOR ELs AND THEIR FAMILIES (CONTINUED)",null,null,null,null,null,null,null,null,null,null,null,null,null,null,null,"E.  PROGRAMS AND SERVICES FOR ELs AND THEIR FAMILIES (CONTINUED)",null,null,null,null,null,null,null,null,null,null,null,null,null,null,null,"E.  PROGRAMS AND SERVICES FOR ELs AND THEIR FAMILIES (CONTINUED)",null,null,null,null,null,null,null,null,null,null,null,null,null,null,null,"E.  PROGRAMS AND SERVICES FOR ELs AND THEIR FAMILIES (CONTINUED)",null,null,null,null,null,null,null,null,null,null,null,null,null,null,null,"E.  PROGRAMS AND SERVICES FOR ELs AND THEIR FAMILIES (CONTINUED)",null,null,null,null,null,null,null,null,null,null,null,null,null,null,null,"E.  PROGRAMS AND SERVICES FOR ELs AND THEIR FAMILIES (CONTINUED)",null,null,null,null,null,null,null,null,null,null,null,null,null,null,null,"E.  PROGRAMS AND SERVICES FOR ELs AND THEIR FAMILIES (CONTINUED)",null,null,null,null,null,null,null,null,null,null,null,null,null,null,null,"E.  PROGRAMS AND SERVICES FOR ELs AND THEIR FAMILIES (CONTINUED)",null,null,null,null,null,null,null,null,null,null,null,null,null,null,null,"E.  PROGRAMS AND SERVICES FOR ELs AND THEIR FAMILIES (CONTINUED)",null,null,null,null,null,null,null,null,null,null,null,null,null,null,null,"E.  PROGRAMS AND SERVICES FOR ELs AND THEIR FAMILIES (CONTINUED)",null,null,null,null,null,null,null,null,null,null,null,null,null,null,null,"E.  PROGRAMS AND SERVICES FOR ELs AND THEIR FAMILIES (CONTINUED)",null,null,null,null,null,null,null,null,null,null,null,null,null,null,null,"E.  PROGRAMS AND SERVICES FOR ELs AND THEIR FAMILIES (CONTINUED)",null,null,null,null,null,null,null,null,null,null,null,null,null,null,null,"E.  PROGRAMS AND SERVICES FOR ELs AND THEIR FAMILIES (CONTINUED)",null,null,null,null,null,null,null,null,null,null,null,null,null,null,null,"E.  PROGRAMS AND SERVICES FOR ELs AND THEIR FAMILIES (CONTINUED)",null,null,null,null,null,null,null,null,null,null,null,null,null,null,null,"E.  PROGRAMS AND SERVICES FOR ELs AND THEIR FAMILIES (CONTINUED)",null,null,null,null,null,null,null,null,null,null,null,null,null,null,null,"E.  PROGRAMS AND SERVICES FOR ELs AND THEIR FAMILIES (CONTINUED)",null,null,null,null,null,null,null,null,null,null,null,null,null,null,null,"E.  PROGRAMS AND SERVICES FOR ELs AND THEIR FAMILIES (CONTINUED)",null,null,null,null,null,null,null,null,null,null,null,null,null,null,null,"E.  PROGRAMS AND SERVICES FOR ELs AND THEIR FAMILIES (CONTINUED)",null,null,null,null,null,null,null,null,null,null,null,null,null,null,null,"E.  PROGRAMS AND SERVICES FOR ELs AND THEIR FAMILIES (CONTINUED)",null,null,null,null,null,null,null,null,null,null,null,null,null,null,null,"E.  PROGRAMS AND SERVICES FOR ELs AND THEIR FAMILIES (CONTINUED)",null,null,null,null,null,null,null,null,null,null,null,null,null,null,null,"E.  PROGRAMS AND SERVICES FOR ELs AND THEIR FAMILIES (CONTINUED)",null,null,null,null,null,null,null,null,null,null,null,null,null,null,null,"E.  PROGRAMS AND SERVICES FOR ELs AND THEIR FAMILIES (CONTINUED)",null,null,null,null,null,null,null,null,null,null,null,null,null,null,null,"E.  PROGRAMS AND SERVICES FOR ELs AND THEIR FAMILIES (CONTINUED)",null,null,null,null,null,null,null,null,null,null,null,null,null,null,null,"E.  PROGRAMS AND SERVICES FOR ELs AND THEIR FAMILIES (CONTINUED)",null,null,null,null,null,null,null,null,null,null,null,null,null,null,null,"E.  PROGRAMS AND SERVICES FOR ELs AND THEIR FAMILIES (CONTINUED)",null,null,null,null,null,null,null,null,null,null,null,null,null,null,null,"E.  PROGRAMS AND SERVICES FOR ELs AND THEIR FAMILIES (CONTINUED)",null,null,null,null,null,null,null,null,null,null,null,null,null,null,null,"E.  PROGRAMS AND SERVICES FOR ELs AND THEIR FAMILIES (CONTINUED)",null,null,null,null,null,null,null,null,null,null,null,null,null,null,null,"E.  PROGRAMS AND SERVICES FOR ELs AND THEIR FAMILIES (CONTINUED)",null,null,null,null,null,null,null,null,null,null,null,null,null,null,null,"E.  PROGRAMS AND SERVICES FOR ELs AND THEIR FAMILIES (CONTINUED)",null,null,null,null,null,null,null,null,null,null,null,null,null,null,null,"E.  PROGRAMS AND SERVICES FOR ELs AND THEIR FAMILIES (CONTINUED)",null,null,null,null,null,null,null,null,null,null,null,null,null,null,null,"E.  PROGRAMS AND SERVICES FOR ELs AND THEIR FAMILIES (CONTINUED)",null,null,null,null,null,null,null,null,null,null,null,null,null,null,null,"E.  PROGRAMS AND SERVICES FOR ELs AND THEIR FAMILIES (CONTINUED)",null,null,null,null,null,null,null,null,null,null,null,null,null,null,null,"E.  PROGRAMS AND SERVICES FOR ELs AND THEIR FAMILIES (CONTINUED)",null,null,null,null,null,null,null,null,null,null,null,null,null,null,null,"E.  PROGRAMS AND SERVICES FOR ELs AND THEIR FAMILIES (CONTINUED)",null,null,null,null,null,null,null,null,null,null,null,null,null,null,null,"E.  PROGRAMS AND SERVICES FOR ELs AND THEIR FAMILIES (CONTINUED)",null,null,null,null,null,null,null,null,null,null,null,null,null,null,null,"E.  PROGRAMS AND SERVICES FOR ELs AND THEIR FAMILIES (CONTINUED)",null,null,null,null,null,null,null,null,null,null,null,null,null,null,null,"E.  PROGRAMS AND SERVICES FOR ELs AND THEIR FAMILIES (CONTINUED)",null,null,null,null,null,null,null,null,null,null,null,null,null,null,null,"E.  PROGRAMS AND SERVICES FOR ELs AND THEIR FAMILIES (CONTINUED)",null,null,null,null,null,null,null,null,null,null,null,null,null,null,null,"E.  PROGRAMS AND SERVICES FOR ELs AND THEIR FAMILIES (CONTINUED)",null,null,null,null,null,null,null,null,null,null,null,null,null,null,null,"E.  PROGRAMS AND SERVICES FOR ELs AND THEIR FAMILIES (CONTINUED)",null,null,null,null,null,null,null,null,null,null,null,null,null,null,null,"E.  PROGRAMS AND SERVICES FOR ELs AND THEIR FAMILIES (CONTINUED)",null,null,null,null,null,null,null,null,null,null,null,null,null,null,null,"E.  PROGRAMS AND SERVICES FOR ELs AND THEIR FAMILIES (CONTINUED)",null,null,null,null,null,null,null,null,null,null,null,null,null,null,null,"E.  PROGRAMS AND SERVICES FOR ELs AND THEIR FAMILIES (CONTINUED)",null,null,null,null,null,null,null,null,null,null,null,null,null,null,null,"E.  PROGRAMS AND SERVICES FOR ELs AND THEIR FAMILIES (CONTINUED)",null,null,null,null,null,null,null,null,null,null,null,null,null,null,null,"E.  PROGRAMS AND SERVICES FOR ELs AND THEIR FAMILIES (CONTINUED)",null,null,null,null,null,null,null,null,null,null,null,null,null,null,null,"E.  PROGRAMS AND SERVICES FOR ELs AND THEIR FAMILIES (CONTINUED)",null,null,null,null,null,null,null,null,null,null,null,null,null,null,null,"E.  PROGRAMS AND SERVICES FOR ELs AND THEIR FAMILIES (CONTINUED)",null,null,null,null,null,null,null,null,null,null,null,null,null,null,null,"E.  PROGRAMS AND SERVICES FOR ELs AND THEIR FAMILIES (CONTINUED)",null,null,null,null,null,null,null,null,null,null,null,null,null,null,null,"E.  PROGRAMS AND SERVICES FOR ELs AND THEIR FAMILIES (CONTINUED)",null,null,null,null,null,null,null,null,null,null,null,null,null,null,null,"E.  PROGRAMS AND SERVICES FOR ELs AND THEIR FAMILIES (CONTINUED)",null,null,null,null,null,null,null,null,null,null,null,null,null,null,null,"E.  PROGRAMS AND SERVICES FOR ELs AND THEIR FAMILIES (CONTINUED)",null,null,null,null,null,null,null,null,null,null,null,null,null,null,null,"E.  PROGRAMS AND SERVICES FOR ELs AND THEIR FAMILIES (CONTINUED)",null,null,null,null,null,null,null,null,null,null,null,null,null,null,null,"E.  PROGRAMS AND SERVICES FOR ELs AND THEIR FAMILIES (CONTINUED)",null,null,null,null,null,null,null,null,null,null,null,null,null,null,null,"E.  PROGRAMS AND SERVICES FOR ELs AND THEIR FAMILIES (CONTINUED)",null,null,null,null,null,null,null,null,null,null,null,null,null,null,null,"E.  PROGRAMS AND SERVICES FOR ELs AND THEIR FAMILIES (CONTINUED)",null,null,null,null,null,null,null,null,null,null,null,null,null,null,null,"E.  PROGRAMS AND SERVICES FOR ELs AND THEIR FAMILIES (CONTINUED)",null,null,null,null,null,null,null,null,null,null,null,null,null,null,null,"E.  PROGRAMS AND SERVICES FOR ELs AND THEIR FAMILIES (CONTINUED)",null,null,null,null,null,null,null,null,null,null,null,null,null,null,null,"E.  PROGRAMS AND SERVICES FOR ELs AND THEIR FAMILIES (CONTINUED)",null,null,null,null,null,null,null,null,null,null,null,null,null,null,null,"E.  PROGRAMS AND SERVICES FOR ELs AND THEIR FAMILIES (CONTINUED)",null,null,null,null,null,null,null,null,null,null,null,null,null,null,null,"E.  PROGRAMS AND SERVICES FOR ELs AND THEIR FAMILIES (CONTINUED)",null,null,null,null,null,null,null,null,null,null,null,null,null,null,null,"E.  PROGRAMS AND SERVICES FOR ELs AND THEIR FAMILIES (CONTINUED)",null,null,null,null,null,null,null,null,null,null,null,null,null,null,null,"E.  PROGRAMS AND SERVICES FOR ELs AND THEIR FAMILIES (CONTINUED)",null,null,null,null,null,null,null,null,null,null,null,null,null,null,null,"E.  PROGRAMS AND SERVICES FOR ELs AND THEIR FAMILIES (CONTINUED)",null,null,null,null,null,null,null,null,null,null,null,null,null,null,null,"E.  PROGRAMS AND SERVICES FOR ELs AND THEIR FAMILIES (CONTINUED)",null,null,null,null,null,null,null,null,null,null,null,null,null,null,null,"E.  PROGRAMS AND SERVICES FOR ELs AND THEIR FAMILIES (CONTINUED)",null,null,null,null,null,null,null,null,null,null,null,null,null,null,null,"E.  PROGRAMS AND SERVICES FOR ELs AND THEIR FAMILIES (CONTINUED)",null,null,null,null,null,null,null,null,null,null,null,null,null,null,null,"E.  PROGRAMS AND SERVICES FOR ELs AND THEIR FAMILIES (CONTINUED)",null,null,null,null,null,null,null,null,null,null,null,null,null,null,null,"E.  PROGRAMS AND SERVICES FOR ELs AND THEIR FAMILIES (CONTINUED)",null,null,null,null,null,null,null,null,null,null,null,null,null,null,null,"E.  PROGRAMS AND SERVICES FOR ELs AND THEIR FAMILIES (CONTINUED)",null,null,null,null,null,null,null,null,null,null,null,null,null,null,null,"E.  PROGRAMS AND SERVICES FOR ELs AND THEIR FAMILIES (CONTINUED)",null,null,null,null,null,null,null,null,null,null,null,null,null,null,null,"E.  PROGRAMS AND SERVICES FOR ELs AND THEIR FAMILIES (CONTINUED)",null,null,null,null,null,null,null,null,null,null,null,null,null,null,null,"E.  PROGRAMS AND SERVICES FOR ELs AND THEIR FAMILIES (CONTINUED)",null,null,null,null,null,null,null,null,null,null,null,null,null,null,null,"E.  PROGRAMS AND SERVICES FOR ELs AND THEIR FAMILIES (CONTINUED)",null,null,null,null,null,null,null,null,null,null,null,null,null,null,null,"E.  PROGRAMS AND SERVICES FOR ELs AND THEIR FAMILIES (CONTINUED)",null,null,null,null,null,null,null,null,null,null,null,null,null,null,null,"E.  PROGRAMS AND SERVICES FOR ELs AND THEIR FAMILIES (CONTINUED)",null,null,null,null,null,null,null,null,null,null,null,null,null,null,null,"E.  PROGRAMS AND SERVICES FOR ELs AND THEIR FAMILIES (CONTINUED)",null,null,null,null,null,null,null,null,null,null,null,null,null,null,null,"E.  PROGRAMS AND SERVICES FOR ELs AND THEIR FAMILIES (CONTINUED)",null,null,null,null,null,null,null,null,null,null,null,null,null,null,null,"E.  PROGRAMS AND SERVICES FOR ELs AND THEIR FAMILIES (CONTINUED)",null,null,null,null,null,null,null,null,null,null,null,null,null,null,null,"E.  PROGRAMS AND SERVICES FOR ELs AND THEIR FAMILIES (CONTINUED)",null,null,null,null,null,null,null,null,null,null,null,null,null,null,null,"E.  PROGRAMS AND SERVICES FOR ELs AND THEIR FAMILIES (CONTINUED)",null,null,null,null,null,null,null,null,null,null,null,null,null,null,null,"E.  PROGRAMS AND SERVICES FOR ELs AND THEIR FAMILIES (CONTINUED)",null,null,null,null,null,null,null,null,null,null,null,null,null,null,null,"E.  PROGRAMS AND SERVICES FOR ELs AND THEIR FAMILIES (CONTINUED)",null,null,null,null,null,null,null,null,null,null,null,null,null,null,null,"E.  PROGRAMS AND SERVICES FOR ELs AND THEIR FAMILIES (CONTINUED)",null,null,null,null,null,null,null,null,null,null,null,null,null,null,null,"E.  PROGRAMS AND SERVICES FOR ELs AND THEIR FAMILIES (CONTINUED)",null,null,null,null,null,null,null,null,null,null,null,null,null,null,null,"E.  PROGRAMS AND SERVICES FOR ELs AND THEIR FAMILIES (CONTINUED)",null,null,null,null,null,null,null,null,null,null,null,null,null,null,null,"E.  PROGRAMS AND SERVICES FOR ELs AND THEIR FAMILIES (CONTINUED)",null,null,null,null,null,null,null,null,null,null,null,null,null,null,null,"E.  PROGRAMS AND SERVICES FOR ELs AND THEIR FAMILIES (CONTINUED)",null,null,null,null,null,null,null,null,null,null,null,null,null,null,null,"E.  PROGRAMS AND SERVICES FOR ELs AND THEIR FAMILIES (CONTINUED)",null,null,null,null,null,null,null,null,null,null,null,null,null,null,null,"E.  PROGRAMS AND SERVICES FOR ELs AND THEIR FAMILIES (CONTINUED)",null,null,null,null,null,null,null,null,null,null,null,null,null,null,null,"E.  PROGRAMS AND SERVICES FOR ELs AND THEIR FAMILIES (CONTINUED)",null,null,null,null,null,null,null,null,null,null,null,null,null,null,null,"E.  PROGRAMS AND SERVICES FOR ELs AND THEIR FAMILIES (CONTINUED)",null,null,null,null,null,null,null,null,null,null,null,null,null,null,null,"E.  PROGRAMS AND SERVICES FOR ELs AND THEIR FAMILIES (CONTINUED)",null,null,null,null,null,null,null,null,null,null,null,null,null,null,null,"E.  PROGRAMS AND SERVICES FOR ELs AND THEIR FAMILIES (CONTINUED)",null,null,null,null,null,null,null,null,null,null,null,null,null,null,null,"E.  PROGRAMS AND SERVICES FOR ELs AND THEIR FAMILIES (CONTINUED)",null,null,null,null,null,null,null,null,null,null,null,null,null,null,null,"E.  PROGRAMS AND SERVICES FOR ELs AND THEIR FAMILIES (CONTINUED)",null,null,null,null,null,null,null,null,null,null,null,null,null,null,null,"E.  PROGRAMS AND SERVICES FOR ELs AND THEIR FAMILIES (CONTINUED)",null,null,null,null,null,null,null,null,null,null,null,null,null,null,null,"E.  PROGRAMS AND SERVICES FOR ELs AND THEIR FAMILIES (CONTINUED)",null,null,null,null,null,null,null,null,null,null,null,null,null,null,null,"E.  PROGRAMS AND SERVICES FOR ELs AND THEIR FAMILIES (CONTINUED)",null,null,null,null,null,null,null,null,null,null,null,null,null,null,null,"E.  PROGRAMS AND SERVICES FOR ELs AND THEIR FAMILIES (CONTINUED)",null,null,null,null,null,null,null,null,null,null,null,null,null,null,null,"E.  PROGRAMS AND SERVICES FOR ELs AND THEIR FAMILIES (CONTINUED)",null,null,null,null,null,null,null,null,null,null,null,null,null,null,null,"E.  PROGRAMS AND SERVICES FOR ELs AND THEIR FAMILIES (CONTINUED)",null,null,null,null,null,null,null,null,null,null,null,null,null,null,null,"E.  PROGRAMS AND SERVICES FOR ELs AND THEIR FAMILIES (CONTINUED)",null,null,null,null,null,null,null,null,null,null,null,null,null,null,null,"E.  PROGRAMS AND SERVICES FOR ELs AND THEIR FAMILIES (CONTINUED)",null,null,null,null,null,null,null,null,null,null,null,null,null,null,null,"E.  PROGRAMS AND SERVICES FOR ELs AND THEIR FAMILIES (CONTINUED)",null,null,null,null,null,null,null,null,null,null,null,null,null,null,null,"E.  PROGRAMS AND SERVICES FOR ELs AND THEIR FAMILIES (CONTINUED)",null,null,null,null,null,null,null,null,null,null,null,null,null,null,null,"E.  PROGRAMS AND SERVICES FOR ELs AND THEIR FAMILIES (CONTINUED)",null,null,null,null,null,null,null,null,null,null,null,null,null,null,null,"E.  PROGRAMS AND SERVICES FOR ELs AND THEIR FAMILIES (CONTINUED)",null,null,null,null,null,null,null,null,null,null,null,null,null,null,null,"E.  PROGRAMS AND SERVICES FOR ELs AND THEIR FAMILIES (CONTINUED)",null,null,null,null,null,null,null,null,null,null,null,null,null,null,null,"E.  PROGRAMS AND SERVICES FOR ELs AND THEIR FAMILIES (CONTINUED)",null,null,null,null,null,null,null,null,null,null,null,null,null,null,null,"E.  PROGRAMS AND SERVICES FOR ELs AND THEIR FAMILIES (CONTINUED)",null,null,null,null,null,null,null,null,null,null,null,null,null,null,null,"E.  PROGRAMS AND SERVICES FOR ELs AND THEIR FAMILIES (CONTINUED)",null,null,null,null,null,null,null,null,null,null,null,null,null,null,null,"E.  PROGRAMS AND SERVICES FOR ELs AND THEIR FAMILIES (CONTINUED)",null,null,null,null,null,null,null,null,null,null,null,null,null,null,null,"E.  PROGRAMS AND SERVICES FOR ELs AND THEIR FAMILIES (CONTINUED)",null,null,null,null,null,null,null,null,null,null,null,null,null,null,null,"E.  PROGRAMS AND SERVICES FOR ELs AND THEIR FAMILIES (CONTINUED)",null,null,null,null,null,null,null,null,null,null,null,null,null,null,null,"E.  PROGRAMS AND SERVICES FOR ELs AND THEIR FAMILIES (CONTINUED)",null,null,null,null,null,null,null,null,null,null,null,null,null,null,null,"E.  PROGRAMS AND SERVICES FOR ELs AND THEIR FAMILIES (CONTINUED)",null,null,null,null,null,null,null,null,null,null,null,null,null,null,null,"E.  PROGRAMS AND SERVICES FOR ELs AND THEIR FAMILIES (CONTINUED)",null,null,null,null,null,null,null,null,null,null,null,null,null,null,null,"E.  PROGRAMS AND SERVICES FOR ELs AND THEIR FAMILIES (CONTINUED)",null,null,null,null,null,null,null,null,null,null,null,null,null,null,null,"E.  PROGRAMS AND SERVICES FOR ELs AND THEIR FAMILIES (CONTINUED)",null,null,null,null,null,null,null,null,null,null,null,null,null,null,null,"E.  PROGRAMS AND SERVICES FOR ELs AND THEIR FAMILIES (CONTINUED)",null,null,null,null,null,null,null,null,null,null,null,null,null,null,null,"E.  PROGRAMS AND SERVICES FOR ELs AND THEIR FAMILIES (CONTINUED)",null,null,null,null,null,null,null,null,null,null,null,null,null,null,null,"E.  PROGRAMS AND SERVICES FOR ELs AND THEIR FAMILIES (CONTINUED)",null,null,null,null,null,null,null,null,null,null,null,null,null,null,null,"E.  PROGRAMS AND SERVICES FOR ELs AND THEIR FAMILIES (CONTINUED)",null,null,null,null,null,null,null,null,null,null,null,null,null,null,null,"E.  PROGRAMS AND SERVICES FOR ELs AND THEIR FAMILIES (CONTINUED)",null,null,null,null,null,null,null,null,null,null,null,null,null,null,null,"E.  PROGRAMS AND SERVICES FOR ELs AND THEIR FAMILIES (CONTINUED)",null,null,null,null,null,null,null,null,null,null,null,null,null,null,null,"E.  PROGRAMS AND SERVICES FOR ELs AND THEIR FAMILIES (CONTINUED)",null,null,null,null,null,null,null,null,null,null,null,null,null,null,null,"E.  PROGRAMS AND SERVICES FOR ELs AND THEIR FAMILIES (CONTINUED)",null,null,null,null,null,null,null,null,null,null,null,null,null,null,null,"E.  PROGRAMS AND SERVICES FOR ELs AND THEIR FAMILIES (CONTINUED)",null,null,null,null,null,null,null,null,null,null,null,null,null,null,null,"E.  PROGRAMS AND SERVICES FOR ELs AND THEIR FAMILIES (CONTINUED)",null,null,null,null,null,null,null,null,null,null,null,null,null,null,null,"E.  PROGRAMS AND SERVICES FOR ELs AND THEIR FAMILIES (CONTINUED)",null,null,null,null,null,null,null,null,null,null,null,null,null,null,null,"E.  PROGRAMS AND SERVICES FOR ELs AND THEIR FAMILIES (CONTINUED)",null,null,null,null,null,null,null,null,null,null,null,null,null,null,null,"E.  PROGRAMS AND SERVICES FOR ELs AND THEIR FAMILIES (CONTINUED)",null,null,null,null,null,null,null,null,null,null,null,null,null,null,null,"E.  PROGRAMS AND SERVICES FOR ELs AND THEIR FAMILIES (CONTINUED)",null,null,null,null,null,null,null,null,null,null,null,null,null,null,null,"E.  PROGRAMS AND SERVICES FOR ELs AND THEIR FAMILIES (CONTINUED)",null,null,null,null,null,null,null,null,null,null,null,null,null,null,null,"E.  PROGRAMS AND SERVICES FOR ELs AND THEIR FAMILIES (CONTINUED)",null,null,null,null,null,null,null,null,null,null,null,null,null,null,null,"E.  PROGRAMS AND SERVICES FOR ELs AND THEIR FAMILIES (CONTINUED)",null,null,null,null,null,null,null,null,null,null,null,null,null,null,null,"E.  PROGRAMS AND SERVICES FOR ELs AND THEIR FAMILIES (CONTINUED)",null,null,null,null,null,null,null,null,null,null,null,null,null,null,null,"E.  PROGRAMS AND SERVICES FOR ELs AND THEIR FAMILIES (CONTINUED)",null,null,null,null,null,null,null,null,null,null,null,null,null,null,null,"E.  PROGRAMS AND SERVICES FOR ELs AND THEIR FAMILIES (CONTINUED)",null,null,null,null,null,null,null,null,null,null,null,null,null,null,null,"E.  PROGRAMS AND SERVICES FOR ELs AND THEIR FAMILIES (CONTINUED)",null,null,null,null,null,null,null,null,null,null,null,null,null,null,null,"E.  PROGRAMS AND SERVICES FOR ELs AND THEIR FAMILIES (CONTINUED)",null,null,null,null,null,null,null,null,null,null,null,null,null,null,null,"E.  PROGRAMS AND SERVICES FOR ELs AND THEIR FAMILIES (CONTINUED)",null,null,null,null,null,null,null,null,null,null,null,null,null,null,null,"E.  PROGRAMS AND SERVICES FOR ELs AND THEIR FAMILIES (CONTINUED)",null,null,null,null,null,null,null,null,null,null,null,null,null,null,null,"E.  PROGRAMS AND SERVICES FOR ELs AND THEIR FAMILIES (CONTINUED)",null,null,null,null,null,null,null,null,null,null,null,null,null,null,null,"E.  PROGRAMS AND SERVICES FOR ELs AND THEIR FAMILIES (CONTINUED)",null,null,null,null,null,null,null,null,null,null,null,null,null,null,null,"E.  PROGRAMS AND SERVICES FOR ELs AND THEIR FAMILIES (CONTINUED)",null,null,null,null,null,null,null,null,null,null,null,null,null,null,null,"E.  PROGRAMS AND SERVICES FOR ELs AND THEIR FAMILIES (CONTINUED)",null,null,null,null,null,null,null,null,null,null,null,null,null,null,null,"E.  PROGRAMS AND SERVICES FOR ELs AND THEIR FAMILIES (CONTINUED)",null,null,null,null,null,null,null,null,null,null,null,null,null,null,null,"E.  PROGRAMS AND SERVICES FOR ELs AND THEIR FAMILIES (CONTINUED)",null,null,null,null,null,null,null,null,null,null,null,null,null,null,null,"E.  PROGRAMS AND SERVICES FOR ELs AND THEIR FAMILIES (CONTINUED)",null,null,null,null,null,null,null,null,null,null,null,null,null,null,null,"E.  PROGRAMS AND SERVICES FOR ELs AND THEIR FAMILIES (CONTINUED)",null,null,null,null,null,null,null,null,null,null,null,null,null,null,null,"E.  PROGRAMS AND SERVICES FOR ELs AND THEIR FAMILIES (CONTINUED)",null,null,null,null,null,null,null,null,null,null,null,null,null,null,null,"E.  PROGRAMS AND SERVICES FOR ELs AND THEIR FAMILIES (CONTINUED)",null,null,null,null,null,null,null,null,null,null,null,null,null,null,null,"E.  PROGRAMS AND SERVICES FOR ELs AND THEIR FAMILIES (CONTINUED)",null,null,null,null,null,null,null,null,null,null,null,null,null,null,null,"E.  PROGRAMS AND SERVICES FOR ELs AND THEIR FAMILIES (CONTINUED)",null,null,null,null,null,null,null,null,null,null,null,null,null,null,null,"E.  PROGRAMS AND SERVICES FOR ELs AND THEIR FAMILIES (CONTINUED)",null,null,null,null,null,null,null,null,null,null,null,null,null,null,null,"E.  PROGRAMS AND SERVICES FOR ELs AND THEIR FAMILIES (CONTINUED)",null,null,null,null,null,null,null,null,null,null,null,null,null,null,null,"E.  PROGRAMS AND SERVICES FOR ELs AND THEIR FAMILIES (CONTINUED)",null,null,null,null,null,null,null,null,null,null,null,null,null,null,null,"E.  PROGRAMS AND SERVICES FOR ELs AND THEIR FAMILIES (CONTINUED)",null,null,null,null,null,null,null,null,null,null,null,null,null,null,null,"E.  PROGRAMS AND SERVICES FOR ELs AND THEIR FAMILIES (CONTINUED)",null,null,null,null,null,null,null,null,null,null,null,null,null,null,null,"E.  PROGRAMS AND SERVICES FOR ELs AND THEIR FAMILIES (CONTINUED)",null,null,null,null,null,null,null,null,null,null,null,null,null,null,null,"E.  PROGRAMS AND SERVICES FOR ELs AND THEIR FAMILIES (CONTINUED)",null,null,null,null,null,null,null,null,null,null,null,null,null,null,null,"E.  PROGRAMS AND SERVICES FOR ELs AND THEIR FAMILIES (CONTINUED)",null,null,null,null,null,null,null,null,null,null,null,null,null,null,null,"E.  PROGRAMS AND SERVICES FOR ELs AND THEIR FAMILIES (CONTINUED)",null,null,null,null,null,null,null,null,null,null,null,null,null,null,null,"E.  PROGRAMS AND SERVICES FOR ELs AND THEIR FAMILIES (CONTINUED)",null,null,null,null,null,null,null,null,null,null,null,null,null,null,null,"E.  PROGRAMS AND SERVICES FOR ELs AND THEIR FAMILIES (CONTINUED)",null,null,null,null,null,null,null,null,null,null,null,null,null,null,null,"E.  PROGRAMS AND SERVICES FOR ELs AND THEIR FAMILIES (CONTINUED)",null,null,null,null,null,null,null,null,null,null,null,null,null,null,null,"E.  PROGRAMS AND SERVICES FOR ELs AND THEIR FAMILIES (CONTINUED)",null,null,null,null,null,null,null,null,null,null,null,null,null,null,null,"E.  PROGRAMS AND SERVICES FOR ELs AND THEIR FAMILIES (CONTINUED)",null,null,null,null,null,null,null,null,null,null,null,null,null,null,null,"E.  PROGRAMS AND SERVICES FOR ELs AND THEIR FAMILIES (CONTINUED)",null,null,null,null,null,null,null,null,null,null,null,null,null,null,null,"E.  PROGRAMS AND SERVICES FOR ELs AND THEIR FAMILIES (CONTINUED)",null,null,null,null,null,null,null,null,null,null,null,null,null,null,null,"E.  PROGRAMS AND SERVICES FOR ELs AND THEIR FAMILIES (CONTINUED)",null,null,null,null,null,null,null,null,null,null,null,null,null,null,null,"E.  PROGRAMS AND SERVICES FOR ELs AND THEIR FAMILIES (CONTINUED)",null,null,null,null,null,null,null,null,null,null,null,null,null,null,null,"E.  PROGRAMS AND SERVICES FOR ELs AND THEIR FAMILIES (CONTINUED)",null,null,null,null,null,null,null,null,null,null,null,null,null,null,null,"E.  PROGRAMS AND SERVICES FOR ELs AND THEIR FAMILIES (CONTINUED)",null,null,null,null,null,null,null,null,null,null,null,null,null,null,null,"E.  PROGRAMS AND SERVICES FOR ELs AND THEIR FAMILIES (CONTINUED)",null,null,null,null,null,null,null,null,null,null,null,null,null,null,null,"E.  PROGRAMS AND SERVICES FOR ELs AND THEIR FAMILIES (CONTINUED)",null,null,null,null,null,null,null,null,null,null,null,null,null,null,null,"E.  PROGRAMS AND SERVICES FOR ELs AND THEIR FAMILIES (CONTINUED)",null,null,null,null,null,null,null,null,null,null,null,null,null,null,null,"E.  PROGRAMS AND SERVICES FOR ELs AND THEIR FAMILIES (CONTINUED)",null,null,null,null,null,null,null,null,null,null,null,null,null,null,null,"E.  PROGRAMS AND SERVICES FOR ELs AND THEIR FAMILIES (CONTINUED)",null,null,null,null,null,null,null,null,null,null,null,null,null,null,null,"E.  PROGRAMS AND SERVICES FOR ELs AND THEIR FAMILIES (CONTINUED)",null,null,null,null,null,null,null,null,null,null,null,null,null,null,null,"E.  PROGRAMS AND SERVICES FOR ELs AND THEIR FAMILIES (CONTINUED)",null,null,null,null,null,null,null,null,null,null,null,null,null,null,null,"E.  PROGRAMS AND SERVICES FOR ELs AND THEIR FAMILIES (CONTINUED)",null,null,null,null,null,null,null,null,null,null,null,null,null,null,null,"E.  PROGRAMS AND SERVICES FOR ELs AND THEIR FAMILIES (CONTINUED)",null,null,null,null,null,null,null,null,null,null,null,null,null,null,null,"E.  PROGRAMS AND SERVICES FOR ELs AND THEIR FAMILIES (CONTINUED)",null,null,null,null,null,null,null,null,null,null,null,null,null,null,null,"E.  PROGRAMS AND SERVICES FOR ELs AND THEIR FAMILIES (CONTINUED)",null,null,null,null,null,null,null,null,null,null,null,null,null,null,null,"E.  PROGRAMS AND SERVICES FOR ELs AND THEIR FAMILIES (CONTINUED)",null,null,null,null,null,null,null,null,null,null,null,null,null,null,null,"E.  PROGRAMS AND SERVICES FOR ELs AND THEIR FAMILIES (CONTINUED)",null,null,null,null,null,null,null,null,null,null,null,null,null,null,null,"E.  PROGRAMS AND SERVICES FOR ELs AND THEIR FAMILIES (CONTINUED)",null,null,null,null,null,null,null,null,null,null,null,null,null,null,null,"E.  PROGRAMS AND SERVICES FOR ELs AND THEIR FAMILIES (CONTINUED)",null,null,null,null,null,null,null,null,null,null,null,null,null,null,null,"E.  PROGRAMS AND SERVICES FOR ELs AND THEIR FAMILIES (CONTINUED)",null,null,null,null,null,null,null,null,null,null,null,null,null,null,null,"E.  PROGRAMS AND SERVICES FOR ELs AND THEIR FAMILIES (CONTINUED)",null,null,null,null,null,null,null,null,null,null,null,null,null,null,null,"E.  PROGRAMS AND SERVICES FOR ELs AND THEIR FAMILIES (CONTINUED)",null,null,null,null,null,null,null,null,null,null,null,null,null,null,null,"E.  PROGRAMS AND SERVICES FOR ELs AND THEIR FAMILIES (CONTINUED)",null,null,null,null,null,null,null,null,null,null,null,null,null,null,null,"E.  PROGRAMS AND SERVICES FOR ELs AND THEIR FAMILIES (CONTINUED)",null,null,null,null,null,null,null,null,null,null,null,null,null,null,null,"E.  PROGRAMS AND SERVICES FOR ELs AND THEIR FAMILIES (CONTINUED)",null,null,null,null,null,null,null,null,null,null,null,null,null,null,null,"E.  PROGRAMS AND SERVICES FOR ELs AND THEIR FAMILIES (CONTINUED)",null,null,null,null,null,null,null,null,null,null,null,null,null,null,null,"E.  PROGRAMS AND SERVICES FOR ELs AND THEIR FAMILIES (CONTINUED)",null,null,null,null,null,null,null,null,null,null,null,null,null,null,null,"E.  PROGRAMS AND SERVICES FOR ELs AND THEIR FAMILIES (CONTINUED)",null,null,null,null,null,null,null,null,null,null,null,null,null,null,null,"E.  PROGRAMS AND SERVICES FOR ELs AND THEIR FAMILIES (CONTINUED)",null,null,null,null,null,null,null,null,null,null,null,null,null,null,null,"E.  PROGRAMS AND SERVICES FOR ELs AND THEIR FAMILIES (CONTINUED)",null,null,null,null,null,null,null,null,null,null,null,null,null,null,null,"E.  PROGRAMS AND SERVICES FOR ELs AND THEIR FAMILIES (CONTINUED)",null,null,null,null,null,null,null,null,null,null,null,null,null,null,null,"E.  PROGRAMS AND SERVICES FOR ELs AND THEIR FAMILIES (CONTINUED)",null,null,null,null,null,null,null,null,null,null,null,null,null,null,null,"E.  PROGRAMS AND SERVICES FOR ELs AND THEIR FAMILIES (CONTINUED)",null,null,null,null,null,null,null,null,null,null,null,null,null,null,null,"E.  PROGRAMS AND SERVICES FOR ELs AND THEIR FAMILIES (CONTINUED)",null,null,null,null,null,null,null,null,null,null,null,null,null,null,null,"E.  PROGRAMS AND SERVICES FOR ELs AND THEIR FAMILIES (CONTINUED)",null,null,null,null,null,null,null,null,null,null,null,null,null,null,null,"E.  PROGRAMS AND SERVICES FOR ELs AND THEIR FAMILIES (CONTINUED)",null,null,null,null,null,null,null,null,null,null,null,null,null,null,null,"E.  PROGRAMS AND SERVICES FOR ELs AND THEIR FAMILIES (CONTINUED)",null,null,null,null,null,null,null,null,null,null,null,null,null,null,null,"E.  PROGRAMS AND SERVICES FOR ELs AND THEIR FAMILIES (CONTINUED)",null,null,null,null,null,null,null,null,null,null,null,null,null,null,null,"E.  PROGRAMS AND SERVICES FOR ELs AND THEIR FAMILIES (CONTINUED)",null,null,null,null,null,null,null,null,null,null,null,null,null,null,null,"E.  PROGRAMS AND SERVICES FOR ELs AND THEIR FAMILIES (CONTINUED)",null,null,null,null,null,null,null,null,null,null,null,null,null,null,null,"E.  PROGRAMS AND SERVICES FOR ELs AND THEIR FAMILIES (CONTINUED)",null,null,null,null,null,null,null,null,null,null,null,null,null,null,null,"E.  PROGRAMS AND SERVICES FOR ELs AND THEIR FAMILIES (CONTINUED)",null,null,null,null,null,null,null,null,null,null,null,null,null,null,null,"E.  PROGRAMS AND SERVICES FOR ELs AND THEIR FAMILIES (CONTINUED)",null,null,null,null,null,null,null,null,null,null,null,null,null,null,null,"E.  PROGRAMS AND SERVICES FOR ELs AND THEIR FAMILIES (CONTINUED)",null,null,null,null,null,null,null,null,null,null,null,null,null,null,null,"E.  PROGRAMS AND SERVICES FOR ELs AND THEIR FAMILIES (CONTINUED)",null,null,null,null,null,null,null,null,null,null,null,null,null,null,null,"E.  PROGRAMS AND SERVICES FOR ELs AND THEIR FAMILIES (CONTINUED)",null,null,null,null,null,null,null,null,null,null,null,null,null,null,null,"E.  PROGRAMS AND SERVICES FOR ELs AND THEIR FAMILIES (CONTINUED)",null,null,null,null,null,null,null,null,null,null,null,null,null,null,null,"E.  PROGRAMS AND SERVICES FOR ELs AND THEIR FAMILIES (CONTINUED)",null,null,null,null,null,null,null,null,null,null,null,null,null,null,null,"E.  PROGRAMS AND SERVICES FOR ELs AND THEIR FAMILIES (CONTINUED)",null,null,null,null,null,null,null,null,null,null,null,null,null,null,null,"E.  PROGRAMS AND SERVICES FOR ELs AND THEIR FAMILIES (CONTINUED)",null,null,null,null,null,null,null,null,null,null,null,null,null,null,null,"E.  PROGRAMS AND SERVICES FOR ELs AND THEIR FAMILIES (CONTINUED)",null,null,null,null,null,null,null,null,null,null,null,null,null,null,null,"E.  PROGRAMS AND SERVICES FOR ELs AND THEIR FAMILIES (CONTINUED)",null,null,null,null,null,null,null,null,null,null,null,null,null,null,null,"E.  PROGRAMS AND SERVICES FOR ELs AND THEIR FAMILIES (CONTINUED)",null,null,null,null,null,null,null,null,null,null,null,null,null,null,null,"E.  PROGRAMS AND SERVICES FOR ELs AND THEIR FAMILIES (CONTINUED)",null,null,null,null,null,null,null,null,null,null,null,null,null,null,null,"E.  PROGRAMS AND SERVICES FOR ELs AND THEIR FAMILIES (CONTINUED)",null,null,null,null,null,null,null,null,null,null,null,null,null,null,null,"E.  PROGRAMS AND SERVICES FOR ELs AND THEIR FAMILIES (CONTINUED)",null,null,null,null,null,null,null,null,null,null,null,null,null,null,null,"E.  PROGRAMS AND SERVICES FOR ELs AND THEIR FAMILIES (CONTINUED)",null,null,null,null,null,null,null,null,null,null,null,null,null,null,null,"E.  PROGRAMS AND SERVICES FOR ELs AND THEIR FAMILIES (CONTINUED)",null,null,null,null,null,null,null,null,null,null,null,null,null,null,null,"E.  PROGRAMS AND SERVICES FOR ELs AND THEIR FAMILIES (CONTINUED)",null,null,null,null,null,null,null,null,null,null,null,null,null,null,null,"E.  PROGRAMS AND SERVICES FOR ELs AND THEIR FAMILIES (CONTINUED)",null,null,null,null,null,null,null,null,null,null,null,null,null,null,null,"E.  PROGRAMS AND SERVICES FOR ELs AND THEIR FAMILIES (CONTINUED)",null,null,null,null,null,null,null,null,null,null,null,null,null,null,null,"E.  PROGRAMS AND SERVICES FOR ELs AND THEIR FAMILIES (CONTINUED)",null,null,null,null,null,null,null,null,null,null,null,null,null,null,null,"E.  PROGRAMS AND SERVICES FOR ELs AND THEIR FAMILIES (CONTINUED)",null,null,null,null,null,null,null,null,null,null,null,null,null,null,null,"E.  PROGRAMS AND SERVICES FOR ELs AND THEIR FAMILIES (CONTINUED)",null,null,null,null,null,null,null,null,null,null,null,null,null,null,null,"E.  PROGRAMS AND SERVICES FOR ELs AND THEIR FAMILIES (CONTINUED)",null,null,null,null,null,null,null,null,null,null,null,null,null,null,null,"E.  PROGRAMS AND SERVICES FOR ELs AND THEIR FAMILIES (CONTINUED)",null,null,null,null,null,null,null,null,null,null,null,null,null,null,null,"E.  PROGRAMS AND SERVICES FOR ELs AND THEIR FAMILIES (CONTINUED)",null,null,null,null,null,null,null,null,null,null,null,null,null,null,null,"E.  PROGRAMS AND SERVICES FOR ELs AND THEIR FAMILIES (CONTINUED)",null,null,null,null,null,null,null,null,null,null,null,null,null,null,null,"E.  PROGRAMS AND SERVICES FOR ELs AND THEIR FAMILIES (CONTINUED)",null,null,null,null,null,null,null,null,null,null,null,null,null,null,null,"E.  PROGRAMS AND SERVICES FOR ELs AND THEIR FAMILIES (CONTINUED)",null,null,null,null,null,null,null,null,null,null,null,null,null,null,null,"E.  PROGRAMS AND SERVICES FOR ELs AND THEIR FAMILIES (CONTINUED)",null,null,null,null,null,null,null,null,null,null,null,null,null,null,null,"E.  PROGRAMS AND SERVICES FOR ELs AND THEIR FAMILIES (CONTINUED)",null,null,null,null,null,null,null,null,null,null,null,null,null,null,null,"E.  PROGRAMS AND SERVICES FOR ELs AND THEIR FAMILIES (CONTINUED)",null,null,null,null,null,null,null,null,null,null,null,null,null,null,null,"E.  PROGRAMS AND SERVICES FOR ELs AND THEIR FAMILIES (CONTINUED)",null,null,null,null,null,null,null,null,null,null,null,null,null,null,null,"E.  PROGRAMS AND SERVICES FOR ELs AND THEIR FAMILIES (CONTINUED)",null,null,null,null,null,null,null,null,null,null,null,null,null,null,null,"E.  PROGRAMS AND SERVICES FOR ELs AND THEIR FAMILIES (CONTINUED)",null,null,null,null,null,null,null,null,null,null,null,null,null,null,null,"E.  PROGRAMS AND SERVICES FOR ELs AND THEIR FAMILIES (CONTINUED)",null,null,null,null,null,null,null,null,null,null,null,null,null,null,null,"E.  PROGRAMS AND SERVICES FOR ELs AND THEIR FAMILIES (CONTINUED)",null,null,null,null,null,null,null,null,null,null,null,null,null,null,null,"E.  PROGRAMS AND SERVICES FOR ELs AND THEIR FAMILIES (CONTINUED)",null,null,null,null,null,null,null,null,null,null,null,null,null,null,null,"E.  PROGRAMS AND SERVICES FOR ELs AND THEIR FAMILIES (CONTINUED)",null,null,null,null,null,null,null,null,null,null,null,null,null,null,null,"E.  PROGRAMS AND SERVICES FOR ELs AND THEIR FAMILIES (CONTINUED)",null,null,null,null,null,null,null,null,null,null,null,null,null,null,null,"E.  PROGRAMS AND SERVICES FOR ELs AND THEIR FAMILIES (CONTINUED)",null,null,null,null,null,null,null,null,null,null,null,null,null,null,null,"E.  PROGRAMS AND SERVICES FOR ELs AND THEIR FAMILIES (CONTINUED)",null,null,null,null,null,null,null,null,null,null,null,null,null,null,null,"E.  PROGRAMS AND SERVICES FOR ELs AND THEIR FAMILIES (CONTINUED)",null,null,null,null,null,null,null,null,null,null,null,null,null,null,null,"E.  PROGRAMS AND SERVICES FOR ELs AND THEIR FAMILIES (CONTINUED)",null,null,null,null,null,null,null,null,null,null,null,null,null,null,null,"E.  PROGRAMS AND SERVICES FOR ELs AND THEIR FAMILIES (CONTINUED)",null,null,null,null,null,null,null,null,null,null,null,null,null,null,null,"E.  PROGRAMS AND SERVICES FOR ELs AND THEIR FAMILIES (CONTINUED)",null,null,null,null,null,null,null,null,null,null,null,null,null,null,null,"E.  PROGRAMS AND SERVICES FOR ELs AND THEIR FAMILIES (CONTINUED)",null,null,null,null,null,null,null,null,null,null,null,null,null,null,null,"E.  PROGRAMS AND SERVICES FOR ELs AND THEIR FAMILIES (CONTINUED)",null,null,null,null,null,null,null,null,null,null,null,null,null,null,null,"E.  PROGRAMS AND SERVICES FOR ELs AND THEIR FAMILIES (CONTINUED)",null,null,null,null,null,null,null,null,null,null,null,null,null,null,null,"E.  PROGRAMS AND SERVICES FOR ELs AND THEIR FAMILIES (CONTINUED)",null,null,null,null,null,null,null,null,null,null,null,null,null,null,null,"E.  PROGRAMS AND SERVICES FOR ELs AND THEIR FAMILIES (CONTINUED)",null,null,null,null,null,null,null,null,null,null,null,null,null,null,null,"E.  PROGRAMS AND SERVICES FOR ELs AND THEIR FAMILIES (CONTINUED)",null,null,null,null,null,null,null,null,null,null,null,null,null,null,null,"E.  PROGRAMS AND SERVICES FOR ELs AND THEIR FAMILIES (CONTINUED)",null,null,null,null,null,null,null,null,null,null,null,null,null,null,null,"E.  PROGRAMS AND SERVICES FOR ELs AND THEIR FAMILIES (CONTINUED)",null,null,null,null,null,null,null,null,null,null,null,null,null,null,null,"E.  PROGRAMS AND SERVICES FOR ELs AND THEIR FAMILIES (CONTINUED)",null,null,null,null,null,null,null,null,null,null,null,null,null,null,null,"E.  PROGRAMS AND SERVICES FOR ELs AND THEIR FAMILIES (CONTINUED)",null,null,null,null,null,null,null,null,null,null,null,null,null,null,null,"E.  PROGRAMS AND SERVICES FOR ELs AND THEIR FAMILIES (CONTINUED)",null,null,null,null,null,null,null,null,null,null,null,null,null,null,null,"E.  PROGRAMS AND SERVICES FOR ELs AND THEIR FAMILIES (CONTINUED)",null,null,null,null,null,null,null,null,null,null,null,null,null,null,null,"E.  PROGRAMS AND SERVICES FOR ELs AND THEIR FAMILIES (CONTINUED)",null,null,null,null,null,null,null,null,null,null,null,null,null,null,null,"E.  PROGRAMS AND SERVICES FOR ELs AND THEIR FAMILIES (CONTINUED)",null,null,null,null,null,null,null,null,null,null,null,null,null,null,null,"E.  PROGRAMS AND SERVICES FOR ELs AND THEIR FAMILIES (CONTINUED)",null,null,null,null,null,null,null,null,null,null,null,null,null,null,null,"E.  PROGRAMS AND SERVICES FOR ELs AND THEIR FAMILIES (CONTINUED)",null,null,null,null,null,null,null,null,null,null,null,null,null,null,null,"E.  PROGRAMS AND SERVICES FOR ELs AND THEIR FAMILIES (CONTINUED)",null,null,null,null,null,null,null,null,null,null,null,null,null,null,null,"E.  PROGRAMS AND SERVICES FOR ELs AND THEIR FAMILIES (CONTINUED)",null,null,null,null,null,null,null,null,null,null,null,null,null,null,null,"E.  PROGRAMS AND SERVICES FOR ELs AND THEIR FAMILIES (CONTINUED)",null,null,null,null,null,null,null,null,null,null,null,null,null,null,null,"E.  PROGRAMS AND SERVICES FOR ELs AND THEIR FAMILIES (CONTINUED)",null,null,null,null,null,null,null,null,null,null,null,null,null,null,null,"E.  PROGRAMS AND SERVICES FOR ELs AND THEIR FAMILIES (CONTINUED)",null,null,null,null,null,null,null,null,null,null,null,null,null,null,null,"E.  PROGRAMS AND SERVICES FOR ELs AND THEIR FAMILIES (CONTINUED)",null,null,null,null,null,null,null,null,null,null,null,null,null,null,null,"E.  PROGRAMS AND SERVICES FOR ELs AND THEIR FAMILIES (CONTINUED)",null,null,null,null,null,null,null,null,null,null,null,null,null,null,null,"E.  PROGRAMS AND SERVICES FOR ELs AND THEIR FAMILIES (CONTINUED)",null,null,null,null,null,null,null,null,null,null,null,null,null,null,null,"E.  PROGRAMS AND SERVICES FOR ELs AND THEIR FAMILIES (CONTINUED)",null,null,null,null,null,null,null,null,null,null,null,null,null,null,null,"E.  PROGRAMS AND SERVICES FOR ELs AND THEIR FAMILIES (CONTINUED)",null,null,null,null,null,null,null,null,null,null,null,null,null,null,null,"E.  PROGRAMS AND SERVICES FOR ELs AND THEIR FAMILIES (CONTINUED)",null,null,null,null,null,null,null,null,null,null,null,null,null,null,null,"E.  PROGRAMS AND SERVICES FOR ELs AND THEIR FAMILIES (CONTINUED)",null,null,null,null,null,null,null,null,null,null,null,null,null,null,null,"E.  PROGRAMS AND SERVICES FOR ELs AND THEIR FAMILIES (CONTINUED)",null,null,null,null,null,null,null,null,null,null,null,null,null,null,null,"E.  PROGRAMS AND SERVICES FOR ELs AND THEIR FAMILIES (CONTINUED)",null,null,null,null,null,null,null,null,null,null,null,null,null,null,null,"E.  PROGRAMS AND SERVICES FOR ELs AND THEIR FAMILIES (CONTINUED)",null,null,null,null,null,null,null,null,null,null,null,null,null,null,null,"E.  PROGRAMS AND SERVICES FOR ELs AND THEIR FAMILIES (CONTINUED)",null,null,null,null,null,null,null,null,null,null,null,null,null,null,null,"E.  PROGRAMS AND SERVICES FOR ELs AND THEIR FAMILIES (CONTINUED)",null,null,null,null,null,null,null,null,null,null,null,null,null,null,null,"E.  PROGRAMS AND SERVICES FOR ELs AND THEIR FAMILIES (CONTINUED)",null,null,null,null,null,null,null,null,null,null,null,null,null,null,null,"E.  PROGRAMS AND SERVICES FOR ELs AND THEIR FAMILIES (CONTINUED)",null,null,null,null,null,null,null,null,null,null,null,null,null,null,null,"E.  PROGRAMS AND SERVICES FOR ELs AND THEIR FAMILIES (CONTINUED)",null,null,null,null,null,null,null,null,null,null,null,null,null,null,null,"E.  PROGRAMS AND SERVICES FOR ELs AND THEIR FAMILIES (CONTINUED)",null,null,null,null,null,null,null,null,null,null,null,null,null,null,null,"E.  PROGRAMS AND SERVICES FOR ELs AND THEIR FAMILIES (CONTINUED)",null,null,null,null,null,null,null,null,null,null,null,null,null,null,null,"E.  PROGRAMS AND SERVICES FOR ELs AND THEIR FAMILIES (CONTINUED)",null,null,null,null,null,null,null,null,null,null,null,null,null,null,null,"E.  PROGRAMS AND SERVICES FOR ELs AND THEIR FAMILIES (CONTINUED)",null,null,null,null,null,null,null,null,null,null,null,null,null,null,null,"E.  PROGRAMS AND SERVICES FOR ELs AND THEIR FAMILIES (CONTINUED)",null,null,null,null,null,null,null,null,null,null,null,null,null,null,null,"E.  PROGRAMS AND SERVICES FOR ELs AND THEIR FAMILIES (CONTINUED)",null,null,null,null,null,null,null,null,null,null,null,null,null,null,null,"E.  PROGRAMS AND SERVICES FOR ELs AND THEIR FAMILIES (CONTINUED)",null,null,null,null,null,null,null,null,null,null,null,null,null,null,null,"E.  PROGRAMS AND SERVICES FOR ELs AND THEIR FAMILIES (CONTINUED)",null,null,null,null,null,null,null,null,null,null,null,null,null,null,null,"E.  PROGRAMS AND SERVICES FOR ELs AND THEIR FAMILIES (CONTINUED)",null,null,null,null,null,null,null,null,null,null,null,null,null,null,null,"E.  PROGRAMS AND SERVICES FOR ELs AND THEIR FAMILIES (CONTINUED)",null,null,null,null,null,null,null,null,null,null,null,null,null,null,null,"E.  PROGRAMS AND SERVICES FOR ELs AND THEIR FAMILIES (CONTINUED)",null,null,null,null,null,null,null,null,null,null,null,null,null,null,null,"E.  PROGRAMS AND SERVICES FOR ELs AND THEIR FAMILIES (CONTINUED)",null,null,null,null,null,null,null,null,null,null,null,null,null,null,null,"E.  PROGRAMS AND SERVICES FOR ELs AND THEIR FAMILIES (CONTINUED)",null,null,null,null,null,null,null,null,null,null,null,null,null,null,null,"E.  PROGRAMS AND SERVICES FOR ELs AND THEIR FAMILIES (CONTINUED)",null,null,null,null,null,null,null,null,null,null,null,null,null,null,null,"E.  PROGRAMS AND SERVICES FOR ELs AND THEIR FAMILIES (CONTINUED)",null,null,null,null,null,null,null,null,null,null,null,null,null,null,null,"E.  PROGRAMS AND SERVICES FOR ELs AND THEIR FAMILIES (CONTINUED)",null,null,null,null,null,null,null,null,null,null,null,null,null,null,null,"E.  PROGRAMS AND SERVICES FOR ELs AND THEIR FAMILIES (CONTINUED)",null,null,null,null,null,null,null,null,null,null,null,null,null,null,null,"E.  PROGRAMS AND SERVICES FOR ELs AND THEIR FAMILIES (CONTINUED)",null,null,null,null,null,null,null,null,null,null,null,null,null,null,null,"E.  PROGRAMS AND SERVICES FOR ELs AND THEIR FAMILIES (CONTINUED)",null,null,null,null,null,null,null,null,null,null,null,null,null,null,null,"E.  PROGRAMS AND SERVICES FOR ELs AND THEIR FAMILIES (CONTINUED)",null,null,null,null,null,null,null,null,null,null,null,null,null,null,null,"E.  PROGRAMS AND SERVICES FOR ELs AND THEIR FAMILIES (CONTINUED)",null,null,null,null,null,null,null,null,null,null,null,null,null,null,null,"E.  PROGRAMS AND SERVICES FOR ELs AND THEIR FAMILIES (CONTINUED)",null,null,null,null,null,null,null,null,null,null,null,null,null,null,null,"E.  PROGRAMS AND SERVICES FOR ELs AND THEIR FAMILIES (CONTINUED)",null,null,null,null,null,null,null,null,null,null,null,null,null,null,null,"E.  PROGRAMS AND SERVICES FOR ELs AND THEIR FAMILIES (CONTINUED)",null,null,null,null,null,null,null,null,null,null,null,null,null,null,null,"E.  PROGRAMS AND SERVICES FOR ELs AND THEIR FAMILIES (CONTINUED)",null,null,null,null,null,null,null,null,null,null,null,null,null,null,null,"E.  PROGRAMS AND SERVICES FOR ELs AND THEIR FAMILIES (CONTINUED)",null,null,null,null,null,null,null,null,null,null,null,null,null,null,null,"E.  PROGRAMS AND SERVICES FOR ELs AND THEIR FAMILIES (CONTINUED)",null,null,null,null,null,null,null,null,null,null,null,null,null,null,null,"E.  PROGRAMS AND SERVICES FOR ELs AND THEIR FAMILIES (CONTINUED)",null,null,null,null,null,null,null,null,null,null,null,null,null,null,null,"E.  PROGRAMS AND SERVICES FOR ELs AND THEIR FAMILIES (CONTINUED)",null,null,null,null,null,null,null,null,null,null,null,null,null,null,null,"E.  PROGRAMS AND SERVICES FOR ELs AND THEIR FAMILIES (CONTINUED)",null,null,null,null,null,null,null,null,null,null,null,null,null,null,null,"E.  PROGRAMS AND SERVICES FOR ELs AND THEIR FAMILIES (CONTINUED)",null,null,null,null,null,null,null,null,null,null,null,null,null,null,null,"E.  PROGRAMS AND SERVICES FOR ELs AND THEIR FAMILIES (CONTINUED)",null,null,null,null,null,null,null,null,null,null,null,null,null,null,null,"E.  PROGRAMS AND SERVICES FOR ELs AND THEIR FAMILIES (CONTINUED)",null,null,null,null,null,null,null,null,null,null,null,null,null,null,null,"E.  PROGRAMS AND SERVICES FOR ELs AND THEIR FAMILIES (CONTINUED)",null,null,null,null,null,null,null,null,null,null,null,null,null,null,null,"E.  PROGRAMS AND SERVICES FOR ELs AND THEIR FAMILIES (CONTINUED)",null,null,null,null,null,null,null,null,null,null,null,null,null,null,null,"E.  PROGRAMS AND SERVICES FOR ELs AND THEIR FAMILIES (CONTINUED)",null,null,null,null,null,null,null,null,null,null,null,null,null,null,null,"E.  PROGRAMS AND SERVICES FOR ELs AND THEIR FAMILIES (CONTINUED)",null,null,null,null,null,null,null,null,null,null,null,null,null,null,null,"E.  PROGRAMS AND SERVICES FOR ELs AND THEIR FAMILIES (CONTINUED)",null,null,null,null,null,null,null,null,null,null,null,null,null,null,null,"E.  PROGRAMS AND SERVICES FOR ELs AND THEIR FAMILIES (CONTINUED)",null,null,null,null,null,null,null,null,null,null,null,null,null,null,null,"E.  PROGRAMS AND SERVICES FOR ELs AND THEIR FAMILIES (CONTINUED)",null,null,null,null,null,null,null,null,null,null,null,null,null,null,null,"E.  PROGRAMS AND SERVICES FOR ELs AND THEIR FAMILIES (CONTINUED)",null,null,null,null,null,null,null,null,null,null,null,null,null,null,null,"E.  PROGRAMS AND SERVICES FOR ELs AND THEIR FAMILIES (CONTINUED)",null,null,null,null,null,null,null,null,null,null,null,null,null,null,null,"E.  PROGRAMS AND SERVICES FOR ELs AND THEIR FAMILIES (CONTINUED)",null,null,null,null,null,null,null,null,null,null,null,null,null,null,null,"E.  PROGRAMS AND SERVICES FOR ELs AND THEIR FAMILIES (CONTINUED)",null,null,null,null,null,null,null,null,null,null,null,null,null,null,null,"E.  PROGRAMS AND SERVICES FOR ELs AND THEIR FAMILIES (CONTINUED)",null,null,null,null,null,null,null,null,null,null,null,null,null,null,null,"E.  PROGRAMS AND SERVICES FOR ELs AND THEIR FAMILIES (CONTINUED)",null,null,null,null,null,null,null,null,null,null,null,null,null,null,null,"E.  PROGRAMS AND SERVICES FOR ELs AND THEIR FAMILIES (CONTINUED)",null,null,null,null,null,null,null,null,null,null,null,null,null,null,null,"E.  PROGRAMS AND SERVICES FOR ELs AND THEIR FAMILIES (CONTINUED)",null,null,null,null,null,null,null,null,null,null,null,null,null,null,null,"E.  PROGRAMS AND SERVICES FOR ELs AND THEIR FAMILIES (CONTINUED)",null,null,null,null,null,null,null,null,null,null,null,null,null,null,null,"E.  PROGRAMS AND SERVICES FOR ELs AND THEIR FAMILIES (CONTINUED)",null,null,null,null,null,null,null,null,null,null,null,null,null,null,null,"E.  PROGRAMS AND SERVICES FOR ELs AND THEIR FAMILIES (CONTINUED)",null,null,null,null,null,null,null,null,null,null,null,null,null,null,null,"E.  PROGRAMS AND SERVICES FOR ELs AND THEIR FAMILIES (CONTINUED)",null,null,null,null,null,null,null,null,null,null,null,null,null,null,null,"E.  PROGRAMS AND SERVICES FOR ELs AND THEIR FAMILIES (CONTINUED)",null,null,null,null,null,null,null,null,null,null,null,null,null,null,null,"E.  PROGRAMS AND SERVICES FOR ELs AND THEIR FAMILIES (CONTINUED)",null,null,null,null,null,null,null,null,null,null,null,null,null,null,null,"E.  PROGRAMS AND SERVICES FOR ELs AND THEIR FAMILIES (CONTINUED)",null,null,null,null,null,null,null,null,null,null,null,null,null,null,null,"E.  PROGRAMS AND SERVICES FOR ELs AND THEIR FAMILIES (CONTINUED)",null,null,null,null,null,null,null,null,null,null,null,null,null,null,null,"E.  PROGRAMS AND SERVICES FOR ELs AND THEIR FAMILIES (CONTINUED)",null,null,null,null,null,null,null,null,null,null,null,null,null,null,null,"E.  PROGRAMS AND SERVICES FOR ELs AND THEIR FAMILIES (CONTINUED)",null,null,null,null,null,null,null,null,null,null,null,null,null,null,null,"E.  PROGRAMS AND SERVICES FOR ELs AND THEIR FAMILIES (CONTINUED)",null,null,null,null,null,null,null,null,null,null,null,null,null,null,null,"E.  PROGRAMS AND SERVICES FOR ELs AND THEIR FAMILIES (CONTINUED)",null,null,null,null,null,null,null,null,null,null,null,null,null,null,null,"E.  PROGRAMS AND SERVICES FOR ELs AND THEIR FAMILIES (CONTINUED)",null,null,null,null,null,null,null,null,null,null,null,null,null,null,null,"E.  PROGRAMS AND SERVICES FOR ELs AND THEIR FAMILIES (CONTINUED)",null,null,null,null,null,null,null,null,null,null,null,null,null,null,null,"E.  PROGRAMS AND SERVICES FOR ELs AND THEIR FAMILIES (CONTINUED)",null,null,null,null,null,null,null,null,null,null,null,null,null,null,null,"E.  PROGRAMS AND SERVICES FOR ELs AND THEIR FAMILIES (CONTINUED)",null,null,null,null,null,null,null,null,null,null,null,null,null,null,null,"E.  PROGRAMS AND SERVICES FOR ELs AND THEIR FAMILIES (CONTINUED)",null,null,null,null,null,null,null,null,null,null,null,null,null,null,null,"E.  PROGRAMS AND SERVICES FOR ELs AND THEIR FAMILIES (CONTINUED)",null,null,null,null,null,null,null,null,null,null,null,null,null,null,null,"E.  PROGRAMS AND SERVICES FOR ELs AND THEIR FAMILIES (CONTINUED)",null,null,null,null,null,null,null,null,null,null,null,null,null,null,null,"E.  PROGRAMS AND SERVICES FOR ELs AND THEIR FAMILIES (CONTINUED)",null,null,null,null,null,null,null,null,null,null,null,null,null,null,null,"E.  PROGRAMS AND SERVICES FOR ELs AND THEIR FAMILIES (CONTINUED)",null,null,null,null,null,null,null,null,null,null,null,null,null,null,null,"E.  PROGRAMS AND SERVICES FOR ELs AND THEIR FAMILIES (CONTINUED)",null,null,null,null,null,null,null,null,null,null,null,null,null,null,null,"E.  PROGRAMS AND SERVICES FOR ELs AND THEIR FAMILIES (CONTINUED)",null,null,null,null,null,null,null,null,null,null,null,null,null,null,null,"E.  PROGRAMS AND SERVICES FOR ELs AND THEIR FAMILIES (CONTINUED)",null,null,null,null,null,null,null,null,null,null,null,null,null,null,null,"E.  PROGRAMS AND SERVICES FOR ELs AND THEIR FAMILIES (CONTINUED)",null,null,null,null,null,null,null,null,null,null,null,null,null,null,null,"E.  PROGRAMS AND SERVICES FOR ELs AND THEIR FAMILIES (CONTINUED)",null,null,null,null,null,null,null,null,null,null,null,null,null,null,null,"E.  PROGRAMS AND SERVICES FOR ELs AND THEIR FAMILIES (CONTINUED)",null,null,null,null,null,null,null,null,null,null,null,null,null,null,null,"E.  PROGRAMS AND SERVICES FOR ELs AND THEIR FAMILIES (CONTINUED)",null,null,null,null,null,null,null,null,null,null,null,null,null,null,null,"E.  PROGRAMS AND SERVICES FOR ELs AND THEIR FAMILIES (CONTINUED)",null,null,null,null,null,null,null,null,null,null,null,null,null,null,null,"E.  PROGRAMS AND SERVICES FOR ELs AND THEIR FAMILIES (CONTINUED)",null,null,null,null,null,null,null,null,null,null,null,null,null,null,null,"E.  PROGRAMS AND SERVICES FOR ELs AND THEIR FAMILIES (CONTINUED)",null,null,null,null,null,null,null,null,null,null,null,null,null,null,null,"E.  PROGRAMS AND SERVICES FOR ELs AND THEIR FAMILIES (CONTINUED)",null,null,null,null,null,null,null,null,null,null,null,null,null,null,null,"E.  PROGRAMS AND SERVICES FOR ELs AND THEIR FAMILIES (CONTINUED)",null,null,null,null,null,null,null,null,null,null,null,null,null,null,null,"E.  PROGRAMS AND SERVICES FOR ELs AND THEIR FAMILIES (CONTINUED)",null,null,null,null,null,null,null,null,null,null,null,null,null,null,null,"E.  PROGRAMS AND SERVICES FOR ELs AND THEIR FAMILIES (CONTINUED)",null,null,null,null,null,null,null,null,null,null,null,null,null,null,null,"E.  PROGRAMS AND SERVICES FOR ELs AND THEIR FAMILIES (CONTINUED)",null,null,null,null,null,null,null,null,null,null,null,null,null,null,null,"E.  PROGRAMS AND SERVICES FOR ELs AND THEIR FAMILIES (CONTINUED)",null,null,null,null,null,null,null,null,null,null,null,null,null,null,null,"E.  PROGRAMS AND SERVICES FOR ELs AND THEIR FAMILIES (CONTINUED)",null,null,null,null,null,null,null,null,null,null,null,null,null,null,null,"E.  PROGRAMS AND SERVICES FOR ELs AND THEIR FAMILIES (CONTINUED)",null,null,null,null,null,null,null,null,null,null,null,null,null,null,null,"E.  PROGRAMS AND SERVICES FOR ELs AND THEIR FAMILIES (CONTINUED)",null,null,null,null,null,null,null,null,null,null,null,null,null,null,null,"E.  PROGRAMS AND SERVICES FOR ELs AND THEIR FAMILIES (CONTINUED)",null,null,null,null,null,null,null,null,null,null,null,null,null,null,null,"E.  PROGRAMS AND SERVICES FOR ELs AND THEIR FAMILIES (CONTINUED)",null,null,null,null,null,null,null,null,null,null,null,null,null,null,null,"E.  PROGRAMS AND SERVICES FOR ELs AND THEIR FAMILIES (CONTINUED)",null,null,null,null,null,null,null,null,null,null,null,null,null,null,null,"E.  PROGRAMS AND SERVICES FOR ELs AND THEIR FAMILIES (CONTINUED)",null,null,null,null,null,null,null,null,null,null,null,null,null,null,null,"E.  PROGRAMS AND SERVICES FOR ELs AND THEIR FAMILIES (CONTINUED)",null,null,null,null,null,null,null,null,null,null,null,null,null,null,null,"E.  PROGRAMS AND SERVICES FOR ELs AND THEIR FAMILIES (CONTINUED)",null,null,null,null,null,null,null,null,null,null,null,null,null,null,null,"E.  PROGRAMS AND SERVICES FOR ELs AND THEIR FAMILIES (CONTINUED)",null,null,null,null,null,null,null,null,null,null,null,null,null,null,null,"E.  PROGRAMS AND SERVICES FOR ELs AND THEIR FAMILIES (CONTINUED)",null,null,null,null,null,null,null,null,null,null,null,null,null,null,null,"E.  PROGRAMS AND SERVICES FOR ELs AND THEIR FAMILIES (CONTINUED)",null,null,null,null,null,null,null,null,null,null,null,null,null,null,null,"E.  PROGRAMS AND SERVICES FOR ELs AND THEIR FAMILIES (CONTINUED)",null,null,null,null,null,null,null,null,null,null,null,null,null,null,null,"E.  PROGRAMS AND SERVICES FOR ELs AND THEIR FAMILIES (CONTINUED)",null,null,null,null,null,null,null,null,null,null,null,null,null,null,null,"E.  PROGRAMS AND SERVICES FOR ELs AND THEIR FAMILIES (CONTINUED)",null,null,null,null,null,null,null,null,null,null,null,null,null,null,null,"E.  PROGRAMS AND SERVICES FOR ELs AND THEIR FAMILIES (CONTINUED)",null,null,null,null,null,null,null,null,null,null,null,null,null,null,null,"E.  PROGRAMS AND SERVICES FOR ELs AND THEIR FAMILIES (CONTINUED)",null,null,null,null,null,null,null,null,null,null,null,null,null,null,null,"E.  PROGRAMS AND SERVICES FOR ELs AND THEIR FAMILIES (CONTINUED)",null,null,null,null,null,null,null,null,null,null,null,null,null,null,null,"E.  PROGRAMS AND SERVICES FOR ELs AND THEIR FAMILIES (CONTINUED)",null,null,null,null,null,null,null,null,null,null,null,null,null,null,null,"E.  PROGRAMS AND SERVICES FOR ELs AND THEIR FAMILIES (CONTINUED)",null,null,null,null,null,null,null,null,null,null,null,null,null,null,null,"E.  PROGRAMS AND SERVICES FOR ELs AND THEIR FAMILIES (CONTINUED)",null,null,null,null,null,null,null,null,null,null,null,null,null,null,null,"E.  PROGRAMS AND SERVICES FOR ELs AND THEIR FAMILIES (CONTINUED)",null,null,null,null,null,null,null,null,null,null,null,null,null,null,null,"E.  PROGRAMS AND SERVICES FOR ELs AND THEIR FAMILIES (CONTINUED)",null,null,null,null,null,null,null,null,null,null,null,null,null,null,null,"E.  PROGRAMS AND SERVICES FOR ELs AND THEIR FAMILIES (CONTINUED)",null,null,null,null,null,null,null,null,null,null,null,null,null,null,null,"E.  PROGRAMS AND SERVICES FOR ELs AND THEIR FAMILIES (CONTINUED)",null,null,null,null,null,null,null,null,null,null,null,null,null,null,null,"E.  PROGRAMS AND SERVICES FOR ELs AND THEIR FAMILIES (CONTINUED)",null,null,null,null,null,null,null,null,null,null,null,null,null,null,null,"E.  PROGRAMS AND SERVICES FOR ELs AND THEIR FAMILIES (CONTINUED)",null,null,null,null,null,null,null,null,null,null,null,null,null,null,null,"E.  PROGRAMS AND SERVICES FOR ELs AND THEIR FAMILIES (CONTINUED)",null,null,null,null,null,null,null,null,null,null,null,null,null,null,null,"E.  PROGRAMS AND SERVICES FOR ELs AND THEIR FAMILIES (CONTINUED)",null,null,null,null,null,null,null,null,null,null,null,null,null,null,null,"E.  PROGRAMS AND SERVICES FOR ELs AND THEIR FAMILIES (CONTINUED)",null,null,null,null,null,null,null,null,null,null,null,null,null,null,null,"E.  PROGRAMS AND SERVICES FOR ELs AND THEIR FAMILIES (CONTINUED)",null,null,null,null,null,null,null,null,null,null,null,null,null,null,null,"E.  PROGRAMS AND SERVICES FOR ELs AND THEIR FAMILIES (CONTINUED)",null,null,null,null,null,null,null,null,null,null,null,null,null,null,null,"E.  PROGRAMS AND SERVICES FOR ELs AND THEIR FAMILIES (CONTINUED)",null,null,null,null,null,null,null,null,null,null,null,null,null,null,null,"E.  PROGRAMS AND SERVICES FOR ELs AND THEIR FAMILIES (CONTINUED)",null,null,null,null,null,null,null,null,null,null,null,null,null,null,null,"E.  PROGRAMS AND SERVICES FOR ELs AND THEIR FAMILIES (CONTINUED)",null,null,null,null,null,null,null,null,null,null,null,null,null,null,null,"E.  PROGRAMS AND SERVICES FOR ELs AND THEIR FAMILIES (CONTINUED)",null,null,null,null,null,null,null,null,null,null,null,null,null,null,null,"E.  PROGRAMS AND SERVICES FOR ELs AND THEIR FAMILIES (CONTINUED)",null,null,null,null,null,null,null,null,null,null,null,null,null,null,null,"E.  PROGRAMS AND SERVICES FOR ELs AND THEIR FAMILIES (CONTINUED)",null,null,null,null,null,null,null,null,null,null,null,null,null,null,null,"E.  PROGRAMS AND SERVICES FOR ELs AND THEIR FAMILIES (CONTINUED)",null,null,null,null,null,null,null,null,null,null,null,null,null,null,null,"E.  PROGRAMS AND SERVICES FOR ELs AND THEIR FAMILIES (CONTINUED)",null,null,null,null,null,null,null,null,null,null,null,null,null,null,null,"E.  PROGRAMS AND SERVICES FOR ELs AND THEIR FAMILIES (CONTINUED)",null,null,null,null,null,null,null,null,null,null,null,null,null,null,null,"E.  PROGRAMS AND SERVICES FOR ELs AND THEIR FAMILIES (CONTINUED)",null,null,null,null,null,null,null,null,null,null,null,null,null,null,null,"E.  PROGRAMS AND SERVICES FOR ELs AND THEIR FAMILIES (CONTINUED)",null,null,null,null,null,null,null,null,null,null,null,null,null,null,null,"E.  PROGRAMS AND SERVICES FOR ELs AND THEIR FAMILIES (CONTINUED)",null,null,null,null,null,null,null,null,null,null,null,null,null,null,null,"E.  PROGRAMS AND SERVICES FOR ELs AND THEIR FAMILIES (CONTINUED)",null,null,null,null,null,null,null,null,null,null,null,null,null,null,null,"E.  PROGRAMS AND SERVICES FOR ELs AND THEIR FAMILIES (CONTINUED)",null,null,null,null,null,null,null,null,null,null,null,null,null,null,null,"E.  PROGRAMS AND SERVICES FOR ELs AND THEIR FAMILIES (CONTINUED)",null,null,null,null,null,null,null,null,null,null,null,null,null,null,null,"E.  PROGRAMS AND SERVICES FOR ELs AND THEIR FAMILIES (CONTINUED)",null,null,null,null,null,null,null,null,null,null,null,null,null,null,null,"E.  PROGRAMS AND SERVICES FOR ELs AND THEIR FAMILIES (CONTINUED)",null,null,null,null,null,null,null,null,null,null,null,null,null,null,null,"E.  PROGRAMS AND SERVICES FOR ELs AND THEIR FAMILIES (CONTINUED)",null,null,null,null,null,null,null,null,null,null,null,null,null,null,null,"E.  PROGRAMS AND SERVICES FOR ELs AND THEIR FAMILIES (CONTINUED)",null,null,null,null,null,null,null,null,null,null,null,null,null,null,null,"E.  PROGRAMS AND SERVICES FOR ELs AND THEIR FAMILIES (CONTINUED)",null,null,null,null,null,null,null,null,null,null,null,null,null,null,null,"E.  PROGRAMS AND SERVICES FOR ELs AND THEIR FAMILIES (CONTINUED)",null,null,null,null,null,null,null,null,null,null,null,null,null,null,null,"E.  PROGRAMS AND SERVICES FOR ELs AND THEIR FAMILIES (CONTINUED)",null,null,null,null,null,null,null,null,null,null,null,null,null,null,null,"E.  PROGRAMS AND SERVICES FOR ELs AND THEIR FAMILIES (CONTINUED)",null,null,null,null,null,null,null,null,null,null,null,null,null,null,null,"E.  PROGRAMS AND SERVICES FOR ELs AND THEIR FAMILIES (CONTINUED)",null,null,null,null,null,null,null,null,null,null,null,null,null,null,null,"E.  PROGRAMS AND SERVICES FOR ELs AND THEIR FAMILIES (CONTINUED)",null,null,null,null,null,null,null,null,null,null,null,null,null,null,null,"E.  PROGRAMS AND SERVICES FOR ELs AND THEIR FAMILIES (CONTINUED)",null,null,null,null,null,null,null,null,null,null,null,null,null,null,null,"E.  PROGRAMS AND SERVICES FOR ELs AND THEIR FAMILIES (CONTINUED)",null,null,null,null,null,null,null,null,null,null,null,null,null,null,null,"E.  PROGRAMS AND SERVICES FOR ELs AND THEIR FAMILIES (CONTINUED)",null,null,null,null,null,null,null,null,null,null,null,null,null,null,null,"E.  PROGRAMS AND SERVICES FOR ELs AND THEIR FAMILIES (CONTINUED)",null,null,null,null,null,null,null,null,null,null,null,null,null,null,null,"E.  PROGRAMS AND SERVICES FOR ELs AND THEIR FAMILIES (CONTINUED)",null,null,null,null,null,null,null,null,null,null,null,null,null,null,null,"E.  PROGRAMS AND SERVICES FOR ELs AND THEIR FAMILIES (CONTINUED)",null,null,null,null,null,null,null,null,null,null,null,null,null,null,null,"E.  PROGRAMS AND SERVICES FOR ELs AND THEIR FAMILIES (CONTINUED)",null,null,null,null,null,null,null,null,null,null,null,null,null,null,null,"E.  PROGRAMS AND SERVICES FOR ELs AND THEIR FAMILIES (CONTINUED)",null,null,null,null,null,null,null,null,null,null,null,null,null,null,null,"E.  PROGRAMS AND SERVICES FOR ELs AND THEIR FAMILIES (CONTINUED)",null,null,null,null,null,null,null,null,null,null,null,null,null,null,null,"E.  PROGRAMS AND SERVICES FOR ELs AND THEIR FAMILIES (CONTINUED)",null,null,null,null,null,null,null,null,null,null,null,null,null,null,null,"E.  PROGRAMS AND SERVICES FOR ELs AND THEIR FAMILIES (CONTINUED)",null,null,null,null,null,null,null,null,null,null,null,null,null,null,null,"E.  PROGRAMS AND SERVICES FOR ELs AND THEIR FAMILIES (CONTINUED)",null,null,null,null,null,null,null,null,null,null,null,null,null,null,null,"E.  PROGRAMS AND SERVICES FOR ELs AND THEIR FAMILIES (CONTINUED)",null,null,null,null,null,null,null,null,null,null,null,null,null,null,null,"E.  PROGRAMS AND SERVICES FOR ELs AND THEIR FAMILIES (CONTINUED)",null,null,null,null,null,null,null,null,null,null,null,null,null,null,null,"E.  PROGRAMS AND SERVICES FOR ELs AND THEIR FAMILIES (CONTINUED)",null,null,null,null,null,null,null,null,null,null,null,null,null,null,null,"E.  PROGRAMS AND SERVICES FOR ELs AND THEIR FAMILIES (CONTINUED)",null,null,null,null,null,null,null,null,null,null,null,null,null,null,null,"E.  PROGRAMS AND SERVICES FOR ELs AND THEIR FAMILIES (CONTINUED)",null,null,null,null,null,null,null,null,null,null,null,null,null,null,null,"E.  PROGRAMS AND SERVICES FOR ELs AND THEIR FAMILIES (CONTINUED)",null,null,null,null,null,null,null,null,null,null,null,null,null,null,null,"E.  PROGRAMS AND SERVICES FOR ELs AND THEIR FAMILIES (CONTINUED)",null,null,null,null,null,null,null,null,null,null,null,null,null,null,null,"E.  PROGRAMS AND SERVICES FOR ELs AND THEIR FAMILIES (CONTINUED)",null,null,null,null,null,null,null,null,null,null,null,null,null,null,null,"E.  PROGRAMS AND SERVICES FOR ELs AND THEIR FAMILIES (CONTINUED)",null,null,null,null,null,null,null,null,null,null,null,null,null,null,null,"E.  PROGRAMS AND SERVICES FOR ELs AND THEIR FAMILIES (CONTINUED)",null,null,null,null,null,null,null,null,null,null,null,null,null,null,null,"E.  PROGRAMS AND SERVICES FOR ELs AND THEIR FAMILIES (CONTINUED)",null,null,null,null,null,null,null,null,null,null,null,null,null,null,null,"E.  PROGRAMS AND SERVICES FOR ELs AND THEIR FAMILIES (CONTINUED)",null,null,null,null,null,null,null,null,null,null,null,null,null,null,null,"E.  PROGRAMS AND SERVICES FOR ELs AND THEIR FAMILIES (CONTINUED)",null,null,null,null,null,null,null,null,null,null,null,null,null,null,null,"E.  PROGRAMS AND SERVICES FOR ELs AND THEIR FAMILIES (CONTINUED)",null,null,null,null,null,null,null,null,null,null,null,null,null,null,null,"E.  PROGRAMS AND SERVICES FOR ELs AND THEIR FAMILIES (CONTINUED)",null,null,null,null,null,null,null,null,null,null,null,null,null,null,null,"E.  PROGRAMS AND SERVICES FOR ELs AND THEIR FAMILIES (CONTINUED)",null,null,null,null,null,null,null,null,null,null,null,null,null,null,null,"E.  PROGRAMS AND SERVICES FOR ELs AND THEIR FAMILIES (CONTINUED)",null,null,null,null,null,null,null,null,null,null,null,null,null,null,null,"E.  PROGRAMS AND SERVICES FOR ELs AND THEIR FAMILIES (CONTINUED)",null,null,null,null,null,null,null,null,null,null,null,null,null,null,null,"E.  PROGRAMS AND SERVICES FOR ELs AND THEIR FAMILIES (CONTINUED)",null,null,null,null,null,null,null,null,null,null,null,null,null,null,null,"E.  PROGRAMS AND SERVICES FOR ELs AND THEIR FAMILIES (CONTINUED)",null,null,null,null,null,null,null,null,null,null,null,null,null,null,null,"E.  PROGRAMS AND SERVICES FOR ELs AND THEIR FAMILIES (CONTINUED)",null,null,null,null,null,null,null,null,null,null,null,null,null,null,null,"E.  PROGRAMS AND SERVICES FOR ELs AND THEIR FAMILIES (CONTINUED)",null,null,null,null,null,null,null,null,null,null,null,null,null,null,null,"E.  PROGRAMS AND SERVICES FOR ELs AND THEIR FAMILIES (CONTINUED)",null,null,null,null,null,null,null,null,null,null,null,null,null,null,null,"E.  PROGRAMS AND SERVICES FOR ELs AND THEIR FAMILIES (CONTINUED)",null,null,null,null,null,null,null,null,null,null,null,null,null,null,null,"E.  PROGRAMS AND SERVICES FOR ELs AND THEIR FAMILIES (CONTINUED)",null,null,null,null,null,null,null,null,null,null,null,null,null,null,null,"E.  PROGRAMS AND SERVICES FOR ELs AND THEIR FAMILIES (CONTINUED)",null,null,null,null,null,null,null,null,null,null,null,null,null,null,null,"E.  PROGRAMS AND SERVICES FOR ELs AND THEIR FAMILIES (CONTINUED)",null,null,null,null,null,null,null,null,null,null,null,null,null,null,null,"E.  PROGRAMS AND SERVICES FOR ELs AND THEIR FAMILIES (CONTINUED)",null,null,null,null,null,null,null,null,null,null,null,null,null,null,null,"E.  PROGRAMS AND SERVICES FOR ELs AND THEIR FAMILIES (CONTINUED)",null,null,null,null,null,null,null,null,null,null,null,null,null,null,null,"E.  PROGRAMS AND SERVICES FOR ELs AND THEIR FAMILIES (CONTINUED)",null,null,null,null,null,null,null,null,null,null,null,null,null,null,null,"E.  PROGRAMS AND SERVICES FOR ELs AND THEIR FAMILIES (CONTINUED)",null,null,null,null,null,null,null,null,null,null,null,null,null,null,null,"E.  PROGRAMS AND SERVICES FOR ELs AND THEIR FAMILIES (CONTINUED)",null,null,null,null,null,null,null,null,null,null,null,null,null,null,null,"E.  PROGRAMS AND SERVICES FOR ELs AND THEIR FAMILIES (CONTINUED)",null,null,null,null,null,null,null,null,null,null,null,null,null,null,null,"E.  PROGRAMS AND SERVICES FOR ELs AND THEIR FAMILIES (CONTINUED)",null,null,null,null,null,null,null,null,null,null,null,null,null,null,null,"E.  PROGRAMS AND SERVICES FOR ELs AND THEIR FAMILIES (CONTINUED)",null,null,null,null,null,null,null,null,null,null,null,null,null,null,null,"E.  PROGRAMS AND SERVICES FOR ELs AND THEIR FAMILIES (CONTINUED)",null,null,null,null,null,null,null,null,null,null,null,null,null,null,null,"E.  PROGRAMS AND SERVICES FOR ELs AND THEIR FAMILIES (CONTINUED)",null,null,null,null,null,null,null,null,null,null,null,null,null,null,null,"E.  PROGRAMS AND SERVICES FOR ELs AND THEIR FAMILIES (CONTINUED)",null,null,null,null,null,null,null,null,null,null,null,null,null,null,null,"E.  PROGRAMS AND SERVICES FOR ELs AND THEIR FAMILIES (CONTINUED)",null,null,null,null,null,null,null,null,null,null,null,null,null,null,null,"E.  PROGRAMS AND SERVICES FOR ELs AND THEIR FAMILIES (CONTINUED)",null,null,null,null,null,null,null,null,null,null,null,null,null,null,null,"E.  PROGRAMS AND SERVICES FOR ELs AND THEIR FAMILIES (CONTINUED)",null,null,null,null,null,null,null,null,null,null,null,null,null,null,null,"E.  PROGRAMS AND SERVICES FOR ELs AND THEIR FAMILIES (CONTINUED)",null,null,null,null,null,null,null,null,null,null,null,null,null,null,null,"E.  PROGRAMS AND SERVICES FOR ELs AND THEIR FAMILIES (CONTINUED)",null,null,null,null,null,null,null,null,null,null,null,null,null,null,null,"E.  PROGRAMS AND SERVICES FOR ELs AND THEIR FAMILIES (CONTINUED)",null,null,null,null,null,null,null,null,null,null,null,null,null,null,null,"E.  PROGRAMS AND SERVICES FOR ELs AND THEIR FAMILIES (CONTINUED)",null,null,null,null,null,null,null,null,null,null,null,null,null,null,null,"E.  PROGRAMS AND SERVICES FOR ELs AND THEIR FAMILIES (CONTINUED)",null,null,null,null,null,null,null,null,null,null,null,null,null,null,null,"E.  PROGRAMS AND SERVICES FOR ELs AND THEIR FAMILIES (CONTINUED)",null,null,null,null,null,null,null,null,null,null,null,null,null,null,null,"E.  PROGRAMS AND SERVICES FOR ELs AND THEIR FAMILIES (CONTINUED)",null,null,null,null,null,null,null,null,null,null,null,null,null,null,null,"E.  PROGRAMS AND SERVICES FOR ELs AND THEIR FAMILIES (CONTINUED)",null,null,null,null,null,null,null,null,null,null,null,null,null,null,null,"E.  PROGRAMS AND SERVICES FOR ELs AND THEIR FAMILIES (CONTINUED)",null,null,null,null,null,null,null,null,null,null,null,null,null,null,null,"E.  PROGRAMS AND SERVICES FOR ELs AND THEIR FAMILIES (CONTINUED)",null,null,null,null,null,null,null,null,null,null,null,null,null,null,null,"E.  PROGRAMS AND SERVICES FOR ELs AND THEIR FAMILIES (CONTINUED)",null,null,null,null,null,null,null,null,null,null,null,null,null,null,null,"E.  PROGRAMS AND SERVICES FOR ELs AND THEIR FAMILIES (CONTINUED)",null,null,null,null,null,null,null,null,null,null,null,null,null,null,null,"E.  PROGRAMS AND SERVICES FOR ELs AND THEIR FAMILIES (CONTINUED)",null,null,null,null,null,null,null,null,null,null,null,null,null,null,null,"E.  PROGRAMS AND SERVICES FOR ELs AND THEIR FAMILIES (CONTINUED)",null,null,null,null,null,null,null,null,null,null,null,null,null,null,null,"E.  PROGRAMS AND SERVICES FOR ELs AND THEIR FAMILIES (CONTINUED)",null,null,null,null,null,null,null,null,null,null,null,null,null,null,null,"E.  PROGRAMS AND SERVICES FOR ELs AND THEIR FAMILIES (CONTINUED)",null,null,null,null,null,null,null,null,null,null,null,null,null,null,null,"E.  PROGRAMS AND SERVICES FOR ELs AND THEIR FAMILIES (CONTINUED)",null,null,null,null,null,null,null,null,null,null,null,null,null,null,null,"E.  PROGRAMS AND SERVICES FOR ELs AND THEIR FAMILIES (CONTINUED)",null,null,null,null,null,null,null,null,null,null,null,null,null,null,null,"E.  PROGRAMS AND SERVICES FOR ELs AND THEIR FAMILIES (CONTINUED)",null,null,null,null,null,null,null,null,null,null,null,null,null,null,null,"E.  PROGRAMS AND SERVICES FOR ELs AND THEIR FAMILIES (CONTINUED)",null,null,null,null,null,null,null,null,null,null,null,null,null,null,null,"E.  PROGRAMS AND SERVICES FOR ELs AND THEIR FAMILIES (CONTINUED)",null,null,null,null,null,null,null,null,null,null,null,null,null,null,null,"E.  PROGRAMS AND SERVICES FOR ELs AND THEIR FAMILIES (CONTINUED)",null,null,null,null,null,null,null,null,null,null,null,null,null,null,null,"E.  PROGRAMS AND SERVICES FOR ELs AND THEIR FAMILIES (CONTINUED)",null,null,null,null,null,null,null,null,null,null,null,null,null,null,null,"E.  PROGRAMS AND SERVICES FOR ELs AND THEIR FAMILIES (CONTINUED)",null,null,null,null,null,null,null,null,null,null,null,null,null,null,null,"E.  PROGRAMS AND SERVICES FOR ELs AND THEIR FAMILIES (CONTINUED)",null,null,null,null,null,null,null,null,null,null,null,null,null,null,null,"E.  PROGRAMS AND SERVICES FOR ELs AND THEIR FAMILIES (CONTINUED)",null,null,null,null,null,null,null,null,null,null,null,null,null,null,null,"E.  PROGRAMS AND SERVICES FOR ELs AND THEIR FAMILIES (CONTINUED)",null,null,null,null,null,null,null,null,null,null,null,null,null,null,null,"E.  PROGRAMS AND SERVICES FOR ELs AND THEIR FAMILIES (CONTINUED)",null,null,null,null,null,null,null,null,null,null,null,null,null,null,null,"E.  PROGRAMS AND SERVICES FOR ELs AND THEIR FAMILIES (CONTINUED)",null,null,null,null,null,null,null,null,null,null,null,null,null,null,null,"E.  PROGRAMS AND SERVICES FOR ELs AND THEIR FAMILIES (CONTINUED)",null,null,null,null,null,null,null,null,null,null,null,null,null,null,null,"E.  PROGRAMS AND SERVICES FOR ELs AND THEIR FAMILIES (CONTINUED)",null,null,null,null,null,null,null,null,null,null,null,null,null,null,null,"E.  PROGRAMS AND SERVICES FOR ELs AND THEIR FAMILIES (CONTINUED)",null,null,null,null,null,null,null,null,null,null,null,null,null,null,null,"E.  PROGRAMS AND SERVICES FOR ELs AND THEIR FAMILIES (CONTINUED)",null,null,null,null,null,null,null,null,null,null,null,null,null,null,null,"E.  PROGRAMS AND SERVICES FOR ELs AND THEIR FAMILIES (CONTINUED)",null,null,null,null,null,null,null,null,null,null,null,null,null,null,null,"E.  PROGRAMS AND SERVICES FOR ELs AND THEIR FAMILIES (CONTINUED)",null,null,null,null,null,null,null,null,null,null,null,null,null,null,null,"E.  PROGRAMS AND SERVICES FOR ELs AND THEIR FAMILIES (CONTINUED)",null,null,null,null,null,null,null,null,null,null,null,null,null,null,null,"E.  PROGRAMS AND SERVICES FOR ELs AND THEIR FAMILIES (CONTINUED)",null,null,null,null,null,null,null,null,null,null,null,null,null,null,null,"E.  PROGRAMS AND SERVICES FOR ELs AND THEIR FAMILIES (CONTINUED)",null,null,null,null,null,null,null,null,null,null,null,null,null,null,null,"E.  PROGRAMS AND SERVICES FOR ELs AND THEIR FAMILIES (CONTINUED)",null,null,null,null,null,null,null,null,null,null,null,null,null,null,null,"E.  PROGRAMS AND SERVICES FOR ELs AND THEIR FAMILIES (CONTINUED)",null,null,null,null,null,null,null,null,null,null,null,null,null,null,null,"E.  PROGRAMS AND SERVICES FOR ELs AND THEIR FAMILIES (CONTINUED)",null,null,null,null,null,null,null,null,null,null,null,null,null,null,null,"E.  PROGRAMS AND SERVICES FOR ELs AND THEIR FAMILIES (CONTINUED)",null,null,null,null,null,null,null,null,null,null,null,null,null,null,null,"E.  PROGRAMS AND SERVICES FOR ELs AND THEIR FAMILIES (CONTINUED)",null,null,null,null,null,null,null,null,null,null,null,null,null,null,null,"E.  PROGRAMS AND SERVICES FOR ELs AND THEIR FAMILIES (CONTINUED)",null,null,null,null,null,null,null,null,null,null,null,null,null,null,null,"E.  PROGRAMS AND SERVICES FOR ELs AND THEIR FAMILIES (CONTINUED)",null,null,null,null,null,null,null,null,null,null,null,null,null,null,null,"E.  PROGRAMS AND SERVICES FOR ELs AND THEIR FAMILIES (CONTINUED)",null,null,null,null,null,null,null,null,null,null,null,null,null,null,null,"E.  PROGRAMS AND SERVICES FOR ELs AND THEIR FAMILIES (CONTINUED)",null,null,null,null,null,null,null,null,null,null,null,null,null,null,null,"E.  PROGRAMS AND SERVICES FOR ELs AND THEIR FAMILIES (CONTINUED)",null,null,null,null,null,null,null,null,null,null,null,null,null,null,null,"E.  PROGRAMS AND SERVICES FOR ELs AND THEIR FAMILIES (CONTINUED)",null,null,null,null,null,null,null,null,null,null,null,null,null,null,null,"E.  PROGRAMS AND SERVICES FOR ELs AND THEIR FAMILIES (CONTINUED)",null,null,null,null,null,null,null,null,null,null,null,null,null,null,null,"E.  PROGRAMS AND SERVICES FOR ELs AND THEIR FAMILIES (CONTINUED)",null,null,null,null,null,null,null,null,null,null,null,null,null,null,null,"E.  PROGRAMS AND SERVICES FOR ELs AND THEIR FAMILIES (CONTINUED)",null,null,null,null,null,null,null,null,null,null,null,null,null,null,null,"E.  PROGRAMS AND SERVICES FOR ELs AND THEIR FAMILIES (CONTINUED)",null,null,null,null,null,null,null,null,null,null,null,null,null,null,null,"E.  PROGRAMS AND SERVICES FOR ELs AND THEIR FAMILIES (CONTINUED)",null,null,null,null,null,null,null,null,null,null,null,null,null,null,null,"E.  PROGRAMS AND SERVICES FOR ELs AND THEIR FAMILIES (CONTINUED)",null,null,null,null,null,null,null,null,null,null,null,null,null,null,null,"E.  PROGRAMS AND SERVICES FOR ELs AND THEIR FAMILIES (CONTINUED)",null,null,null,null,null,null,null,null,null,null,null,null,null,null,null,"E.  PROGRAMS AND SERVICES FOR ELs AND THEIR FAMILIES (CONTINUED)",null,null,null,null,null,null,null,null,null,null,null,null,null,null,null,"E.  PROGRAMS AND SERVICES FOR ELs AND THEIR FAMILIES (CONTINUED)",null,null,null,null,null,null,null,null,null,null,null,null,null,null,null,"E.  PROGRAMS AND SERVICES FOR ELs AND THEIR FAMILIES (CONTINUED)",null,null,null,null,null,null,null,null,null,null,null,null,null,null,null,"E.  PROGRAMS AND SERVICES FOR ELs AND THEIR FAMILIES (CONTINUED)",null,null,null,null,null,null,null,null,null,null,null,null,null,null,null,"E.  PROGRAMS AND SERVICES FOR ELs AND THEIR FAMILIES (CONTINUED)",null,null,null,null,null,null,null,null,null,null,null,null,null,null,null,"E.  PROGRAMS AND SERVICES FOR ELs AND THEIR FAMILIES (CONTINUED)",null,null,null,null,null,null,null,null,null,null,null,null,null,null,null,"E.  PROGRAMS AND SERVICES FOR ELs AND THEIR FAMILIES (CONTINUED)",null,null,null,null,null,null,null,null,null,null,null,null,null,null,null,"E.  PROGRAMS AND SERVICES FOR ELs AND THEIR FAMILIES (CONTINUED)",null,null,null,null,null,null,null,null,null,null,null,null,null,null,null,"E.  PROGRAMS AND SERVICES FOR ELs AND THEIR FAMILIES (CONTINUED)",null,null,null,null,null,null,null,null,null,null,null,null,null,null,null,"E.  PROGRAMS AND SERVICES FOR ELs AND THEIR FAMILIES (CONTINUED)",null,null,null,null,null,null,null,null,null,null,null,null,null,null,null,"E.  PROGRAMS AND SERVICES FOR ELs AND THEIR FAMILIES (CONTINUED)",null,null,null,null,null,null,null,null,null,null,null,null,null,null,null,"E.  PROGRAMS AND SERVICES FOR ELs AND THEIR FAMILIES (CONTINUED)",null,null,null,null,null,null,null,null,null,null,null,null,null,null,null,"E.  PROGRAMS AND SERVICES FOR ELs AND THEIR FAMILIES (CONTINUED)",null,null,null,null,null,null,null,null,null,null,null,null,null,null,null,"E.  PROGRAMS AND SERVICES FOR ELs AND THEIR FAMILIES (CONTINUED)",null,null,null,null,null,null,null,null,null,null,null,null,null,null,null,"E.  PROGRAMS AND SERVICES FOR ELs AND THEIR FAMILIES (CONTINUED)",null,null,null,null,null,null,null,null,null,null,null,null,null,null,null,"E.  PROGRAMS AND SERVICES FOR ELs AND THEIR FAMILIES (CONTINUED)",null,null,null,null,null,null,null,null,null,null,null,null,null,null,null,"E.  PROGRAMS AND SERVICES FOR ELs AND THEIR FAMILIES (CONTINUED)",null,null,null,null,null,null,null,null,null,null,null,null,null,null,null,"E.  PROGRAMS AND SERVICES FOR ELs AND THEIR FAMILIES (CONTINUED)",null,null,null,null,null,null,null,null,null,null,null,null,null,null,null,"E.  PROGRAMS AND SERVICES FOR ELs AND THEIR FAMILIES (CONTINUED)",null,null,null,null,null,null,null,null,null,null,null,null,null,null,null,"E.  PROGRAMS AND SERVICES FOR ELs AND THEIR FAMILIES (CONTINUED)",null,null,null,null,null,null,null,null,null,null,null,null,null,null,null,"E.  PROGRAMS AND SERVICES FOR ELs AND THEIR FAMILIES (CONTINUED)",null,null,null,null,null,null,null,null,null,null,null,null,null,null,null,"E.  PROGRAMS AND SERVICES FOR ELs AND THEIR FAMILIES (CONTINUED)",null,null,null,null,null,null,null,null,null,null,null,null,null,null,null,"E.  PROGRAMS AND SERVICES FOR ELs AND THEIR FAMILIES (CONTINUED)",null,null,null,null,null,null,null,null,null,null,null,null,null,null,null,"E.  PROGRAMS AND SERVICES FOR ELs AND THEIR FAMILIES (CONTINUED)",null,null,null,null,null,null,null,null,null,null,null,null,null,null,null,"E.  PROGRAMS AND SERVICES FOR ELs AND THEIR FAMILIES (CONTINUED)",null,null,null,null,null,null,null,null,null,null,null,null,null,null,null,"E.  PROGRAMS AND SERVICES FOR ELs AND THEIR FAMILIES (CONTINUED)",null,null,null,null,null,null,null,null,null,null,null,null,null,null,null,"E.  PROGRAMS AND SERVICES FOR ELs AND THEIR FAMILIES (CONTINUED)",null,null,null,null,null,null,null,null,null,null,null,null,null,null,null,"E.  PROGRAMS AND SERVICES FOR ELs AND THEIR FAMILIES (CONTINUED)",null,null,null,null,null,null,null,null,null,null,null,null,null,null,null,"E.  PROGRAMS AND SERVICES FOR ELs AND THEIR FAMILIES (CONTINUED)",null,null,null,null,null,null,null,null,null,null,null,null,null,null,null,"E.  PROGRAMS AND SERVICES FOR ELs AND THEIR FAMILIES (CONTINUED)",null,null,null,null,null,null,null,null,null,null,null,null,null,null,null,"E.  PROGRAMS AND SERVICES FOR ELs AND THEIR FAMILIES (CONTINUED)",null,null,null,null,null,null,null,null,null,null,null,null,null,null,null,"E.  PROGRAMS AND SERVICES FOR ELs AND THEIR FAMILIES (CONTINUED)",null,null,null,null,null,null,null,null,null,null,null,null,null,null,null,"E.  PROGRAMS AND SERVICES FOR ELs AND THEIR FAMILIES (CONTINUED)",null,null,null,null,null,null,null,null,null,null,null,null,null,null,null,"E.  PROGRAMS AND SERVICES FOR ELs AND THEIR FAMILIES (CONTINUED)",null,null,null,null,null,null,null,null,null,null,null,null,null,null,null,"E.  PROGRAMS AND SERVICES FOR ELs AND THEIR FAMILIES (CONTINUED)",null,null,null,null,null,null,null,null,null,null,null,null,null,null,null,"E.  PROGRAMS AND SERVICES FOR ELs AND THEIR FAMILIES (CONTINUED)",null,null,null,null,null,null,null,null,null,null,null,null,null,null,null,"E.  PROGRAMS AND SERVICES FOR ELs AND THEIR FAMILIES (CONTINUED)",null,null,null,null,null,null,null,null,null,null,null,null,null,null,null,"E.  PROGRAMS AND SERVICES FOR ELs AND THEIR FAMILIES (CONTINUED)",null,null,null,null,null,null,null,null,null,null,null,null,null,null,null,"E.  PROGRAMS AND SERVICES FOR ELs AND THEIR FAMILIES (CONTINUED)",null,null,null,null,null,null,null,null,null,null,null,null,null,null,null,"E.  PROGRAMS AND SERVICES FOR ELs AND THEIR FAMILIES (CONTINUED)",null,null,null,null,null,null,null,null,null,null,null,null,null,null,null,"E.  PROGRAMS AND SERVICES FOR ELs AND THEIR FAMILIES (CONTINUED)",null,null,null,null,null,null,null,null,null,null,null,null,null,null,null,"E.  PROGRAMS AND SERVICES FOR ELs AND THEIR FAMILIES (CONTINUED)",null,null,null,null,null,null,null,null,null,null,null,null,null,null,null,"E.  PROGRAMS AND SERVICES FOR ELs AND THEIR FAMILIES (CONTINUED)",null,null,null,null,null,null,null,null,null,null,null,null,null,null,null,"E.  PROGRAMS AND SERVICES FOR ELs AND THEIR FAMILIES (CONTINUED)",null,null,null,null,null,null,null,null,null,null,null,null,null,null,null,"E.  PROGRAMS AND SERVICES FOR ELs AND THEIR FAMILIES (CONTINUED)",null,null,null,null,null,null,null,null,null,null,null,null,null,null,null,"E.  PROGRAMS AND SERVICES FOR ELs AND THEIR FAMILIES (CONTINUED)",null,null,null,null,null,null,null,null,null,null,null,null,null,null,null,"E.  PROGRAMS AND SERVICES FOR ELs AND THEIR FAMILIES (CONTINUED)",null,null,null,null,null,null,null,null,null,null,null,null,null,null,null,"E.  PROGRAMS AND SERVICES FOR ELs AND THEIR FAMILIES (CONTINUED)",null,null,null,null,null,null,null,null,null,null,null,null,null,null,null,"E.  PROGRAMS AND SERVICES FOR ELs AND THEIR FAMILIES (CONTINUED)",null,null,null,null,null,null,null,null,null,null,null,null,null,null,null,"E.  PROGRAMS AND SERVICES FOR ELs AND THEIR FAMILIES (CONTINUED)",null,null,null,null,null,null,null,null,null,null,null,null,null,null,null,"E.  PROGRAMS AND SERVICES FOR ELs AND THEIR FAMILIES (CONTINUED)",null,null,null,null,null,null,null,null,null,null,null,null,null,null,null,"E.  PROGRAMS AND SERVICES FOR ELs AND THEIR FAMILIES (CONTINUED)",null,null,null,null,null,null,null,null,null,null,null,null,null,null,null,"E.  PROGRAMS AND SERVICES FOR ELs AND THEIR FAMILIES (CONTINUED)",null,null,null,null,null,null,null,null,null,null,null,null,null,null,null,"E.  PROGRAMS AND SERVICES FOR ELs AND THEIR FAMILIES (CONTINUED)",null,null,null,null,null,null,null,null,null,null,null,null,null,null,null,"E.  PROGRAMS AND SERVICES FOR ELs AND THEIR FAMILIES (CONTINUED)",null,null,null,null,null,null,null,null,null,null,null,null,null,null,null,"E.  PROGRAMS AND SERVICES FOR ELs AND THEIR FAMILIES (CONTINUED)",null,null,null,null,null,null,null,null,null,null,null,null,null,null,null,"E.  PROGRAMS AND SERVICES FOR ELs AND THEIR FAMILIES (CONTINUED)",null,null,null,null,null,null,null,null,null,null,null,null,null,null,null,"E.  PROGRAMS AND SERVICES FOR ELs AND THEIR FAMILIES (CONTINUED)",null,null,null,null,null,null,null,null,null,null,null,null,null,null,null,"E.  PROGRAMS AND SERVICES FOR ELs AND THEIR FAMILIES (CONTINUED)",null,null,null,null,null,null,null,null,null,null,null,null,null,null,null,"E.  PROGRAMS AND SERVICES FOR ELs AND THEIR FAMILIES (CONTINUED)",null,null,null,null,null,null,null,null,null,null,null,null,null,null,null,"E.  PROGRAMS AND SERVICES FOR ELs AND THEIR FAMILIES (CONTINUED)",null,null,null,null,null,null,null,null,null,null,null,null,null,null,null,"E.  PROGRAMS AND SERVICES FOR ELs AND THEIR FAMILIES (CONTINUED)",null,null,null,null,null,null,null,null,null,null,null,null,null,null,null,"E.  PROGRAMS AND SERVICES FOR ELs AND THEIR FAMILIES (CONTINUED)",null,null,null,null,null,null,null,null,null,null,null,null,null,null,null,"E.  PROGRAMS AND SERVICES FOR ELs AND THEIR FAMILIES (CONTINUED)",null,null,null,null,null,null,null,null,null,null,null,null,null,null,null,"E.  PROGRAMS AND SERVICES FOR ELs AND THEIR FAMILIES (CONTINUED)",null,null,null,null,null,null,null,null,null,null,null,null,null,null,null,"E.  PROGRAMS AND SERVICES FOR ELs AND THEIR FAMILIES (CONTINUED)",null,null,null,null,null,null,null,null,null,null,null,null,null,null,null,"E.  PROGRAMS AND SERVICES FOR ELs AND THEIR FAMILIES (CONTINUED)",null,null,null,null,null,null,null,null,null,null,null,null,null,null,null,"E.  PROGRAMS AND SERVICES FOR ELs AND THEIR FAMILIES (CONTINUED)",null,null,null,null,null,null,null,null,null,null,null,null,null,null,null,"E.  PROGRAMS AND SERVICES FOR ELs AND THEIR FAMILIES (CONTINUED)",null,null,null,null,null,null,null,null,null,null,null,null,null,null,null,"E.  PROGRAMS AND SERVICES FOR ELs AND THEIR FAMILIES (CONTINUED)",null,null,null,null,null,null,null,null,null,null,null,null,null,null,null,"E.  PROGRAMS AND SERVICES FOR ELs AND THEIR FAMILIES (CONTINUED)",null,null,null,null,null,null,null,null,null,null,null,null,null,null,null,"E.  PROGRAMS AND SERVICES FOR ELs AND THEIR FAMILIES (CONTINUED)",null,null,null,null,null,null,null,null,null,null,null,null,null,null,null,"E.  PROGRAMS AND SERVICES FOR ELs AND THEIR FAMILIES (CONTINUED)",null,null,null,null,null,null,null,null,null,null,null,null,null,null,null,"E.  PROGRAMS AND SERVICES FOR ELs AND THEIR FAMILIES (CONTINUED)",null,null,null,null,null,null,null,null,null,null,null,null,null,null,null,"E.  PROGRAMS AND SERVICES FOR ELs AND THEIR FAMILIES (CONTINUED)",null,null,null,null,null,null,null,null,null,null,null,null,null,null,null,"E.  PROGRAMS AND SERVICES FOR ELs AND THEIR FAMILIES (CONTINUED)",null,null,null,null,null,null,null,null,null,null,null,null,null,null,null,"E.  PROGRAMS AND SERVICES FOR ELs AND THEIR FAMILIES (CONTINUED)",null,null,null,null,null,null,null,null,null,null,null,null,null,null,null,"E.  PROGRAMS AND SERVICES FOR ELs AND THEIR FAMILIES (CONTINUED)",null,null,null,null,null,null,null,null,null,null,null,null,null,null,null,"E.  PROGRAMS AND SERVICES FOR ELs AND THEIR FAMILIES (CONTINUED)",null,null,null,null,null,null,null,null,null,null,null,null,null,null,null,"E.  PROGRAMS AND SERVICES FOR ELs AND THEIR FAMILIES (CONTINUED)",null,null,null,null,null,null,null,null,null,null,null,null,null,null,null,"E.  PROGRAMS AND SERVICES FOR ELs AND THEIR FAMILIES (CONTINUED)",null,null,null,null,null,null,null,null,null,null,null,null,null,null,null,"E.  PROGRAMS AND SERVICES FOR ELs AND THEIR FAMILIES (CONTINUED)",null,null,null,null,null,null,null,null,null,null,null,null,null,null,null,"E.  PROGRAMS AND SERVICES FOR ELs AND THEIR FAMILIES (CONTINUED)",null,null,null,null,null,null,null,null,null,null,null,null,null,null,null,"E.  PROGRAMS AND SERVICES FOR ELs AND THEIR FAMILIES (CONTINUED)",null,null,null,null,null,null,null,null,null,null,null,null,null,null,null,"E.  PROGRAMS AND SERVICES FOR ELs AND THEIR FAMILIES (CONTINUED)",null,null,null,null,null,null,null,null,null,null,null,null,null,null,null,"E.  PROGRAMS AND SERVICES FOR ELs AND THEIR FAMILIES (CONTINUED)",null,null,null,null,null,null,null,null,null,null,null,null,null,null,null,"E.  PROGRAMS AND SERVICES FOR ELs AND THEIR FAMILIES (CONTINUED)",null,null,null,null,null,null,null,null,null,null,null,null,null,null,null,"E.  PROGRAMS AND SERVICES FOR ELs AND THEIR FAMILIES (CONTINUED)",null,null,null,null,null,null,null,null,null,null,null,null,null,null,null,"E.  PROGRAMS AND SERVICES FOR ELs AND THEIR FAMILIES (CONTINUED)",null,null,null,null,null,null,null,null,null,null,null,null,null,null,null,"E.  PROGRAMS AND SERVICES FOR ELs AND THEIR FAMILIES (CONTINUED)",null,null,null,null,null,null,null,null,null,null,null,null,null,null,null,"E.  PROGRAMS AND SERVICES FOR ELs AND THEIR FAMILIES (CONTINUED)",null,null,null,null,null,null,null,null,null,null,null,null,null,null,null,"E.  PROGRAMS AND SERVICES FOR ELs AND THEIR FAMILIES (CONTINUED)",null,null,null,null,null,null,null,null,null,null,null,null,null,null,null,"E.  PROGRAMS AND SERVICES FOR ELs AND THEIR FAMILIES (CONTINUED)",null,null,null,null,null,null,null,null,null,null,null,null,null,null,null,"E.  PROGRAMS AND SERVICES FOR ELs AND THEIR FAMILIES (CONTINUED)",null,null,null,null,null,null,null,null,null,null,null,null,null,null,null,"E.  PROGRAMS AND SERVICES FOR ELs AND THEIR FAMILIES (CONTINUED)",null,null,null,null,null,null,null,null,null,null,null,null,null,null,null,"E.  PROGRAMS AND SERVICES FOR ELs AND THEIR FAMILIES (CONTINUED)",null,null,null,null,null,null,null,null,null,null,null,null,null,null,null,"E.  PROGRAMS AND SERVICES FOR ELs AND THEIR FAMILIES (CONTINUED)",null,null,null,null,null,null,null,null,null,null,null,null,null,null,null,"E.  PROGRAMS AND SERVICES FOR ELs AND THEIR FAMILIES (CONTINUED)",null,null,null,null,null,null,null,null,null,null,null,null,null,null,null,"E.  PROGRAMS AND SERVICES FOR ELs AND THEIR FAMILIES (CONTINUED)",null,null,null,null,null,null,null,null,null,null,null,null,null,null,null,"E.  PROGRAMS AND SERVICES FOR ELs AND THEIR FAMILIES (CONTINUED)",null,null,null,null,null,null,null,null,null,null,null,null,null,null,null,"E.  PROGRAMS AND SERVICES FOR ELs AND THEIR FAMILIES (CONTINUED)",null,null,null,null,null,null,null,null,null,null,null,null,null,null,null,"E.  PROGRAMS AND SERVICES FOR ELs AND THEIR FAMILIES (CONTINUED)",null,null,null,null,null,null,null,null,null,null,null,null,null,null,null,"E.  PROGRAMS AND SERVICES FOR ELs AND THEIR FAMILIES (CONTINUED)",null,null,null,null,null,null,null,null,null,null,null,null,null,null,null,"E.  PROGRAMS AND SERVICES FOR ELs AND THEIR FAMILIES (CONTINUED)",null,null,null,null,null,null,null,null,null,null,null,null,null,null,null,"E.  PROGRAMS AND SERVICES FOR ELs AND THEIR FAMILIES (CONTINUED)",null,null,null,null,null,null,null,null,null,null,null,null,null,null,null,"E.  PROGRAMS AND SERVICES FOR ELs AND THEIR FAMILIES (CONTINUED)",null,null,null,null,null,null,null,null,null,null,null,null,null,null,null,"E.  PROGRAMS AND SERVICES FOR ELs AND THEIR FAMILIES (CONTINUED)",null,null,null,null,null,null,null,null,null,null,null,null,null,null,null,"E.  PROGRAMS AND SERVICES FOR ELs AND THEIR FAMILIES (CONTINUED)",null,null,null,null,null,null,null,null,null,null,null,null,null,null,null,"E.  PROGRAMS AND SERVICES FOR ELs AND THEIR FAMILIES (CONTINUED)",null,null,null,null,null,null,null,null,null,null,null,null,null,null,null,"E.  PROGRAMS AND SERVICES FOR ELs AND THEIR FAMILIES (CONTINUED)",null,null,null,null,null,null,null,null,null,null,null,null,null,null,null,"E.  PROGRAMS AND SERVICES FOR ELs AND THEIR FAMILIES (CONTINUED)",null,null,null,null,null,null,null,null,null,null,null,null,null,null,null,"E.  PROGRAMS AND SERVICES FOR ELs AND THEIR FAMILIES (CONTINUED)",null,null,null,null,null,null,null,null,null,null,null,null,null,null,null,"E.  PROGRAMS AND SERVICES FOR ELs AND THEIR FAMILIES (CONTINUED)",null,null,null,null,null,null,null,null,null,null,null,null,null,null,null,"E.  PROGRAMS AND SERVICES FOR ELs AND THEIR FAMILIES (CONTINUED)",null,null,null,null,null,null,null,null,null,null,null,null,null,null,null,"E.  PROGRAMS AND SERVICES FOR ELs AND THEIR FAMILIES (CONTINUED)",null,null,null,null,null,null,null,null,null,null,null,null,null,null,null,"E.  PROGRAMS AND SERVICES FOR ELs AND THEIR FAMILIES (CONTINUED)",null,null,null,null,null,null,null,null,null,null,null,null,null,null,null,"E.  PROGRAMS AND SERVICES FOR ELs AND THEIR FAMILIES (CONTINUED)",null,null,null,null,null,null,null,null,null,null,null,null,null,null,null,"E.  PROGRAMS AND SERVICES FOR ELs AND THEIR FAMILIES (CONTINUED)",null,null,null,null,null,null,null,null,null,null,null,null,null,null,null,"E.  PROGRAMS AND SERVICES FOR ELs AND THEIR FAMILIES (CONTINUED)",null,null,null,null,null,null,null,null,null,null,null,null,null,null,null,"E.  PROGRAMS AND SERVICES FOR ELs AND THEIR FAMILIES (CONTINUED)"]
["Box 8:  Coordination of Service.  Describe the partnership between this program community organizations, and other local, state and/or federal programs within the division.  Possible services could include, community partnerships, specialized programs such as the gifted program, college and career readiness, special education, pre-school, Title I, Title II, and Title IV. "]
["Partnerships with ACPS Federal Program Coordinators: The Federal Program Coordinators (Title III Migrant, Homeless, Title I, Title II) meet monthly to share and collaboratively problem-solve in order to remain aligned and efficient in our practices. \nPartnerships within the school division: (1) The ESOL Coordinator and staff partner with SPED directors, core content coordinators (known as the Lead Coach team), the Equity and Diversity Committee, and LEAD (technology) department. (2) ELs who need additional support are monitored by a team of stakeholders through the Multi-Tiered System of Supports (MTSS) and School-Based Intervention Teams (SBIT). (3) ESOL staff members provide supplemental support to Dual Language Learners (DLLs) in ACPS Preschool Programs. They regularly attend the Preschool Professional Learning Community (PLC) in order to build relationships with teachers and stay current on their instructional needs. Additionally, they provide differentiation strategies and instructional resources. (4) In addition to the Social Emotional Academic Development (SEAD), Family Engagement and Encouragement Development (FEED), and Community Engagement Teams within ACPS, the ESOL staff and teachers work with teams of teachers and administrators across content areas, Gifted and Talented Education (GTE), Career and Technology Education (CTE), counseling, attendance, discipline, and social service referrals in order to ensure equitable access and support for ELs and their families. Partnerships with community organizations: The ESOL Office collaborates with a variety of community organizations -- University of Virginia (UVA), International Rescue Committee (IRC), the Department of Social Services, Region 10, Ready Kids, Counseling Alliance of Virginia (CAVA), The Women’s Initiative, Creciendo Juntos and Sin Barreras Latino advisory groups, Boys & Girls Club, the UVA Latino Student Alliance, and SOCA (Soccer Organization of Charlottesville Area).\n\n"]
[]
["Application ESSA Compliance Components using Title III Funds"]
["Sec. 3115(g) Supplement Not Supplant: Federal funds made available under this subgrant shall be used so as to supplement the level of Federal, State and local funds that, in the absence of such availability, would have been expended for programs for English learners and immigrant children and youth and in no case to supplant such Federal, state and local public funds. \n\nSec. 3115(c)(1-3) Required Subgrantee Activities using Title III Funds"]
[]
["Box 9:  Describe how the LEA will use Title III funds to provide supplemental support, to help ELs increase EL proficiency and meet the challenging State academic standards. This may include providing resources, materials, personnel, curriculum enhancement, coordination with other programs and creative initiatives to support an effective LIEP."]
["Title III funds are used to fund personnel, activities, and materials that supplement ACPS’ core instructional programs. We welcome the county’s linguistically diverse students and ensure their academic, civic, and economic success with a rigorous curriculum and engaging pedagogy. ACPS’ Lau Plan adheres to Title I and III provisions. \nACPS uses Title III funds to offer supplementary after-school and summer programming in order to provide ELs with additional time to acquire English. Tutors are hired after school and in the summer to meet identified areas of weakness. To prevent summer regression, we target Newly Arrived, Long-Term, and ELs transitioning between elementary, middle, and high school through our supplemental Summer Immersion Excursion Program. \nA committee of ESOL teachers has developed a rubric by which we evaluate supplemental language resources, such as Imagine Learning. This supplemental English language product has interactive, targeted exercises with a student account system that allows teachers to track ELs’ linguistic progress.\n\n\n\n"]
["Page 24"]
[null,null,null,null,"School Division:",null,{"$f":"'Title III Budget'!$A$16","v":"ALBEMARLE COUNTY PUBLIC SCHOOLS"},null,null,null,null,null,"Division Number:",null,null,{"$f":"'Title III Budget'!$H$16","v":2}]
["E.  PROGRAMS AND SERVICES FOR ELs AND THEIR FAMILIES (CONTINUED)"]
[]
["Box 10.  Describe how the LEA will use Title III funds to provide supplemental support, effective professional development (PD) to support: 1) classroom teachers, 2) principals, 3) support staff, 4) administrators, and 5) others.  "]
["While the ESOL teachers participate in quarterly team PD that helps them provide targeted language lessons to ELs, focusing specific skills sets identified through ACPS’ ESOL Curriculum. The ESOL program works with the PD department to provide supplemental training to help classroom teachers, principals and division administrators, and support staff recognize the rich cultural, economic, and intellectual resources of our multilingual students, and leverage their strengths. Areas of need are based on the results of the ongoing ESOL Program Evaluation Process. The ESOL program uses Title III funds to build and expand on our in-house cadre of expert trainers by sending committed ESOL and content/classroom partners to trainings, such as the Center for Applied Linguistics’ SIOP and What’s Different About Teaching Reading to Students Learning English?. ESOL and content teacher teams collaborate to build professional learning sessions for colleagues. Additional PD workshops are offered as ACPS Opportunities Courses to all teachers across the division. An intentional effort is made to include PD workshops that support best instructional practices for teachers of ELs. With this mindset, we hope all teachers will see themselves as an ESOL teacher in that they have the skills and understandings to meet the needs of ELs. \nThis year we plan to send a team of ESOL teachers to the VATESOL, VESA, and WIDA conferences to design ACPS-specific PD on Long-Term ELs, family engagement, building background knowledge and academic vocabulary, phonemic awareness, phonics, and concepts of print and sight words. The teams will re-evaluate ACPS’ ESOL Curriculum that was collaboratively developed by ACPS teachers and was adapted from the Ontario Curriculum for ESL, the WIDA ELD Standards, the Virginia Standards of Learning, and ACPS’ Lifelong-Learner Competencies​.\n\n\n"]
[]
["Box 11.  Describe how the LEA will use Title III funds to provide supplemental support, to parent, family and community engagement activities. You may identify strategies used in coordination with other related programs, such as Title I, Part A, college and career readiness, and preschool programs."]
["Title III funds for the ESOL Family Engagement Liaison and family events will support several programs to develop stronger partnerships among families, schools, and the community in Albemarle County. ACPS recognizes that a key to ensuring improved partnerships between immigrant families and schools is breaking down the barrier of language.To this end, we have developed a division-wide system of interpretation and translation services.  The Liaison will collaborate with other division staff involved in family engagement, including the Family Engagement Encouragement Development (FEED) Team, which is a workgroup made up of Title I, Bright Stars Preschool, Community Engagement, and Social Emotional Academic Development (SEAD) Team members.  This collaboration will ensure that ESOL families’ needs are considered in all division family engagement initiatives. Currently, the FEED Team is developing training and a “toolkit” of family engagement resources for teachers that focus on inclusive communi-cation, design, and delivery.  Additionally, the Liaison will build capacity through Family Literacy Programs in schools.  ESOL parents will develop English language skills and learn about community resources while their children receive academic support.  As families develop English literacy and conversational skills, deepen their knowledge of the community, and build relationships with volunteers, they will be empowered as members of their school and local communities. Family Literacy Programs in ACPS will involve a school location for the sessions; ESOL families; community volunteers; and a site director from ACPS to organize the program and be on-site. Site Director responsibilities: promote the program at their school and encourage families to participate; communicate regularly with teachers for information regarding students’ academic needs and goals; provide materials to students, families, and volunteers - pencils, paper, educational games, books, etc; coordinate student and volunteer partnerships; coordinate ACPS and volunteer schedules; provide on-site support to help with any issues or challenges. \n\n\n\n"]
["Page 25"]
[null,null,null,null,"School Division:",null,{"$f":"'Title III Budget'!$A$16","v":"ALBEMARLE COUNTY PUBLIC SCHOOLS"},null,null,null,null,null,"Division Number:",null,null,{"$f":"'Title III Budget'!$H$16","v":2}]
[]
["G.  MEASURABLE OBJECTIVES "]
["What is a Measurable Objective?\n A measurable objective has four components:\na) Subject (Who is the target or focus?);\nb) Behavior (What will be changed/improved?);\nc) Specific criteria for assessing improvement, readiness, or achievement, and tools to be used to measure effectiveness; and\nd) Time period for performance or assessment.\n"]
["Measurable Objective 1:"]
["By the end of 2019-2020, 75% of ELs will demonstrate progress in acquiring ELP, in alignment with the VDOE’s guidance on English Learner Progress in Learning English Using ACCESS 2.0 Scores Composite Proficiency Level Gains.\n"]
[]
["Effective research-based services and activities that will be implemented and supported by the requested funds to achieve the objective."]
["Teachers will serve as Case Managers to progress monitor their ELs, by using the ACPS ESOL Benchmarks. They will strive to help their ELs meet these benchmarks by working with them to set quarterly language goals in the four domains of listening, speaking, reading, and writing. The goals are individualized based on ELs’ English languages proficiency levels, and drawn from the WIDA Can Do Descriptors and our teacher-created ESOL Language Goals. Students who are struggling to meet benchmarks will be identified early so that additional support, including supplemental learning opportunities after-school and during the summer, can be provided in a timely manner."]
["Page 26"]
[null,null,null,null,"School Division:",null,{"$f":"'Title III Budget'!$A$16","v":"ALBEMARLE COUNTY PUBLIC SCHOOLS"},null,null,null,null,null,"Division Number:",null,null,{"$f":"'Title III Budget'!$H$16","v":2}]
["G.   MEASURABLE OBJECTIVES (CONTINUED)"]
["Measurable Objective 2:"]
["By the end of 2019-2020, 25% of our Level 4 ELs will attain proficiency and therefore exit the ESOL program by earning a composite score of 4.4 or above on the WIDA ACCESS for ELLs 2.0 assessment. "]
[]
["Effective research-based services and activities that will be implemented and supported by the requested funds to achieve the objective."]
["Data analysis by the ESOL Office will identify students across the division who appear to be plateauing after attaining an ELP level of 3.0 and higher.  We will use this analysis to target instruction and shift resources to support students who are struggling to reach full proficiency in English. We will focus on supporting content area teachers to build language objectives into their lessons to advance the ELP of higher-level ELs. We will continue to leverage the MTSS process and collaborative ESOL and classroom/content teacher partnerships to support higher-level ELs who have been in the program longer than expected and are not making sufficient progress toward full proficiency. Additionally, we will focus on Long-Term ELs and their engagement of the goal-setting process to help avoid languishing in the ESOL program."]
[]
["Measurable Objective 3:"]
["In the spring of 2020, 65% of ELs taking the reading SOL will score at the proficient level, thus reducing the opportunity gap between ELs and all students in the division by at least 5%. \n"]
[]
["Effective research-based services and activities that will be implemented and supported by the requested funds to achieve the objective."]
["Effective, research-based services and activities that will be implemented and supported by the requested funds to achieve the objective include providing professional development to classroom teachers in how to incorporate academic vocabulary and differentiation strategies to improve comprehension throughout the curriculum. \nFor our younger ELs, ACPS will focus ESOL language support and PD on developing strong vocabulary and background knowledge, phonemic awareness, phonics, concepts of print and sight words, as these capacities are most important for emergent language acquisition (Dickinson & Snow, 1987; Dickinson & Tabors, 2001; Snow & Tabors, 1993; Whitehurst & Lonigan, 1998). \nFor our adolescent ELs, we will target those struggling with reading comprehension and provide supplemental support through the MTSS process. \n"]
["Page 27"]
[null,null,null,null,"School Division:",null,{"$f":"'Title III Budget'!$A$16","v":"ALBEMARLE COUNTY PUBLIC SCHOOLS"},null,null,null,null,null,"Division Number:",null,null,{"$f":"'Title III Budget'!$H$16","v":2}]
["G.  MEASURABLE OBJECTIVES (CONTINUED)"]
["Measurable Objective 4:"]
["In the spring of 2020, 70% of ELs taking the Mathematics SOL will score at the proficient level, thus reducing the opportunity gap between ELs and all students in the division by at least 5%. \n"]
[]
["Effective research-based services and activities that will be implemented and supported by the requested funds to achieve the objective."]
["ACPS will continue using ExC-ELL and SIOP strategies to support teachers in the incorporation of language development into math lessons. We will continue to expand our use of number talks and other language-rich Math strategies to support ELs’ greater comprehension of the language of Mathematics. Additionally, ST Math Intervention will be used for our SLIFE students. "]
[]
["Measurable Objective 5:"]
["In the spring of 2020, the percentage of ELs graduating on time continue to exceed the federal graduation indicator (FGI). \n"]
[]
["Effective research-based services and activities that will be implemented and supported by the requested funds to achieve the objective."]
[" Our secondary program will continue creating clear graduation plans with students. ESOL teachers will work closely with students and their families through the school counseling departments to create a graduation and post-secondary plan. ESOL teachers will collaborate with content teachers as well as community organizations to connect students' academic work to their goals outside of school. Students who are struggling to meet graduation requirements will be identified early so that additional support, including supplemental learning opportunities and tutoring after school and during the summer, can be provided in a timely manner. We will seek to enroll more ELs in honors, advanced placement, dual enrollment and other challenging courses to ensure equitable opportunities for a rigorous, language-rich curriculum.\n"]
[]
["Page 28"]
[null,null,null,null,"School Division:",null,{"$f":"'Title III Budget'!$A$16","v":"ALBEMARLE COUNTY PUBLIC SCHOOLS"},null,null,null,null,null,"Division Number:",null,null,{"$f":"'Title III Budget'!$H$16","v":2}]
["H.  TITLE III PROGRAM DETAILS"]
[]
["Types of Service Programs"]
[]
["Sec. 3121(a)(1) Sec. 3122(b)(1) as defined in Sec. 3201(7) – LIEP Type: The term LIEP means an instruction course in which an EL is placed for the purpose of developing and attaining English proficiency, while meeting challenging State academic standards.  The LIEP can make instructional use of both English and a child’s native language to enable the child to develop and attain English proficiency."]
["Place an X next to the LIEP type or types used in the grade cluster or clusters"]
["Box A."]
["Language Instruction Educational Program Type",null,null,null,null,null,null,null,null,"Elementary",null,"Middle",null,"High"]
["ESL or ELD Program",null,null,null,null,null,null,null,null,"X",null,"X",null,"X"]
["ESL Content Support Program ",null,null,null,null,null,null,null,null,"X",null,"X",null,"X"]
["Newcomer Program ",null,null,null,null,null,null,null,null,"X",null,"X",null,"X"]
["Transitional Bilingual Education or Early-Exit Bilingual Education"]
["Dual Language or Two-way Immersion ",null,null,null,null,null,null,null,null,"X"]
[]
[]
[]
["Possible Subgrant Activities"]
[]
["Sec. 3116(d)(1-9) – Possible Subgrantee Activities: Place an X next to the activities below if you used Title III funds in 2018-19 and/or you will use Title III funds in 2019-2020 to provide these activities."]
["Box B."]
["Possible Activities Serving ELs in LEAs Receiving Title III Funds",null,null,null,null,null,null,null,null,"Place an X to show activities conducted with funds last year (2018-2019)",null,null,"Place an X to show how funds will be used this year\n(2019-2020)\n"]
["Supporting the development and implementation of LIEPs"]
["Enhancing existing LIEPs and programs for restructuring and reforming schools with EL populations"]
["Supporting implementation of school wide programs"]
["Professional development to teachers and other personnel serving Els",null,null,null,null,null,null,null,null,"X",null,null,"X"]
["Parent, family and community engagement activities",null,null,null,null,null,null,null,null,"X",null,null,"X"]
["Supporting the development and implementation of pre-school programs"]
["Improving LIEPs by upgrading curricula, instructional materials, software and assessment procedures",null,null,null,null,null,null,null,null,"X",null,null,"X"]
["Improving instruction of ELs with disabilities"]
["Providing tutorials, career and technical education",null,null,null,null,null,null,null,null,"X",null,null,"X"]
["Offering programs to help ELs achieve success in post-secondary education"]
["Other (if other is marked with an X - Please describe the activity conducted) ",null,null,null,null,null,null,null,null,"x: Summer IY Programs \n",null,null,"x Summer IY Programs"]
[]
["Page 29"]

{"sheet":"IY","index":3,"n_rows":17,"n_cols":16,"rows_kept":17,"cut":false,"hidden":false,"merged":[[16,0,16,15],[1,0,1,15],[7,0,7,15],[3,0,3,15],[14,0,14,15],[9,0,9,15],[11,0,11,15],[12,0,12,15],[15,0,15,15]]}
[null,null,null,null,"School Division:",null,{"$f":"'Title III Budget'!$A$16","v":"ALBEMARLE COUNTY PUBLIC SCHOOLS"},null,null,null,null,null,"Division Number:",null,null,{"$f":"'Title III Budget'!$H$16","v":2}]
["J.  Immigrant Children and Youth (IY) Funds Under Title III"]
[]
["Complete if IY funds are allocated"]
[]
["Purpose of Immigrant Children and Youth (IY) Funds"]
[]
["Under Section 3114 of the ESEA, Immigrant Children and Youth (IY) funds may be used for supplemental services to improve the academic achievement of IY students including activities that increase the knowledge and skills of teachers who serve IY students. All services provided to IY students  using IY funds must supplement, and not supplant, the services that must be provided to IY students under Title VI of the Civil Rights Act of 1964 (Title VI), the Equal Educational Opportunities Act of 1974 (EEOA), and other requirements, including those under State or local laws. Immigrant Children and Youth (IY) funds must solely be expended on programs and services for immigrant students or their families. "]
[]
["Description of Program and Services for Immigrant Students "]
[]
["Describe how the division will use Immigrant Children and Youth (IY) funds to provide enhanced instructional opportunities specifically for immigrant students or their families:"]
["ACPS will use immigrant and youth subgrant funds to offer extended day and summer educational programs of the highest quality targeted to refugee and immigrant students new to our community. These students often face great challenges to meeting graduation requirements, yet also bring deep assets and resources when their potential is fully realized.  Notably, students will participate in our Summer Immersion Excursion Program, which provides experiential learning opportunities across the content areas, by visiting places such as Bellair Farm, Walnut Creek Park, the University of Virginia, Montpelier, and the Frontier Culture Museum. These excursions will help close the opportunity gap for students by helping them develop background knowledge and build academic vocabulary in topics that are embedded within content curriculum. As Newly Arrived ELs engage in their school cultures, they will gain an understanding of school expectations and integrate into their academic and social school community.  A planning team will collaboratively set the curricular goals for the program, as well as collaborate with the Child Nutrition and Transportation departments to secure meals and travel for participating ELs. Part-time family engagement workers will help facilitate communication and partnership with families. These experiences will allow allow Newly Arrived ELs to develop communication skills and social ties that accelerate their integration into school communities, and thus succeed both academically and socially.  In order to allow immigrant students to graduate on time, we are offering ELs a unique opportunity to take Government and Economics and Personal Finance courses through the summer ACPS Virtual Learning summer program. This online class is aligned to the same standards and contains the same level of rigor as traditional classroom offerings. However, an ESOL teacher will collaborate with the content area teacher in order to provide supplemental academic language support. Together, the two will differentiate content and provide the necessary linguistic scaffolds for student success.  Continued, below:\n\n\n"]
[]
["Describe how the division will evaluate the success of the enhanced instructional opportunities targeting immigrant students or their families:"]
["Additionally, transportation and snacks are provided Newly Arrived ELs access to this targeted instruction. Without transportation, food, and supplemental ESOL support, our immigrant students would not be able to access this online-only opportunity.  \n\nEvaluation:\nWe will evaluate the success of these extended day and summer programs in a variety of ways. First, we will conduct instructional walk-throughs and observations of the programs to determine that teachers are implementing best practices, such as SIOP and ExC-ELL. Secondly, we will look at student progress on Albemarle County Benchmarks in Reading and Mathematics, WIDA ACCESS for ELLs 2.0, and Standards of Learning assessments, as appropriate. Ultimately, we evaluate the success of all secondary interventions through analysis of graduation rates and post-secondary successes.\n"]
["Page 30"]

{"sheet":"Private Schools","index":4,"n_rows":92,"n_cols":20,"rows_kept":92,"cut":false,"hidden":false,"merged":[[65,0,65,4],[65,5,65,6],[65,7,65,8],[65,9,65,13],[65,17,65,18],[65,19,65,20],[30,0,30,21],[28,0,28,21],[1,0,1,21],[3,0,3,21],[7,0,7,21],[13,13,13,21],[24,11,24,21],[25,11,25,21],[18,11,18,21],[19,11,19,21],[20,11,20,21],[21,11,21,21],[63,0,63,4],[63,5,63,6],[63,7,63,8],[63,9,63,13],[63,17,63,18],[63,19,63,20],[64,0,64,4],[64,5,64,6],[64,7,64,8],[64,9,64,13],[64,17,64,18],[64,19,64,20],[61,0,61,4],[61,5,61,6],[61,7,61,8],[61,9,61,13],[61,17,61,18],[61,19,61,20],[62,0,62,4],[62,5,62,6],[62,7,62,8],[62,9,62,13],[62,17,62,18],[62,19,62,20],[59,0,59,4],[59,5,59,6],[59,7,59,8],[59,9,59,13],[59,17,59,18],[59,19,59,20],[60,0,60,4],[60,5,60,6],[60,7,60,8],[60,9,60,13],[60,17,60,18],[60,19,60,20],[57,0,57,4],[57,5,57,6],[57,7,57,8],[57,9,57,13],[57,17,57,18],[57,19,57,20],[58,0,58,4],[58,5,58,6],[58,7,58,8],[58,9,58,13],[58,17,58,18],[58,19,58,20],[55,0,55,4],[55,5,55,6],[55,7,55,8],[55,9,55,13],[55,17,55,18],[55,19,55,20],[56,0,56,4],[56,5,56,6],[56,7,56,8],[56,9,56,13],[56,17,56,18],[56,19,56,20],[53,0,53,4],[53,5,53,6],[53,7,53,8],[53,9,53,13],[53,17,53,18],[53,19,53,20],[54,0,54,4],[54,5,54,6],[54,7,54,8],[54,9,54,13],[54,17,54,18],[54,19,54,20],[51,0,51,4],[51,5,51,6],[51,7,51,8],[51,9,51,13],[51,17,51,18],[51,19,51,20],[52,0,52,4],[52,5,52,6],[52,7,52,8],[52,9,52,13],[52,17,52,18],[52,19,52,20],[49,0,49,4],[49,5,49,6],[49,7,49,8],[49,9,49,13],[49,17,49,18],[49,19,49,20],[50,0,50,4],[50,5,50,6],[50,7,50,8],[50,9,50,13],[50,17,50,18],[50,19,50,20],[47,0,47,4],[47,5,47,6],[47,7,47,8],[47,9,47,13],[47,17,47,18],[47,19,47,20],[48,0,48,4],[48,5,48,6],[48,7,48,8],[48,9,48,13],[48,17,48,18],[48,19,48,20],[45,0,45,4],[45,5,45,6],[45,7,45,8],[45,9,45,13],[45,17,45,18],[45,19,45,20],[46,0,46,4],[46,5,46,6],[46,7,46,8],[46,9,46,13],[46,17,46,18],[46,19,46,20],[43,0,43,4],[43,5,43,6],[43,7,43,8],[43,9,43,13],[43,17,43,18],[43,19,43,20],[44,0,44,4],[44,5,44,6],[44,7,44,8],[44,9,44,13],[44,17,44,18],[44,19,44,20],[41,0,41,4],[41,5,41,6],[41,7,41,8],[41,9,41,13],[41,17,41,18],[41,19,41,20],[42,0,42,4],[42,5,42,6],[42,7,42,8],[42,9,42,13],[42,17,42,18],[42,19,42,20],[39,0,39,4],[39,5,39,6],[39,7,39,8],[39,9,39,13],[39,17,39,18],[39,19,39,20],[40,0,40,4],[40,5,40,6],[40,7,40,8],[40,9,40,13],[40,17,40,18],[40,19,40,20],[37,0,37,4],[37,5,37,6],[37,7,37,8],[37,9,37,13],[37,17,37,18],[37,19,37,20],[38,0,38,4],[38,5,38,6],[38,7,38,8],[38,9,38,13],[38,17,38,18],[38,19,38,20],[35,0,35,4],[35,5,35,6],[35,7,35,8],[35,9,35,13],[35,17,35,18],[35,19,35,20],[36,0,36,4],[36,5,36,6],[36,7,36,8],[36,9,36,13],[36,17,36,18],[36,19,36,20],[90,7,90,8],[89,17,89,18],[89,19,89,20],[89,7,89,8],[88,0,88,6],[88,9,88,13],[88,7,88,8],[87,0,87,4],[87,5,87,6],[87,7,87,8],[88,17,88,18],[88,19,88,20],[81,0,81,4],[81,5,81,6],[83,0,83,4],[83,5,83,6],[83,7,83,8],[86,0,86,4],[86,5,86,6],[86,7,86,8],[84,0,84,4],[84,5,84,6],[84,7,84,8],[82,0,82,4],[82,5,82,6],[82,7,82,8],[85,0,85,4],[85,5,85,6],[85,7,85,8],[79,19,79,20],[80,9,80,13],[80,0,80,4],[80,5,80,6],[80,7,80,8],[80,17,80,18],[80,19,80,20],[79,9,79,13],[79,17,79,18],[77,0,77,4],[77,5,77,6],[79,0,79,4],[79,5,79,6],[79,7,79,8],[81,7,81,8],[91,0,91,26],[76,0,76,4],[76,5,76,6],[76,7,76,8],[77,7,77,8],[76,9,76,13],[76,17,76,18],[78,0,78,4],[78,5,78,6],[78,7,78,8],[81,17,81,18],[76,19,76,20],[77,9,77,13],[77,17,77,18],[77,19,77,20],[78,9,78,13],[78,17,78,18],[78,19,78,20],[69,9,69,13],[66,0,66,4],[66,5,66,6],[66,7,66,8],[66,9,66,13],[67,0,67,4],[67,5,67,6],[67,7,67,8],[67,9,67,13],[21,1,21,10],[34,0,34,4],[34,5,34,6],[34,7,34,8],[34,9,34,13],[11,22,11,25],[18,1,18,10],[19,1,19,10],[32,0,32,4],[32,5,32,6],[32,7,32,8],[32,9,32,13],[20,1,20,10],[34,17,34,18],[13,22,13,25],[24,1,24,10],[25,1,25,10],[15,13,15,14],[66,17,66,18],[67,17,67,18],[68,17,68,18],[33,0,33,4],[33,5,33,6],[69,17,69,18],[32,19,32,20],[33,19,33,20],[34,19,34,20],[66,19,66,20],[67,19,67,20],[68,19,68,20],[69,19,69,20],[32,17,32,18],[33,17,33,18],[33,7,33,8],[33,9,33,13],[68,0,68,4],[68,5,68,6],[68,7,68,8],[68,9,68,13],[69,0,69,4],[69,5,69,6],[69,7,69,8],[70,0,70,4],[70,5,70,6],[70,7,70,8],[70,9,70,13],[70,17,70,18],[70,19,70,20],[71,0,71,4],[71,5,71,6],[71,7,71,8],[71,9,71,13],[71,17,71,18],[71,19,71,20],[72,0,72,4],[72,5,72,6],[72,7,72,8],[72,9,72,13],[72,17,72,18],[72,19,72,20],[73,0,73,4],[73,5,73,6],[73,7,73,8],[73,9,73,13],[73,17,73,18],[73,19,73,20],[74,0,74,4],[74,5,74,6],[74,7,74,8],[74,9,74,13],[74,17,74,18],[74,19,74,20],[75,0,75,4],[75,5,75,6],[75,7,75,8],[75,9,75,13],[75,17,75,18],[75,19,75,20],[86,17,86,18],[86,19,86,20],[86,9,86,13],[87,9,87,13],[87,17,87,18],[87,19,87,20],[81,19,81,20],[82,9,82,13],[82,17,82,18],[82,19,82,20],[83,9,83,13],[83,17,83,18],[83,19,83,20],[81,9,81,13],[85,19,85,20],[84,19,84,20],[85,9,85,13],[85,17,85,18],[84,9,84,13],[84,17,84,18]]}
[null,null,null,null,"School Division:",null,{"$f":"'Title III Budget'!$A$16","v":"ALBEMARLE COUNTY PUBLIC SCHOOLS"},null,null,null,null,null,null,null,null,null,null,"Division Number:",null,{"$f":"'Title III Budget'!$H$16","v":2}]
["K.  PRIVATE SCHOOL PARTICIPATION"]
[]
["Each year, the school division must contact all eligible private (nonprofit) schools and engage in meaningful consultation on the availability of equitable services funded by Title III, Part A. (ESEA Title VIII  Uniform Provisions, Part F, Subpart 1)."]
["1. Are there eligible private schools in the school division's attendance area?"]
[null,null,"X","Yes (If yes, complete the remainder of this page.)",null,null,null,null,null,null,null,null,"No (If no, it is not necessary to complete the rest of this page.)"]
[]
["2. Place an \"X\" in the appropriate block(s) to indicate how private schools were notified of the availability of equitable services funded by Title III, Part A. (Copies of the notification must be kept on file for monitoring purposes.)"]
[]
[null,null,"Regular Mail",null,null,null,null,null,null,"X","Certified Mail"]
[]
[null,null,"Telephone Calls",null,null,null,null,null,null,null,"Meetings"]
[]
[null,null,"Visits to the Private School",null,null,null,null,null,null,null,"Other (Please specify)"]
[]
["3. How many English Learners received services in the public school division for the 2018-2019 school year?",null,null,null,null,null,null,null,null,null,null,null,null,1392]
[]
["4. Determining Set-Asides (These fields will calculate automatically once enrollment figures have been entered.)"]
[null,"a. Title III Budget",null,null,null,null,null,null,null,null,null,{"$f":"SUM('Title III Budget'!G135:J135)","v":108746}]
[null,"b. Proportionate Share",null,null,null,null,null,null,null,null,null,{"$f":"(L19)*(H89/(N16+H89))","v":0}]
[null,"c. Additional set-aside for equitable services (if necessary)"]
[null,"d. Amount to use for set-aside calculations",null,null,null,null,null,null,null,null,null,{"$f":"SUM(L20+L21)","v":0}]
[]
["5. Determining additional set-asides as a result of Transferability. These fields will calculate automatically once budget and enrollment figures have been entered."]
[null,"a. Title III Budget",null,null,null,null,null,null,null,null,null,{"$f":"SUM(Transferability!K13:L13)","v":0}]
[null,"b. Proportionate Share",null,null,null,null,null,null,null,null,null,{"$f":"(L25)*(H89/(N16+H89))","v":0}]
[]
[]
["6. For the 2019-2020 award year, enter the estimated private school-set aside (Cell R67) onto the Summary Budget Tab under the “Budget for 2019-2020” column in the appropriate object codes on the “Private School Set-Aside” lines.  On the Budget Detail pages, list the amounts in the appropriate object codes in the “Private School Set-Aside for 2019-2020” lines."]
[]
["7. Complete the chart below:\n• In Column A, list all eligible private schools in the school division.\n• In column B, indicate the participation status of the listed private school(s) for the 2019-2020 award year, as a result of consultation.\n• In Column C, enter number of English learner students in private schools participating in services for the 2019-2020 award year.\n• In Column D, enter the description of services provided for participating children.\n• Columns E and F will automatically calculate the value of services for the 2019-2020 award year."]
[]
["A",null,null,null,null,"B",null,"C",null,"D",null,null,null,null,null,null,null,"E",null,"F"]
[" Private Schools",null,null,null,null,"Participation Status for 2019-2020 Award Year?\n(Yes/No)  ",null,"Number of Identified Students",null,"Description of Services",null,null,null,null,null,null,null," Estimated Value of Services from 2019-2020 Title IIIA Budget, Per School",null,"Estimated Value of Additional Services from Transferability Funds"]
["Community Christian Academy",null,null,null,null,"Yes",null,"TBD",null,"Division Professional Development; additional TBD",null,null,null,null,null,null,null,{"$f":"ROUND(IF(F35=\"Yes\",H35*$H$90,0),2)","v":{"$error":"#VALUE!"}},null,{"$f":"ROUND(IF(F35=\"Yes\",H35*$H$91,0),2)","v":{"$error":"#VALUE!"}}]
["Miller School of Albemarle",null,null,null,null,"Yes",null,"TBD",null,"Division Professional Development; additional TBD",null,null,null,null,null,null,null,{"$f":"ROUND(IF(F36=\"Yes\",H36*$H$90,0),2)","v":{"$error":"#VALUE!"}},null,{"$f":"ROUND(IF(F36=\"Yes\",H36*$H$91,0),2)","v":{"$error":"#VALUE!"}}]
["Tandem Friends School",null,null,null,null,"Yes",null,"TBD",null,"Division Professional Development; additional TBD",null,null,null,null,null,null,null,{"$error":"#VALUE!"},null,{"$error":"#VALUE!"}]
["Charlottesville Catholic School",null,null,null,null,"No",null,null,null,null,null,null,null,null,null,null,null,0,null,0]
["Charlottesville Waldorf",null,null,null,null,"No",null,null,null,null,null,null,null,null,null,null,null,0,null,0]
["The Covenant School",null,null,null,null,"No",null,null,null,null,null,null,null,null,null,null,null,0,null,0]
["Field School of Charlottesville",null,null,null,null,"No",null,null,null,null,null,null,null,null,null,null,null,0,null,0]
["Free Union Country School",null,null,null,null,"No",null,null,null,null,null,null,null,null,null,null,null,0,null,0]
["Little Keswick School",null,null,null,null,"No",null,null,null,null,null,null,null,null,null,null,null,0,null,0]
["Mountaintop Montessori School",null,null,null,null,"No",null,null,null,null,null,null,null,null,null,null,null,0,null,0]
["Peabody School",null,null,null,null,"No",null,null,null,null,null,null,null,null,null,null,null,0,null,0]
["St. Anne's Belfield",null,null,null,null,"No",null,null,null,null,null,null,null,null,null,null,null,0,null,0]
["University Montessori School",null,null,null,null,"No",null,null,null,null,null,null,null,null,null,null,null,0,null,0]
[null,null,null,null,null,null,null,null,null,null,null,null,null,null,null,null,null,0,null,0]
[null,null,null,null,null,null,null,null,null,null,null,null,null,null,null,null,null,0,null,0]
[null,null,null,null,null,null,null,null,null,null,null,null,null,null,null,null,null,0,null,0]
[null,null,null,null,null,null,null,null,null,null,null,null,null,null,null,null,null,0,null,0]
[null,null,null,null,null,null,null,null,null,null,null,null,null,null,null,null,null,0,null,0]
[null,null,null,null,null,null,null,null,null,null,null,null,null,null,null,null,null,0,null,0]
[null,null,null,null,null,null,null,null,null,null,null,null,null,null,null,null,null,0,null,0]
[null,null,null,null,null,null,null,null,null,null,null,null,null,null,null,null,null,0,null,0]
[null,null,null,null,null,null,null,null,null,null,null,null,null,null,null,null,null,0,null,0]
[null,null,null,null,null,null,null,null,null,null,null,null,null,null,null,null,null,0,null,0]
[null,null,null,null,null,null,null,null,null,null,null,null,null,null,null,null,null,0,null,0]
[null,null,null,null,null,null,null,null,null,null,null,null,null,null,null,null,null,0,null,0]
[null,null,null,null,null,null,null,null,null,null,null,null,null,null,null,null,null,0,null,0]
[null,null,null,null,null,null,null,null,null,null,null,null,null,null,null,null,null,0,null,0]
[null,null,null,null,null,null,null,null,null,null,null,null,null,null,null,null,null,0,null,0]
[null,null,null,null,null,null,null,null,null,null,null,null,null,null,null,null,null,0,null,0]
[null,null,null,null,null,null,null,null,null,null,null,null,null,null,null,null,null,0,null,0]
[null,null,null,null,null,null,null,null,null,null,null,null,null,null,null,null,null,0,null,0]
[null,null,null,null,null,null,null,null,null,null,null,null,null,null,null,null,null,0,null,0]
[null,null,null,null,null,null,null,null,null,null,null,null,null,null,null,null,null,0,null,0]
[null,null,null,null,null,null,null,null,null,null,null,null,null,null,null,null,null,0,null,0]
[null,null,null,null,null,null,null,null,null,null,null,null,null,null,null,null,null,0,null,0]
[null,null,null,null,null,null,null,null,null,null,null,null,null,null,null,null,null,0,null,0]
[null,null,null,null,null,null,null,null,null,null,null,null,null,null,null,null,null,0,null,0]
[null,null,null,null,null,null,null,null,null,null,null,null,null,null,null,null,null,0,null,0]
[null,null,null,null,null,null,null,null,null,null,null,null,null,null,null,null,null,0,null,0]
[null,null,null,null,null,null,null,null,null,null,null,null,null,null,null,null,null,0,null,0]
[null,null,null,null,null,null,null,null,null,null,null,null,null,null,null,null,null,0,null,0]
[null,null,null,null,null,null,null,null,null,null,null,null,null,null,null,null,null,0,null,0]
[null,null,null,null,null,null,null,null,null,null,null,null,null,null,null,null,null,0,null,0]
[null,null,null,null,null,null,null,null,null,null,null,null,null,null,null,null,null,0,null,0]
[null,null,null,null,null,null,null,null,null,null,null,null,null,null,null,null,null,0,null,0]
[null,null,null,null,null,null,null,null,null,null,null,null,null,null,null,null,null,0,null,0]
[null,null,null,null,null,null,null,null,null,null,null,null,null,null,null,null,null,0,null,0]
[null,null,null,null,null,null,null,null,null,null,null,null,null,null,null,null,null,0,null,0]
[null,null,null,null,null,null,null,null,null,null,null,null,null,null,null,null,null,0,null,0]
[null,null,null,null,null,null,null,null,null,null,null,null,null,null,null,null,null,0,null,0]
[null,null,null,null,null,null,null,null,null,null,null,null,null,null,null,null,null,0,null,0]
[null,null,null,null,null,null,null,null,null,null,null,null,null,null,null,null,null,0,null,0]
[null,null,null,null,null,null,null,null,null,null,null,null,null,null,null,null,null,0,null,0]
[null,null,null,null,null,null,null,null,null,null,null,null,null,null,null,null,null,0,null,0]
["Total Identified Students",null,null,null,null,null,null,{"$f":"SUM(H35:I88)","v":0},null,"Total Private School Set-Asides",null,null,null,null,null,null,null,{"$f":"SUM(R35:S88)","v":{"$error":"#VALUE!"}},null,{"$f":"SUM(T35:U88)","v":{"$error":"#VALUE!"}}]
["Per Pupil Expenditure \n(calculated field):          ",null,null,null,null,null,null,{"$f":"(L22/H89)","v":{"$error":"#DIV/0!"}},null,null,null,null,null,null,null,null,null,"Use this Figure for Private School Set-Asides in 2019-2020 Budget",null,"Use this Figure for Private School Set-Asides in 2019-2020 Transferability Budget "]
["Per Pupil Expenditure for Transferability funds (calculated field):          \n\n\n",null,null,null,null,null,null,{"$f":"(L26/H89)","v":{"$error":"#DIV/0!"}}]
["Page 32"]

{"sheet":"GEPA","index":5,"n_rows":9,"n_cols":16,"rows_kept":9,"cut":false,"hidden":false,"merged":[[12,5,12,6],[12,7,12,8],[12,9,12,10],[13,5,13,6],[13,7,13,8],[13,9,13,10],[8,0,8,15],[10,5,10,6],[10,7,10,8],[10,9,10,10],[11,5,11,6],[11,7,11,8],[11,9,11,10],[7,0,7,15],[0,3,0,5],[1,0,1,15],[3,0,3,15],[5,0,5,15],[6,0,6,15]]}
[null,null,null,"School Division:",null,null,{"$f":"'Title III Budget'!A16","v":"ALBEMARLE COUNTY PUBLIC SCHOOLS"},null,null,null,null,null,"Division Number:",null,null,{"$f":"'Title III Budget'!H16","v":2}]
["L.  GENERAL EDUCATION PROVISIONS ACT (GEPA) SECTION 427"]
[]
["Section 427 of the General Education Provisions Act (GEPA) requires applicants for federal funds to include in their applications a description of the steps the applicant will take to ensure equitable access to, and participation in, federally-assisted programs for students, teachers, and other program beneficiaries with special needs. The provision allows applicants discretion in developing the required description. The statute highlights six types of barriers that can impede equitable access or participation: gender, race, national origin, color, disability, or age. Based on local circumstances, the applicant should determine whether these or other barriers may prevent students, teachers, etc., from such access or participation in the federally-funded project or activity. The description in the application of steps to be taken to overcome these barriers need not be lengthy; the application may provide a clear and succinct description of how the applicant plans to address those barriers that are applicable to their circumstances."]
[]
["Describe the steps the division will take to ensure equitable access to, and participation in, grant-funded programs for students, teachers, and other program beneficiaries with special needs as required by the General Education Provisions Act (GEPA) 427, OMB Control No. 1894-00045, Section 427."]
[" Albemarle County is committed to providing equitable access for students, teachers and families in all grant-funded programs and opportunities as required by GEPA 427.\n1. We ensure that all events are held in handicapped accessible facilities in geographically convenient locations. Events are held during the day, evening, and on weekends to accommodate family school/work schedules in order to maximize participation.\n2. We provide materials that are accessible for literate and non-readers, as well as in electronic and paper copy formats to inform families who may not have access to social media and email. This includes translation of documents into languages other than English as needed. The ESOL Office annually vets, hires, and trains additional interpreters and translators to ensure optimal participation and inclusivity for all families. Simultaneous interpretation equipment is used in large-group settings, and phone interpretation systems \n"]
["are used when necessary. \n3. ACPS conducts a variety of outreach programs to address gender and/or race inequalities. Some of these include: Teacher summer reading project, Girls in STEM initiatives, Summer Immersion Excursion, Camp Invention modules, CoderDojo, World Peace Game, and Saturday family engagement experiences to STEM fairs.\n4. Efforts to involve diverse stakeholders in program planning and implementation are robust and include seventeen diverse teams. Advisory groups include Parent Council, Student Advisory, SPED, GTE, Title I, and Diversity and Equity.  \n5. The Title I, Title III, and Migrant and Homeless Coordinators meet monthly with the Director of Federal Programs to collaborate and ensure our students have equitable access to all division opportunities."]
["Page 33"]

{"sheet":"Prefills","index":6,"n_rows":288,"n_cols":61,"rows_kept":288,"cut":false,"hidden":true,"merged":[]}
["Name","Code",null,null,null,null,null,null,"INNOVATIVE ASSISTANCE PROGRAM AREAS",null,null,null,null,null,null,null,null,null,null,null,"Yes",null,"Yes",null,null,"Title I A",null,null,null,"Title I C",null,null,null,"Title ID",null,null,null,"Title IIA",null,null,null,"Title IID",null,null,null,"Title III",null,null,null,"Title IV",null,null,null,"Title V",null,null,null,"Title VI"]
["ACCOMACK COUNTY PUBLIC SCHOOLS",1,null,null,null,null,null,null,null,null,null,null,null,null,null,null,null,null,null,null,"No",null,"No",null,null,"Payee","ProjectGroupID","CONoSOLIDATED_APP_FLAG","Allocation","Payee","ProjectGroupID","CONoSOLIDATED_APP_FLAG","Allocation","Payee","ProjectGroupID","CONoSOLIDATED_APP_FLAG","Allocation","Payee","ProjectGroupID","CONoSOLIDATED_APP_FLAG","Allocation","Payee","ProjectGroupID","CONoSOLIDATED_APP_FLAG","Allocation","Payee","ProjectGroupID","CONoSOLIDATED_APP_FLAG","Allocation","Payee","ProjectGroupID","CONoSOLIDATED_APP_FLAG","Allocation","Payee","ProjectGroupID","CONoSOLIDATED_APP_FLAG","Allocation","Payee","ProjectGroupID","CONoSOLIDATED_APP_FLAG","Allocation"]
["ALBEMARLE COUNTY PUBLIC SCHOOLS",2,null,null,null,null,null," "," ",null,null,null,null,null,null,null,null,null,null,null,null,null,"Shared Services Only",null,null,1,1,"Yes",null,1,2,"Yes",null,1,3,"Yes",null,1,4,"Yes",null,null,null,null,null,1,6,"Yes",79627.960000000006,1,97,null,null,null,null,null,null,1,9,"Yes"]
["ALEXANDRIA CITY PUBLIC SCHOOLS",101,null,null,null,null,null,"1. ","1. Recruiting, training, and hiring highly qualified teachers to reduce class size",null,null,null,null,null,null,null,null,null,null,null,null,null,null,null,null,2,1,"No",null,2,2,"No",null,2,3,"No",null,2,4,"No",null,null,null,null,null,2,6,"No",119387,2,97,null,null,null,null,null,null,2,9,"No"]
["ALLEGHANY COUNTY PUBLIC SCHOOLS",3,null,null,null,null,null,"2. ","2. Technology activities, including professional development",null,null,null,null,null,null,null,null,null,null,null,null,null,null,null,null,3,1,"Yes",null,3,2,"Yes",null,3,3,"Yes",null,3,4,"Yes",null,null,null,null,null,3,6,"Yes",447.97999999999996,3,97,null,null,null,null,null,null,3,9,"Yes"]
["AMELIA COUNTY PUBLIC SCHOOLS",4,null,null,null,null,null,"3a.","3a. Development or acquisition and use of: computer software and hardware",null,null,null,null,null,null,null,null,null,null,null,null,null,"Yes",null,null,4,1,"Yes",null,4,2,"Yes",null,4,3,"Yes",null,4,4,"Yes",null,null,null,null,null,4,6,"Yes",0,4,97,null,null,null,null,null,null,4,9,"Yes"]
["AMHERST COUNTY PUBLIC SCHOOLS",5,null,null,null,null,null,"3b.","3b. Development or acquisition and use of: instructional/reference materials and academic assessments",null,null,null,null,null,null,null,null,null,null,null,null,null,"No",null,null,5,1,"No",null,5,2,"No",null,5,3,"No",null,5,4,"No",null,null,null,null,null,5,6,"No",2239.8900000000003,5,97,null,null,null,null,null,null,5,9,"No"]
["APPOMATTOX COUNTY PUBLIC SCHOOLS",6,null,null,null,null,null,"3c.","3c. Development or acquisition and use of: library/media services and materials",null,null,null,null,null,null,null,null,null,null,null,null,null,null,null,null,6,1,"No",null,6,2,"No",null,6,3,"No",null,6,4,"No",null,null,null,null,null,6,6,"No",671.96999999999991,6,97,null,null,null,null,null,null,6,9,"No"]
["ARLINGTON COUNTY PUBLIC SCHOOLS",7,null,null,null,null,null,"4. ","4. Educational reform projects, including magnet schools",null,null,null,null,null,null,null,null,null,null,null,null,null,null,null,null,7,1,"Yes",null,7,2,"Yes",null,7,3,"Yes",null,7,4,"Yes",null,null,null,null,null,7,6,"Yes",592086.65999999992,7,97,null,null,null,null,null,null,7,9,"Yes"]
["AUGUSTA COUNTY PUBLIC SCHOOLS",8,null,null,null,null,null,"5. ","5. Programs to improve the academic achievement of educationally disadvantaged elementary and secondary students, including dropout prevention",null,null,null,null,null,null,null,null,null,null,null,null,null,null,null,null,8,1,"No",null,8,2,"No",null,8,3,"No",null,8,4,"No",null,null,null,null,null,8,6,"No",15903.19,8,97,null,null,null,null,null,null,8,9,"No"]
["BATH COUNTY PUBLIC SCHOOLS",9,null,null,null,null,null,"6. ","6. Programs to improve the literacy skills of adults, including adult education and family literacy programs",null,null,null,null,null,null,null,null,null,null,null,null,null,null,null,null,9,1,"No",null,9,2,"No",null,9,3,"No",null,9,4,"No",null,null,null,null,null,9,6,"No",559.96999999999991,9,97,null,null,null,null,null,null,9,9,"No"]
["BEDFORD CITY PUBLIC SCHOOLS",140,null,null,null,null,null,"7. ","7. Programs for gifted and talented children",null,null,null,null,null,null,null,null,null,null,null,null,null,null,null,null,10,1,"No",null,10,2,"No",null,10,3,"No",null,10,4,"No",null,null,null,null,null,10,6,"No",8287.58,10,97,null,null,null,null,null,null,10,9,"No"]
["BEDFORD COUNTY PUBLIC SCHOOLS",10,null,null,null,null,null,"8. ","8. Planning, design, and initial implementation of charter schools under Title V, Part B",null,null,null,null,null,null,null,null,null,null,null,null,null,null,null,null,11,1,"Yes",null,11,2,"Yes",null,11,3,"Yes",null,11,4,"Yes",null,null,null,null,null,11,6,"Yes",0,11,97,null,null,null,null,null,null,11,9,"Yes"]
["BLAND COUNTY PUBLIC SCHOOLS",11,null,null,null,null,null,"9. ","9. School improvement programs or activities under Sections 1116 and 1117 of Title I, Part A",null,null,null,null,null,null,null,null,null,null,null,null,null,null,null,null,12,1,"No",null,12,2,"No",null,12,3,"No",null,12,4,"No",null,null,null,null,null,12,6,"No",7167.64,12,97,null,null,null,null,null,null,12,9,"No"]
["BOTETOURT COUNTY PUBLIC SCHOOLS",12,null,null,null,null,null,"10.","10. Community service programs",null,null,null,null,null,null,null,null,null,null,null,null,null,null,null,null,13,1,"Yes",null,13,2,"Yes",null,13,3,"Yes",null,13,4,"Yes",null,null,null,null,null,13,6,"Yes",3583.82,13,97,null,null,null,null,null,null,13,9,"Yes"]
["BRISTOL CITY PUBLIC SCHOOLS",102,null,null,null,null,null,"11.","11. Consumer, economic, and personal finance education",null,null,null,null,null,null,null,null,null,null,null,null,null,null,null,null,14,1,"Yes",null,14,2,"Yes",null,14,3,"Yes",null,14,4,"Yes",null,null,null,null,null,14,6,"Yes",223.98999999999998,14,97,null,null,null,null,null,null,14,9,"Yes"]
["BRUNSWICK COUNTY PUBLIC SCHOOLS",13,null,null,null,null,null,"12.","12. Public school choice",null,null,null,null,null,null,null,null,null,null,null,null,null,1000,null,null,15,1,"Yes",null,15,2,"Yes",null,15,3,"Yes",null,15,4,"Yes",null,null,null,null,null,15,6,"Yes",223.98999999999998,15,97,null,null,null,null,null,null,15,9,"Yes"]
["BUCHANAN COUNTY PUBLIC SCHOOLS",14,null,null,null,null,null,"13.","13. Programs to hire and support school nurses",null,null,null,null,null,null,null,null,null,null,null,null,null,2000,null,null,16,1,"No",null,16,2,"No",null,16,3,"No",null,16,4,"No",null,null,null,null,null,16,6,"No",14111.289999999999,16,97,null,null,null,null,null,null,16,9,"No"]
["BUCKINGHAM COUNTY PUBLIC SCHOOLS",15,null,null,null,null,null,"14.","14. School-based mental health services",null,null,null,null,null,null,null,null,null,null,null,null,null,3000,null,null,17,1,"Yes",null,17,2,"Yes",null,17,3,"Yes",null,17,4,"Yes",null,null,null,null,null,17,6,"Yes",9407.5299999999988,17,97,null,null,null,null,null,null,17,9,"Yes"]
["BUENA VISTA CITY PUBLIC SCHOOLS",103,null,null,null,null,null,"15.","15. Alternative educational programs",null,null,null,null,null,null,null,null,null,null,null,null,null,4000,null,null,18,1,"No",null,18,2,"No",null,18,3,"No",null,18,4,"No",null,null,null,null,null,18,6,"No",11759.41,18,97,null,null,null,null,null,null,18,9,"No"]
["CAMPBELL COUNTY PUBLIC SCHOOLS",16,null,null,null,null,null,"16.","16. Prekindergarten programs",null,null,null,null,null,null,null,null,null,null,null,null,null,5000,null,null,19,1,"Yes",null,19,2,"Yes",null,19,3,"Yes",null,19,4,"Yes",null,null,null,null,null,19,6,"Yes",1119.94,19,97,null,null,null,null,null,null,19,9,"Yes"]
["CAROLINE COUNTY PUBLIC SCHOOLS",17,null,null,null,null,null,"17.","17. Academic intervention programs jointly operated with community-based organizations ",null,null,null,null,null,null,null,null,null,null,null,null,null,6000,null,null,20,1,"Yes",null,20,2,"Yes",null,20,3,"Yes",null,20,4,"Yes",null,null,null,null,null,20,6,"Yes",1119.94,20,97,null,null,null,null,null,null,20,9,"Yes"]
["CARROLL COUNTY PUBLIC SCHOOLS",18,null,null,null,null,null,"18.","18. CPR training",null,null,null,null,null,null,null,null,null,null,null,null,null,8000,null,null,21,1,"No",null,21,2,"No",null,21,3,"No",null,21,4,"No",null,null,null,null,null,21,6,"No",403368.59,21,97,null,null,null,null,null,null,21,9,"No"]
["CHARLES CITY COUNTY PUBLIC SCHOOLS",19,null,null,null,null,null,"19.","19. Smaller learning communities",null,null,null,null,null,null,null,null,null,null,null,null,null,null,null,null,22,1,"No",null,22,2,"No",null,22,3,"No",null,22,4,"No",null,null,null,null,null,22,6,"No",6159.69,22,97,null,null,null,null,null,null,22,9,"No"]
["CHARLOTTE COUNTY PUBLIC SCHOOLS",20,null,null,null,null,null,"20.","20. Activities that encourage and expand improvements throughout the LEA area that  are designed to advance student academic achievement",null,null,null,null,null,null,null,null,null,null,null,null,null,null,null,null,23,1,"Yes",null,23,2,"Yes",null,23,3,"Yes",null,23,4,"Yes",null,null,null,null,null,23,6,"Yes",0,23,97,null,null,null,null,null,null,23,9,"Yes"]
["CHARLOTTESVILLE CITY PUBLIC SCHOOLS",104,null,null,null,null,null,"21.","21. Parental and community involvement",null,null,null,null,null,null,null,null,null,null,null,null,null,null,null,null,24,1,"No",null,24,2,"No",null,24,3,"No",null,24,4,"No",null,null,null,null,null,24,6,"No",72236.33,24,97,null,null,null,null,null,null,24,9,"No"]
["CHESAPEAKE CITY PUBLIC SCHOOLS",136,null,null,null,null,null,"22.","22. Activities that expand learning through best-practice models",null,null,null,null,null,null,null,null,null,null,null,null,null,null,null,null,25,1,"Yes",null,25,2,"Yes",null,25,3,"Yes",null,25,4,"Yes",null,null,null,null,null,25,6,"Yes",2463.87,25,97,null,null,null,null,null,null,25,9,"Yes"]
["CHESTERFIELD COUNTY PUBLIC SCHOOLS",21,null,null,null,null,null,"23.","23. Same-gender schools and classrooms (consistent with applicable law)**",null,null,null,null,null,null,null,null,null,null,null,null,null,null,null,null,26,1,"No",null,26,2,"No",null,26,3,"No",null,26,4,"No",null,null,null,null,null,26,6,"No",223.98999999999998,26,97,null,null,null,null,null,null,26,9,"No"]
["CLARKE COUNTY PUBLIC SCHOOLS",22,null,null,null,null,null,"24.","24. Service learning activities",null,null,null,null,null,null,null,null,null,null,null,null,null,null,null,null,27,1,"Yes",null,27,2,"Yes",null,27,3,"Yes",null,27,4,"Yes",null,null,null,null,null,27,6,"Yes",6047.6900000000005,27,97,null,null,null,null,null,null,27,9,"Yes"]
["CLIFTON FORGE CITY",105,null,null,null,null,null,"25.","25. School safety programs",null,null,null,null,null,null,null,null,null,null,null,null,null,null,null,null,28,1,"No",null,28,2,"No",null,28,3,"No",null,28,4,"No",null,null,null,null,null,28,6,"No",3807.81,28,97,null,null,null,null,null,null,28,9,"No"]
["COLONIAL BEACH TOWN PUBLIC SCHOOLS",202,null,null,null,null,null,"26.","26. Programs that use research-based cognitive and perceptual development approaches",null,null,null,null,null,null,null,null,null,null,null,null,null,null,null,null,29,1,"No",null,29,2,"No",null,29,3,"No",null,29,4,"No",null,null,null,null,null,29,6,"No",4347837.07,29,97,null,null,null,null,null,null,29,9,"No"]
["COLONIAL HEIGHTS CITY PUBLIC SCHOOLS",106,null,null,null,null,null,"27.","27. Supplemental educational services as defined in Section 1116(e) of Title I, Part A",null,null,null,null,null,null,null,null,null,null,null,null,null,null,null,null,30,1,"Yes",null,30,2,"Yes",null,30,3,"Yes",null,30,4,"Yes",null,null,null,null,null,30,6,"Yes",72572.320000000007,30,97,null,null,null,null,null,null,30,9,"Yes"]
["COVINGTON CITY PUBLIC SCHOOLS",107,null,null,null,null,null,null,"Program Administration",null,null,null,null,null,null,null,null,null,null,null,null,null,null,null,null,31,1,"Yes",null,31,2,"Yes",null,31,3,"Yes",null,31,4,"Yes",null,null,null,null,null,31,6,"Yes",6271.6799999999994,31,97,null,null,null,null,null,null,31,9,"Yes"]
["CRAIG COUNTY PUBLIC SCHOOLS",23,null,null,null,null,null,null,"Indirect Costs (not to exceed approved rate)",null,null,null,null,null,null,null,null,null,null,null,null,null,null,null,null,32,1,"Yes",null,32,2,"Yes",null,32,3,"Yes",null,32,4,"Yes",null,null,null,null,null,32,6,"Yes",5375.7300000000005,32,97,null,null,null,null,null,null,32,9,"Yes"]
["CULPEPER COUNTY PUBLIC SCHOOLS",24,null,null,null,null,null,null,null,null,null,null,null,null,null,null,null,null,null,null,null,null,null,null,null,33,1,"Yes",null,33,2,"Yes",null,33,3,"Yes",null,33,4,"Yes",null,null,null,null,null,33,6,"Yes",16687.150000000001,33,97,null,null,null,null,null,null,33,9,"Yes"]
["CUMBERLAND COUNTY PUBLIC SCHOOLS",25,null,null,null,null,null,null,null,null,null,null,null,null,null,null,null,null,null,null,null,null,null,null,null,34,1,"No",null,34,2,"No",null,34,3,"No",null,34,4,"No",null,null,null,null,null,34,6,"No",78014.22,34,97,null,null,null,null,null,null,34,9,"No"]
["DANVILLE CITY PUBLIC SCHOOLS",108,null,null,null,null,null,null,null,null,null,null,null,null,null,null,null,null,null,null,null,null,null,null,null,35,1,"No",null,35,2,"No",null,35,3,"No",null,35,4,"No",null,null,null,null,null,35,6,"No",0,35,97,null,null,null,null,null,null,35,9,"No"]
["DEPARTMENT OF JUVENILE JUSTICE",917,null,null,null,null,null,null,null,null,null,null,null,null,null,null,null,null,null,null,null,null,null,null,null,36,1,"Yes",null,36,2,"Yes",null,36,3,"Yes",null,36,4,"Yes",null,null,null,null,null,36,6,"Yes",5823.71,36,97,null,null,null,null,null,null,36,9,"Yes"]
["DICKENSON COUNTY PUBLIC SCHOOLS",26,null,null,null,null,null,null,null,null,null,null,null,null,null,null,null,null,null,null,null,null,null,null,null,37,1,"No",null,37,2,"No",null,37,3,"No",null,37,4,"No",null,null,null,null,null,37,6,"No",5263.7300000000005,37,97,null,null,null,null,null,null,37,9,"No"]
["DINWIDDIE COUNTY PUBLIC SCHOOLS",27,null,null,null,null,null,null,null,null,null,null,null,null,null,null,null,null,null,null,null,null,null,null,null,38,1,"No",null,38,2,"No",null,38,3,"No",null,38,4,"No",null,null,null,null,null,38,6,"No",1567.9199999999998,38,97,null,null,null,null,null,null,38,9,"No"]
["EMPORIA CITY PUBLIC SCHOOLS",138,null,null,null,null,null,null,null,null,null,null,null,null,null,null,null,null,null,null,null,null,null,null,null,39,1,"Yes",null,39,2,"Yes",null,39,3,"Yes",null,39,4,"Yes",null,null,null,null,null,39,6,"Yes",12431.37,39,97,null,null,null,null,null,null,39,9,"Yes"]
["ESSEX COUNTY PUBLIC SCHOOLS",28,null,null,null,null,null,null,null,null,null,null,null,null,null,null,null,null,null,null,null,null,null,null,null,40,1,"Yes",null,40,2,"Yes",null,40,3,"Yes",null,40,4,"Yes",null,null,null,null,null,40,6,"Yes",5263.7300000000005,40,97,null,null,null,null,null,null,40,9,"Yes"]
["FAIRFAX CITY PUBLIC SCHOOLS",134,null,null,null,null,null,null,null,null,null,null,null,null,null,null,null,null,null,null,null,null,null,null,null,41,1,"Yes",null,41,2,"Yes",null,41,3,"Yes",null,41,4,"Yes",null,null,null,null,null,41,6,"Yes",6047.6900000000005,41,97,null,null,null,null,null,null,41,9,"Yes"]
["FAIRFAX COUNTY PUBLIC SCHOOLS",29,null,null,null,null,null,null,null,null,null,null,null,null,null,null,null,null,null,null,null,null,null,null,null,42,1,"No",null,42,2,"No",null,42,3,"No",null,42,4,"No",null,null,null,null,null,42,6,"No",27550.6,42,97,null,null,null,null,null,null,42,9,"No"]
["FALLS CHURCH CITY PUBLIC SCHOOLS",109,null,null,null,null,null,null,null,null,null,null,null,null,null,null,null,null,null,null,null,null,null,null,null,43,1,"No",null,43,2,"No",null,43,3,"No",null,43,4,"No",null,null,null,null,null,43,6,"No",389125.89,43,97,null,null,null,null,null,null,43,9,"No"]
["FAUQUIER COUNTY PUBLIC SCHOOLS",30,null,null,null,null,null,null,null,null,null,null,null,null,null,null,null,null,null,null,null,null,null,null,null,44,1,"No",null,44,2,"No",null,44,3,"No",null,44,4,"No",null,null,null,null,null,44,6,"No",57117.1,44,97,null,null,null,null,null,null,44,9,"No"]
["FLOYD COUNTY PUBLIC SCHOOLS",31,null,null,null,null,null,null,null,null,null,null,null,null,null,null,null,null,null,null,null,null,null,null,null,45,1,"No",null,45,2,"No",null,45,3,"No",null,45,4,"No",null,null,null,null,null,45,6,"No",0,45,97,null,null,null,null,null,null,45,9,"No"]
["FLUVANNA COUNTY PUBLIC SCHOOLS",32,null,null,null,null,null,null,null,null,null,null,null,null,null,null,null,null,null,null,null,null,null,null,null,46,1,"No",null,46,2,"No",null,46,3,"No",null,46,4,"No",null,null,null,null,null,46,6,"No",4479.7700000000004,46,97,null,null,null,null,null,null,46,9,"No"]
["FRANKLIN CITY PUBLIC SCHOOLS",135,null,null,null,null,null,null,null,null,null,null,null,null,null,null,null,null,null,null,null,null,null,null,null,47,1,null,null,47,2,null,null,47,3,null,null,47,4,null,null,null,null,null,null,47,6,null,0,47,97,null,null,null,null,null,null,47,9]
["FRANKLIN COUNTY PUBLIC SCHOOLS",33,null,null,null,null,null,null,null,null,null,null,null,null,null,null,null,null,null,null,null,null,null,null,null,48,1,"No",null,48,2,"No",null,48,3,"No",null,48,4,"No",null,null,null,null,null,48,6,"No",3695.81,48,97,null,null,null,null,null,null,48,9,"No"]
["FREDERICK COUNTY PUBLIC SCHOOLS",34,null,null,null,null,null,null,null,null,null,null,null,null,null,null,null,null,null,null,null,null,null,null,null,49,1,"Yes",null,49,2,"Yes",null,49,3,"Yes",null,49,4,"Yes",null,null,null,null,null,49,6,"Yes",1455.93,49,97,null,null,null,null,null,null,49,9,"Yes"]
["FREDERICKSBURG CITY PUBLIC SCHOOLS",110,null,null,null,null,null,null,null,null,null,null,null,null,null,null,null,null,null,null,null,null,null,null,null,50,1,"Yes",null,50,2,"Yes",null,50,3,"Yes",null,50,4,"Yes",null,null,null,null,null,50,6,"Yes",2575.86,50,97,null,null,null,null,null,null,50,9,"Yes"]
["GALAX CITY PUBLIC SCHOOLS",111,null,null,null,null,null,null,null,null,null,null,null,null,null,null,null,null,null,null,null,null,null,null,null,51,1,"Yes",null,51,2,"Yes",null,51,3,"Yes",null,51,4,"Yes",null,null,null,null,null,51,6,"Yes",0,51,97,null,null,null,null,null,null,51,9,"Yes"]
["GILES COUNTY PUBLIC SCHOOLS",35,null,null,null,null,null,null,null,null,null,null,null,null,null,null,null,null,null,null,null,null,null,null,null,52,1,"Yes",null,52,2,"Yes",null,52,3,"Yes",null,52,4,"Yes",null,null,null,null,null,52,6,"Yes",0,52,97,null,null,null,null,null,null,52,9,"Yes"]
["GLOUCESTER COUNTY PUBLIC SCHOOLS",36,null,null,null,null,null,null,null,null,null,null,null,null,null,null,null,null,null,null,null,null,null,null,null,53,1,"Yes",null,53,2,"Yes",null,53,3,"Yes",null,53,4,"Yes",null,null,null,null,null,53,6,"Yes",996429.42999999993,53,97,null,null,null,null,null,null,53,9,"Yes"]
["GOOCHLAND COUNTY PUBLIC SCHOOLS",37,null,null,null,null,null,null,null,null,null,null,null,null,null,null,null,null,null,null,null,null,null,null,null,54,1,"No",null,54,2,"No",null,54,3,"No",null,54,4,"No",null,null,null,null,null,54,6,"No",9743.51,54,97,null,null,null,null,null,null,54,9,"No"]
["GRAYSON COUNTY PUBLIC SCHOOLS",38,null,null,null,null,null,null,null,null,null,null,null,null,null,null,null,null,null,null,null,null,null,null,null,55,1,"Yes",null,55,2,"Yes",null,55,3,"Yes",null,55,4,"Yes",null,null,null,null,null,55,6,"Yes",8847.5499999999993,55,97,null,null,null,null,null,null,55,9,"Yes"]
["GREENE COUNTY PUBLIC SCHOOLS",39,null,null,null,null,null,null,null,null,null,null,null,null,null,null,null,null,null,null,null,null,null,null,null,56,1,"No",null,56,2,"No",null,56,3,"No",null,56,4,"No",null,null,null,null,null,56,6,"No",783.95999999999992,56,97,null,null,null,null,null,null,56,9,"No"]
["GREENSVILLE COUNTY PUBLIC SCHOOLS",40,null,null,null,null,null,null,null,null,null,null,null,null,null,null,null,null,null,null,null,null,null,null,null,57,1,"Yes",null,57,2,"Yes",null,57,3,"Yes",null,57,4,"Yes",null,null,null,null,null,57,6,"Yes",1343.9299999999998,57,97,null,null,null,null,null,null,57,9,"Yes"]
["HALIFAX COUNTY PUBLIC SCHOOLS",41,null,null,null,null,null,null,null,null,null,null,null,null,null,null,null,null,null,null,null,null,null,null,null,58,1,"Yes",null,58,2,"Yes",null,58,3,"Yes",null,58,4,"Yes",null,null,null,null,null,58,6,"Yes",5039.75,58,97,null,null,null,null,null,null,58,9,"Yes"]
["HAMPTON CITY PUBLIC SCHOOLS",112,null,null,null,null,null,null,null,null,null,null,null,null,null,null,null,null,null,null,null,null,null,null,null,59,1,"Yes",null,59,2,"Yes",null,59,3,"Yes",null,59,4,"Yes",null,null,null,null,null,59,6,"Yes",1343.9299999999998,59,97,null,null,null,null,null,null,59,9,"Yes"]
["HANOVER COUNTY PUBLIC SCHOOLS",42,null,null,null,null,null,null,null,null,null,null,null,null,null,null,null,null,null,null,null,null,null,null,null,60,1,"No",null,60,2,"No",null,60,3,"No",null,60,4,"No",null,null,null,null,null,60,6,"No",26766.65,60,97,null,null,null,null,null,null,60,9,"No"]
["HARRISONBURG CITY PUBLIC SCHOOLS",113,null,null,null,null,null,null,null,null,null,null,null,null,null,null,null,null,null,null,null,null,null,null,null,62,1,"No",null,62,2,"No",null,62,3,"No",null,62,4,"No",null,null,null,null,null,62,6,"No",4255.79,62,97,null,null,null,null,null,null,62,9,"No"]
["HENRICO COUNTY PUBLIC SCHOOLS",43,null,null,null,null,null,null,null,null,null,null,null,null,null,null,null,null,null,null,null,null,null,null,null,63,1,"Yes",null,63,2,"Yes",null,63,3,"Yes",null,63,4,"Yes",null,null,null,null,null,63,6,"Yes",2911.85,63,97,null,null,null,null,null,null,63,9,"Yes"]
["HENRY COUNTY PUBLIC SCHOOLS",44,null,null,null,null,null,null,null,null,null,null,null,null,null,null,null,null,null,null,null,null,null,null,null,65,1,"Yes",null,65,2,"Yes",null,65,3,"Yes",null,65,4,"Yes",null,null,null,null,null,65,6,"Yes",19039.03,65,97,null,null,null,null,null,null,65,9,"Yes"]
["HIGHLAND COUNTY PUBLIC SCHOOLS",45,null,null,null,null,null,null,null,null,null,null,null,null,null,null,null,null,null,null,null,null,null,null,null,66,1,"Yes",null,66,2,"Yes",null,66,3,"Yes",null,66,4,"Yes",null,null,null,null,null,66,6,"Yes",2239.8900000000003,66,97,null,null,null,null,null,null,66,9,"Yes"]
["HOPEWELL CITY PUBLIC SCHOOLS",114,null,null,null,null,null,null,null,null,null,null,null,null,null,null,null,null,null,null,null,null,null,null,null,67,1,"Yes",null,67,2,"Yes",null,67,3,"Yes",null,67,4,"Yes",null,null,null,null,null,67,6,"Yes",7391.63,67,97,null,null,null,null,null,null,67,9,"Yes"]
["ISLE OF WIGHT COUNTY PUBLIC SCHOOLS",46,null,null,null,null,null,null,null,null,null,null,null,null,null,null,null,null,null,null,null,null,null,null,null,68,1,"Yes",null,68,2,"Yes",null,68,3,"Yes",null,68,4,"Yes",null,null,null,null,null,68,6,"Yes",15455.22,68,97,null,null,null,null,null,null,68,9,"Yes"]
["JAMES CITY COUNTY PUBLIC SCHOOLS",47,null,null,null,null,null,null,null,null,null,null,null,null,null,null,null,null,null,null,null,null,null,null,null,69,1,"Yes",null,69,2,"Yes",null,69,3,"Yes",null,69,4,"Yes",null,null,null,null,null,69,6,"Yes",2575.86,69,97,null,null,null,null,null,null,69,9,"Yes"]
["JAMES MADISON UNIVERSITY",871,null,null,null,null,null,null,null,null,null,null,null,null,null,null,null,null,null,null,null,null,null,null,null,70,1,"No",null,70,2,"No",null,70,3,"No",null,70,4,"No",null,null,null,null,null,70,6,"No",6383.68,70,97,null,null,null,null,null,null,70,9,"No"]
["KING AND QUEEN COUNTY PUBLIC SCHOOLS",49,null,null,null,null,null,null,null,null,null,null,null,null,null,null,null,null,null,null,null,null,null,null,null,71,1,"No",null,71,2,"No",null,71,3,"No",null,71,4,"No",null,null,null,null,null,71,6,"No",20830.95,71,97,null,null,null,null,null,null,71,9,"No"]
["KING GEORGE COUNTY PUBLIC SCHOOLS",48,null,null,null,null,null,null,null,null,null,null,null,null,null,null,null,null,null,null,null,null,null,null,null,72,1,"No",null,72,2,"No",null,72,3,"No",null,72,4,"No",null,null,null,null,null,72,6,"No",1567.9199999999998,72,97,null,null,null,null,null,null,72,9,"No"]
["KING WILLIAM COUNTY PUBLIC SCHOOLS",50,null,null,null,null,null,null,null,null,null,null,null,null,null,null,null,null,null,null,null,null,null,null,null,73,1,"Yes",null,73,2,"Yes",null,73,3,"Yes",null,73,4,"Yes",null,null,null,null,null,73,6,"Yes",3583.82,73,97,null,null,null,null,null,null,73,9,"Yes"]
["LANCASTER COUNTY PUBLIC SCHOOLS",51,null,null,null,null,null,null,null,null,null,null,null,null,null,null,null,null,null,null,null,null,null,null,null,74,1,"Yes",null,74,2,"Yes",null,74,3,"Yes",null,74,4,"Yes",null,null,null,null,null,74,6,"Yes",9183.5300000000007,74,97,null,null,null,null,null,null,74,9,"Yes"]
["LEE COUNTY PUBLIC SCHOOLS",52,null,null,null,null,null,null,null,null,null,null,null,null,null,null,null,null,null,null,null,null,null,null,null,75,1,"No",null,75,2,"No",null,75,3,"No",null,75,4,"No",null,null,null,null,null,75,6,"No",1770534.05,75,97,null,null,null,null,null,null,75,9,"No"]
["LEXINGTON CITY PUBLIC SCHOOLS",137,null,null,null,null,null,null,null,null,null,null,null,null,null,null,null,null,null,null,null,null,null,null,null,77,1,"No",null,77,2,"No",null,77,3,"No",null,77,4,"No",null,null,null,null,null,77,6,"No",3807.81,77,97,null,null,null,null,null,null,77,9,"No"]
["LOUDOUN COUNTY PUBLIC SCHOOLS",53,null,null,null,null,null,null,null,null,null,null,null,null,null,null,null,null,null,null,null,null,null,null,null,78,1,"Yes",null,78,2,"Yes",null,78,3,"Yes",null,78,4,"Yes",null,null,null,null,null,78,6,"Yes",1791.9099999999999,78,97,null,null,null,null,null,null,78,9,"Yes"]
["LOUISA COUNTY PUBLIC SCHOOLS",54,null,null,null,null,null,null,null,null,null,null,null,null,null,null,null,null,null,null,null,null,null,null,null,79,1,"Yes",null,79,2,"Yes",null,79,3,"Yes",null,79,4,"Yes",null,null,null,null,null,79,6,"Yes",4815.75,79,97,null,null,null,null,null,null,79,9,"Yes"]
["LUNENBURG COUNTY PUBLIC SCHOOLS",55,null,null,null,null,null,null,null,null,null,null,null,null,null,null,null,null,null,null,null,null,null,null,null,80,1,"No",null,80,2,"No",null,80,3,"No",null,80,4,"No",null,null,null,null,null,80,6,"No",32926.33,80,97,null,null,null,null,null,null,80,9,"No"]
["LYNCHBURG CITY PUBLIC SCHOOLS",115,null,null,null,null,null,null,null,null,null,null,null,null,null,null,null,null,null,null,null,null,null,null,null,81,1,"Yes",null,81,2,"Yes",null,81,3,"Yes",null,81,4,"Yes",null,null,null,null,null,81,6,"Yes",4367.78,81,97,null,null,null,null,null,null,81,9,"Yes"]
["MADISON COUNTY PUBLIC SCHOOLS",56,null,null,null,null,null,null,null,null,null,null,null,null,null,null,null,null,null,null,null,null,null,null,null,82,1,"No",null,82,2,"No",null,82,3,"No",null,82,4,"No",null,null,null,null,null,82,6,"No",99246.64,82,97,null,null,null,null,null,null,82,9,"No"]
["MANASSAS CITY PUBLIC SCHOOLS",143,null,null,null,null,null,null,null,null,null,null,null,null,null,null,null,null,null,null,null,null,null,null,null,83,1,"No",null,83,2,"No",null,83,3,"No",null,83,4,"No",null,null,null,null,null,83,6,"No",895.94999999999993,83,97,null,null,null,null,null,null,83,9,"No"]
["MANASSAS PARK CITY PUBLIC SCHOOLS",144,null,null,null,null,null,null,null,null,null,null,null,null,null,null,null,null,null,null,null,null,null,null,null,84,1,"No",null,84,2,"No",null,84,3,"No",null,84,4,"No",null,null,null,null,null,84,6,"No",1119.94,84,97,null,null,null,null,null,null,84,9,"No"]
["MARTINSVILLE CITY PUBLIC SCHOOLS",116,null,null,null,null,null,null,null,null,null,null,null,null,null,null,null,null,null,null,null,null,null,null,null,85,1,"Yes",null,85,2,"Yes",null,85,3,"Yes",null,85,4,"Yes",null,null,null,null,null,85,6,"Yes",41661.89,85,97,null,null,null,null,null,null,85,9,"Yes"]
["MATHEWS COUNTY PUBLIC SCHOOLS",57,null,null,null,null,null,null,null,null,null,null,null,null,null,null,null,null,null,null,null,null,null,null,null,86,1,"No",null,86,2,"No",null,86,3,"No",null,86,4,"No",null,null,null,null,null,86,6,"No",4031.79,86,97,null,null,null,null,null,null,86,9,"No"]
["MCVH AUTHORITY",948,null,null,null,null,null,null,null,null,null,null,null,null,null,null,null,null,null,null,null,null,null,null,null,87,1,"No",null,87,2,"No",null,87,3,"No",null,87,4,"No",null,null,null,null,null,87,6,"No",223.98999999999998,87,97,null,null,null,null,null,null,87,9,"No"]
["MECKLENBURG COUNTY PUBLIC SCHOOLS",58,null,null,null,null,null,null,null,null,null,null,null,null,null,null,null,null,null,null,null,null,null,null,null,88,1,"No",null,88,2,"No",null,88,3,"No",null,88,4,"No",null,null,null,null,null,88,6,"No",129608.01000000001,88,97,null,null,null,null,null,null,88,9,"No"]
["MIDDLESEX COUNTY PUBLIC SCHOOLS",59,null,null,null,null,null,null,null,null,null,null,null,null,null,null,null,null,null,null,null,null,null,null,null,89,1,"Yes",null,89,2,"Yes",null,89,3,"Yes",null,89,4,"Yes",null,null,null,null,null,89,6,"Yes",188409.46999999997,89,97,null,null,null,null,null,null,89,9,"Yes"]
["MONTGOMERY COUNTY PUBLIC SCHOOLS",60,null,null,null,null,null,null,null,null,null,null,null,null,null,null,null,null,null,null,null,null,null,null,null,90,1,"Yes",null,90,2,"Yes",null,90,3,"Yes",null,90,4,"Yes",null,null,null,null,null,90,6,"Yes",0,90,97,null,null,null,null,null,null,90,9,"Yes"]
["NELSON COUNTY PUBLIC SCHOOLS",62,null,null,null,null,null,null,null,null,null,null,null,null,null,null,null,null,null,null,null,null,null,null,null,91,1,"Yes",null,91,2,"Yes",null,91,3,"Yes",null,91,4,"Yes",null,null,null,null,null,91,6,"Yes",1343.9299999999998,91,97,null,null,null,null,null,null,91,9,"Yes"]
["NEW KENT COUNTY PUBLIC SCHOOLS",63,null,null,null,null,null,null,null,null,null,null,null,null,null,null,null,null,null,null,null,null,null,null,null,92,1,"No",null,92,2,"No",null,92,3,"No",null,92,4,"No",null,null,null,null,null,92,6,"No",1791.9099999999999,92,97,null,null,null,null,null,null,92,9,"No"]
["NEWPORT NEWS CITY PUBLIC SCHOOLS",117,null,null,null,null,null,null,null,null,null,null,null,null,null,null,null,null,null,null,null,null,null,null,null,93,1,"Yes",null,93,2,"Yes",null,93,3,"Yes",null,93,4,"Yes",null,null,null,null,null,93,6,"Yes",17279.75,93,97,null,null,null,null,null,null,93,9,"Yes"]
["NORFOLK CITY PUBLIC SCHOOLS",118,null,null,null,null,null,null,null,null,null,null,null,null,null,null,null,null,null,null,null,null,null,null,null,94,1,"Yes",null,94,2,"Yes",null,94,3,"Yes",null,94,4,"Yes",null,null,null,null,null,94,6,"Yes",0,94,97,null,null,null,null,null,null,94,9,"Yes"]
["NORTHAMPTON COUNTY PUBLIC SCHOOLS",65,null,null,null,null,null,null,null,null,null,null,null,null,null,null,null,null,null,null,null,null,null,null,null,95,1,"Yes",null,95,2,"Yes",null,95,3,"Yes",null,95,4,"Yes",null,null,null,null,null,95,6,"Yes",8847.5499999999993,95,97,null,null,null,null,null,null,95,9,"Yes"]
["NORTHUMBERLAND COUNTY PUBLIC SCHOOLS",66,null,null,null,null,null,null,null,null,null,null,null,null,null,null,null,null,null,null,null,null,null,null,null,96,1,"No",null,96,2,"No",null,96,3,"No",null,96,4,"No",null,null,null,null,null,96,6,"No",1791.9099999999999,96,97,null,null,null,null,null,null,96,9,"No"]
["NORTON CITY PUBLIC SCHOOLS",119,null,null,null,null,null,null,null,null,null,null,null,null,null,null,null,null,null,null,null,null,null,null,null,97,1,"Yes",null,97,2,"Yes",null,97,3,"Yes",null,97,4,"Yes",null,null,null,null,null,97,6,"Yes",0,97,97,null,null,null,null,null,null,97,9,"Yes"]
["NOTTOWAY COUNTY PUBLIC SCHOOLS",67,null,null,null,null,null,null,null,null,null,null,null,null,null,null,null,null,null,null,null,null,null,null,null,98,1,"Yes",null,98,2,"Yes",null,98,3,"Yes",null,98,4,"Yes",null,null,null,null,null,98,6,"Yes",36062.17,98,97,null,null,null,null,null,null,98,9,"Yes"]
["OLD DOMINION UNIVERSITY",798,null,null,null,null,null,null,null,null,null,null,null,null,null,null,null,null,null,null,null,null,null,null,null,101,1,"No",null,101,2,"No",null,101,3,"No",null,101,4,"No",null,null,null,null,null,101,6,"No",571554.50999999989,101,97,null,null,null,null,null,null,101,9,"No"]
["ORANGE COUNTY PUBLIC SCHOOLS",68,null,null,null,null,null,null,null,null,null,null,null,null,null,null,null,null,null,null,null,null,null,null,null,102,1,"Yes",null,102,2,"Yes",null,102,3,"Yes",null,102,4,"Yes",null,null,null,null,null,102,6,"Yes",3135.8399999999997,102,97,null,null,null,null,null,null,102,9,"Yes"]
["PAGE COUNTY PUBLIC SCHOOLS",69,null,null,null,null,null,null,null,null,null,null,null,null,null,null,null,null,null,null,null,null,null,null,null,103,1,"No",null,103,2,"No",null,103,3,"No",null,103,4,"No",null,null,null,null,null,103,6,"No",0,103,97,null,null,null,null,null,null,103,9,"No"]
["PATRICK COUNTY PUBLIC SCHOOLS",70,null,null,null,null,null,null,null,null,null,null,null,null,null,null,null,null,null,null,null,null,null,null,null,104,1,"Yes",null,104,2,"Yes",null,104,3,"Yes",null,104,4,"Yes",null,null,null,null,null,104,6,"Yes",49389.5,104,97,null,null,null,null,null,null,104,9,"Yes"]
["PETERSBURG CITY PUBLIC SCHOOLS",120,null,null,null,null,null,null,null,null,null,null,null,null,null,null,null,null,null,null,null,null,null,null,null,106,1,"Yes",null,106,2,"Yes",null,106,3,"Yes",null,106,4,"Yes",null,null,null,null,null,106,6,"Yes",9183.5300000000007,106,97,null,null,null,null,null,null,106,9,"Yes"]
["PITTSYLVANIA COUNTY PUBLIC SCHOOLS",71,null,null,null,null,null,null,null,null,null,null,null,null,null,null,null,null,null,null,null,null,null,null,null,107,1,"No",null,107,2,"No",null,107,3,"No",null,107,4,"No",null,null,null,null,null,107,6,"No",0,107,97,null,null,null,null,null,null,107,9,"No"]
["POQUOSON CITY PUBLIC SCHOOLS",142,null,null,null,null,null,null,null,null,null,null,null,null,null,null,null,null,null,null,null,null,null,null,null,108,1,"No",null,108,2,"No",null,108,3,"No",null,108,4,"No",null,null,null,null,null,108,6,"No",22062.880000000001,108,97,null,null,null,null,null,null,108,9,"No"]
["PORTSMOUTH CITY PUBLIC SCHOOLS",121,null,null,null,null,null,null,null,null,null,null,null,null,null,null,null,null,null,null,null,null,null,null,null,109,1,"No",null,109,2,"No",null,109,3,"No",null,109,4,"No",null,null,null,null,null,109,6,"No",20395.36,109,97,null,null,null,null,null,null,109,9,"No"]
["POWHATAN COUNTY PUBLIC SCHOOLS",72,null,null,null,null,null,null,null,null,null,null,null,null,null,null,null,null,null,null,null,null,null,null,null,110,1,"No",null,110,2,"No",null,110,3,"No",null,110,4,"No",null,null,null,null,null,110,6,"No",52973.32,110,97,null,null,null,null,null,null,110,9,"No"]
["PRINCE EDWARD COUNTY PUBLIC SCHOOLS",73,null,null,null,null,null,null,null,null,null,null,null,null,null,null,null,null,null,null,null,null,null,null,null,111,1,"No",null,111,2,"No",null,111,3,"No",null,111,4,"No",null,null,null,null,null,111,6,"No",18367.07,111,97,null,null,null,null,null,null,111,9,"No"]
["PRINCE GEORGE COUNTY PUBLIC SCHOOLS",74,null,null,null,null,null,null,null,null,null,null,null,null,null,null,null,null,null,null,null,null,null,null,null,112,1,"No",null,112,2,"No",null,112,3,"No",null,112,4,"No",null,null,null,null,null,112,6,"No",43029.53,112,97,null,null,null,null,null,null,112,9,"No"]
["PRINCE WILLIAM COUNTY PUBLIC SCHOOLS",75,null,null,null,null,null,null,null,null,null,null,null,null,null,null,null,null,null,null,null,null,null,null,null,113,1,"No",null,113,2,"No",null,113,3,"No",null,113,4,"No",null,null,null,null,null,113,6,"No",246194.89,113,97,null,null,null,null,null,null,113,9,"No"]
["PULASKI COUNTY PUBLIC SCHOOLS",77,null,null,null,null,null,null,null,null,null,null,null,null,null,null,null,null,null,null,null,null,null,null,null,114,1,"Yes",null,114,2,"Yes",null,114,3,"Yes",null,114,4,"Yes",null,null,null,null,null,114,6,"Yes",12431.37,114,97,null,null,null,null,null,null,114,9,"Yes"]
["RADFORD CITY PUBLIC SCHOOLS",122,null,null,null,null,null,null,null,null,null,null,null,null,null,null,null,null,null,null,null,null,null,null,null,115,1,"Yes",null,115,2,"Yes",null,115,3,"Yes",null,115,4,"Yes",null,null,null,null,null,115,6,"Yes",23294.82,115,97,null,null,null,null,null,null,115,9,"Yes"]
["RAPPAHANNOCK COUNTY PUBLIC SCHOOLS",78,null,null,null,null,null,null,null,null,null,null,null,null,null,null,null,null,null,null,null,null,null,null,null,116,1,"Yes",null,116,2,"Yes",null,116,3,"Yes",null,116,4,"Yes",null,null,null,null,null,116,6,"Yes",14111.289999999999,116,97,null,null,null,null,null,null,116,9,"Yes"]
["RICHMOND CITY PUBLIC SCHOOLS",123,null,null,null,null,null,null,null,null,null,null,null,null,null,null,null,null,null,null,null,null,null,null,null,117,1,"No",null,117,2,"No",null,117,3,"No",null,117,4,"No",null,null,null,null,null,117,6,"No",164346.05000000002,117,97,null,null,null,null,null,null,117,9,"No"]
["RICHMOND COUNTY PUBLIC SCHOOLS",79,null,null,null,null,null,null,null,null,null,null,null,null,null,null,null,null,null,null,null,null,null,null,null,118,1,"Yes",null,118,2,"Yes",null,118,3,"Yes",null,118,4,"Yes",null,null,null,null,null,118,6,"Yes",109386.36,118,97,null,null,null,null,null,null,118,9,"Yes"]
["ROANOKE CITY PUBLIC SCHOOLS",124,null,null,null,null,null,null,null,null,null,null,null,null,null,null,null,null,null,null,null,null,null,null,null,119,1,"Yes",null,119,2,"Yes",null,119,3,"Yes",null,119,4,"Yes",null,null,null,null,null,119,6,"Yes",335.97999999999996,119,97,null,null,null,null,null,null,119,9,"Yes"]
["ROANOKE COUNTY PUBLIC SCHOOLS",80,null,null,null,null,null,null,null,null,null,null,null,null,null,null,null,null,null,null,null,null,null,null,null,120,1,"Yes",null,120,2,"Yes",null,120,3,"Yes",null,120,4,"Yes",null,null,null,null,null,120,6,"Yes",16463.170000000002,120,97,null,null,null,null,null,null,120,9,"Yes"]
["ROCKBRIDGE COUNTY PUBLIC SCHOOLS",81,null,null,null,null,null,null,null,null,null,null,null,null,null,null,null,null,null,null,null,null,null,null,null,121,1,"Yes",null,121,2,"Yes",null,121,3,"Yes",null,121,4,"Yes",null,null,null,null,null,121,6,"Yes",15173.28,121,97,null,null,null,null,null,null,121,9,"Yes"]
["ROCKINGHAM COUNTY PUBLIC SCHOOLS",82,null,null,null,null,null,null,null,null,null,null,null,null,null,null,null,null,null,null,null,null,null,null,null,122,1,"No",null,122,2,"No",null,122,3,"No",null,122,4,"No",null,null,null,null,null,122,6,"No",1343.9299999999998,122,97,null,null,null,null,null,null,122,9,"No"]
["RUSSELL COUNTY PUBLIC SCHOOLS",83,null,null,null,null,null,null,null,null,null,null,null,null,null,null,null,null,null,null,null,null,null,null,null,123,1,"No",null,123,2,"No",null,123,3,"No",null,123,4,"No",null,null,null,null,null,123,6,"No",271215.74,123,97,null,null,null,null,null,null,123,9,"No"]
["SALEM CITY PUBLIC SCHOOLS",139,null,null,null,null,null,null,null,null,null,null,null,null,null,null,null,null,null,null,null,null,null,null,null,124,1,"Yes",null,124,2,"Yes",null,124,3,"Yes",null,124,4,"Yes",null,null,null,null,null,124,6,"Yes",145212.42000000001,124,97,null,null,null,null,null,null,124,9,"Yes"]
["SCOTT COUNTY PUBLIC SCHOOLS",84,null,null,null,null,null,null,null,null,null,null,null,null,null,null,null,null,null,null,null,null,null,null,null,126,1,"No",null,126,2,"No",null,126,3,"No",null,126,4,"No",null,null,null,null,null,126,6,"No",4591.7700000000004,126,97,null,null,null,null,null,null,126,9,"No"]
["SHENANDOAH COUNTY PUBLIC SCHOOLS",85,null,null,null,null,null,null,null,null,null,null,null,null,null,null,null,null,null,null,null,null,null,null,null,127,1,"Yes",null,127,2,"Yes",null,127,3,"Yes",null,127,4,"Yes",null,null,null,null,null,127,6,"Yes",6943.65,127,97,null,null,null,null,null,null,127,9,"Yes"]
["SMYTH COUNTY PUBLIC SCHOOLS",86,null,null,null,null,null,null,null,null,null,null,null,null,null,null,null,null,null,null,null,null,null,null,null,128,1,"No",null,128,2,"No",null,128,3,"No",null,128,4,"No",null,null,null,null,null,128,6,"No",118489.98999999999,128,97,null,null,null,null,null,null,128,9,"No"]
["SOUTHAMPTON COUNTY PUBLIC SCHOOLS",87,null,null,null,null,null,null,null,null,null,null,null,null,null,null,null,null,null,null,null,null,null,null,null,130,1,"Yes",null,130,2,"Yes",null,130,3,"Yes",null,130,4,"Yes",null,null,null,null,null,130,6,"Yes",18807.23,130,97,null,null,null,null,null,null,130,9,"Yes"]
["SOUTHWESTERN VA TRAINING CENTER",951,null,null,null,null,null,null,null,null,null,null,null,null,null,null,null,null,null,null,null,null,null,null,null,131,1,"Yes",null,131,2,"Yes",null,131,3,"Yes",null,131,4,"Yes",null,null,null,null,null,131,6,"Yes",61326.66,131,97,null,null,null,null,null,null,131,9,"Yes"]
["SPOTSYLVANIA COUNTY PUBLIC SCHOOLS",88,null,null,null,null,null,null,null,null,null,null,null,null,null,null,null,null,null,null,null,null,null,null,null,132,1,"Yes",null,132,2,"Yes",null,132,3,"Yes",null,132,4,"Yes",null,null,null,null,null,132,6,"Yes",96407.16,132,97,null,null,null,null,null,null,132,9,"Yes"]
["STAFFORD COUNTY PUBLIC SCHOOLS",89,null,null,null,null,null,null,null,null,null,null,null,null,null,null,null,null,null,null,null,null,null,null,null,134,null,null,null,134,2,null,null,134,3,null,null,134,4,null,null,null,null,null,null,134,6,null,0,134,97,null,null,null,null,null,null,134,9]
["STAUNTON CITY PUBLIC SCHOOLS",126,null,null,null,null,null,null,null,null,null,null,null,null,null,null,null,null,null,null,null,null,null,null,null,135,1,"Yes",null,135,2,"Yes",null,135,3,"Yes",null,135,4,"Yes",null,null,null,null,null,135,6,"Yes",1455.93,135,97,null,null,null,null,null,null,135,9,"Yes"]
["SUFFOLK CITY PUBLIC SCHOOLS",127,null,null,null,null,null,null,null,null,null,null,null,null,null,null,null,null,null,null,null,null,null,null,null,136,1,"No",null,136,2,"No",null,136,3,"No",null,136,4,"No",null,null,null,null,null,136,6,"No",96065.12,136,97,null,null,null,null,null,null,136,9,"No"]
["SURRY COUNTY PUBLIC SCHOOLS",90,null,null,null,null,null,null,null,null,null,null,null,null,null,null,null,null,null,null,null,null,null,null,null,137,1,"No",null,137,2,"No",null,137,3,"No",null,137,4,"No",null,null,null,null,null,137,6,"No",3807.81,137,97,null,null,null,null,null,null,137,9,"No"]
["SUSSEX COUNTY PUBLIC SCHOOLS",91,null,null,null,null,null,null,null,null,null,null,null,null,null,null,null,null,null,null,null,null,null,null,null,138,null,null,null,138,2,null,null,138,3,null,null,138,4,null,null,null,null,null,null,138,6,null,0,138,97,null,null,null,null,null,null,138,9]
["TAZEWELL COUNTY PUBLIC SCHOOLS",92,null,null,null,null,null,null,null,null,null,null,null,null,null,null,null,null,null,null,null,null,null,null,null,139,1,"Yes",null,139,2,"Yes",null,139,3,"Yes",null,139,4,"Yes",null,null,null,null,null,139,6,"Yes",16275.84,139,97,null,null,null,null,null,null,139,9,"Yes"]
["VA BEACH CITY PUBLIC SCHOOLS",128,null,null,null,null,null,null,null,null,null,null,null,null,null,null,null,null,null,null,null,null,null,null,null,140,1,null,null,140,2,null,null,140,3,null,null,140,4,null,null,null,null,null,null,140,6,null,0,140,97,null,null,null,null,null,null,140,9]
["VA DEPT OF CORRECTIONAL EDUCATION",900,null,null,null,null,null,null,null,null,null,null,null,null,null,null,null,null,null,null,null,null,null,null,null,142,null,"Yes",null,142,2,"Yes",null,142,3,"Yes",null,142,4,"Yes",null,null,null,null,null,142,6,"Yes",0,142,97,null,null,null,null,null,null,142,9,"Yes"]
["VIRGINIA COMMONWEALTH UNIVERSITY",881,null,null,null,null,null,null,null,null,null,null,null,null,null,null,null,null,null,null,null,null,null,null,null,143,1,"Yes",null,143,2,"Yes",null,143,3,"Yes",null,143,4,"Yes",null,null,null,null,null,143,6,"Yes",287840.20999999996,143,97,null,null,null,null,null,null,143,9,"Yes"]
["VSDB HAMPTON",219,null,null,null,null,null,null,null,null,null,null,null,null,null,null,null,null,null,null,null,null,null,null,null,144,1,"Yes",null,144,2,"Yes",null,144,3,"Yes",null,144,4,"Yes",null,null,null,null,null,144,6,"Yes",138339.53000000003,144,97,null,null,null,null,null,null,144,9,"Yes"]
["VSDB STAUNTON",218,null,null,null,null,null,null,null,null,null,null,null,null,null,null,null,null,null,null,null,null,null,null,null,202,1,"Yes",null,202,2,"Yes",null,202,3,"Yes",null,202,4,"Yes",null,null,null,null,null,202,6,"Yes",223.98999999999998,202,97,null,null,null,null,null,null,202,9,"Yes"]
["WARREN COUNTY PUBLIC SCHOOLS",93,null,null,null,null,null,null,null,null,null,null,null,null,null,null,null,null,null,null,null,null,null,null,null,207,1,"Yes",null,207,2,"Yes",null,207,3,"Yes",null,207,4,"Yes",null,null,null,null,null,207,6,"Yes",1455.93,207,97,null,null,null,null,null,null,207,9,"Yes"]
["WASHINGTON COUNTY PUBLIC SCHOOLS",94,null,null,null,null,null,null,null,null,null,null,null,null,null,null,null,null,null,null,null,null,null,null,null,218,1,"No",null,218,2,"No",null,218,3,"No",null,218,4,"No",null,null,null,null,null,218,6,"No",0,218,97,null,null,null,null,null,null,218,9,"No"]
["WAYNESBORO CITY PUBLIC SCHOOLS",130,null,null,null,null,null,null,null,null,null,null,null,null,null,null,null,null,null,null,null,null,null,null,null,219,null,null,null,219,2,null,null,219,3,null,null,219,4,null,null,null,null,null,null,871,6,null,0,219,97,null,null,null,null,null,null,219,9]
["WEST POINT TOWN PUBLIC SCHOOLS",207,null,null,null,null,null,null,null,null,null,null,null,null,null,null,null,null,null,null,null,null,null,null,null,871,null,null,null,871,2,null,null,871,3,null,null,871,4,null,null,null,null,null,null,881,6,null,0,871,97,null,null,null,null,null,null,871,9]
["WESTMORELAND COUNTY PUBLIC SCHOOLS",95,null,null,null,null,null,null,null,null,null,null,null,null,null,null,null,null,null,null,null,null,null,null,null,917,null,null,null,917,2,null,null,917,3,null,null,917,4,null,null,null,null,null,null,917,6,null,1455.93,917,97,null,null,null,null,null,null,900,9]
["WILLIAMSBURG CITY PUBLIC SCHOOLS",131]
["WINCHESTER CITY PUBLIC SCHOOLS",132,null,null,null,null,null,null,null,null,null,null,null,null,null,null,null,null,null,null,null,null,null,null,null,null,null,null,null,null,null,null,null,null,null,null,null,null,null,null,null,null,null,null,null,null,null,null,{"$f":"SUM(AW3:AW143)","v":12570758.999999996},null,null,null,0]
["WISE COUNTY PUBLIC SCHOOLS",96]
["WOODROW WILSON REHABILITATION CTR",947,null,null,null,null,null,null,null,null,null,null,null,null,null,null,null,null,null,null,null,null,null,null,null,null,null,null,null,null,null,null,null,null,null,null,null,null,null,null,null,null,null,null,null,null,null,null,{"$f":"AW144-12570759","v":0}]
["WYTHE COUNTY PUBLIC SCHOOLS",97,null,null,null,null,null,null,null,null,null,null,null,null,null,null,null,null,null,null,null,null,null,null,null,null,null,null,null,null,null,null,null,null,null,null,null,null,null,null,null,null,null,null,null,null,null,null,null,null,null,null,null,null,null,null,null,null,null,null,0]
["YORK COUNTY PUBLIC SCHOOLS",98]
[null,null,null,null,null,null,null,null,null,null,null,null,null,null,null,null,null,null,null,null,null,null,null,null,1]
[null,null,null,null,null,null,null,null,null,null,null,null,null,null,null,null,null,null,null,null,null,null,null,null,2]
[null,null,null,null,null,null,null,null,null,null,null,null,null,null,null,null,null,null,null,null,null,null,null,null,3]
[null,null,null,null,null,null,null,null,null,null,null,null,null,null,null,null,null,null,null,null,null,null,null,null,4]
[null,null,null,null,null,null,null,null,null,null,null,null,null,null,null,null,null,null,null,null,null,null,null,null,5]
[null,null,null,null,null,null,null,null,null,null,null,null,null,null,null,null,null,null,null,null,null,null,null,null,6]
[null,null,null,null,null,null,null,null,null,null,null,null,null,null,null,null,null,null,null,null,null,null,null,null,7]
[null,null,null,null,null,null,null,null,null,null,null,null,null,null,null,null,null,null,null,null,null,null,null,null,8]
[null,null,null,null,null,null,null,null,null,null,null,null,null,null,null,null,null,null,null,null,null,null,null,null,9]
[null,null,null,null,null,null,null,null,null,null,null,null,null,null,null,null,null,null,null,null,null,null,null,null,10]
[null,null,null,null,null,null,null,null,null,null,null,null,null,null,null,null,null,null,null,null,null,null,null,null,11]
[null,null,null,null,null,null,null,null,null,null,null,null,null,null,null,null,null,null,null,null,null,null,null,null,12]
[null,null,null,null,null,null,null,null,null,null,null,null,null,null,null,null,null,null,null,null,null,null,null,null,13]
[null,null,null,null,null,null,null,null,null,null,null,null,null,null,null,null,null,null,null,null,null,null,null,null,14]
[null,null,null,null,null,null,null,null,null,null,null,null,null,null,null,null,null,null,null,null,null,null,null,null,15]
[null,null,null,null,null,null,null,null,null,null,null,null,null,null,null,null,null,null,null,null,null,null,null,null,16]
[null,null,null,null,null,null,null,null,null,null,null,null,null,null,null,null,null,null,null,null,null,null,null,null,17]
[null,null,null,null,null,null,null,null,null,null,null,null,null,null,null,null,null,null,null,null,null,null,null,null,18]
[null,null,null,null,null,null,null,null,null,null,null,null,null,null,null,null,null,null,null,null,null,null,null,null,19]
[null,null,null,null,null,null,null,null,null,null,null,null,null,null,null,null,null,null,null,null,null,null,null,null,20]
[null,null,null,null,null,null,null,null,null,null,null,null,null,null,null,null,null,null,null,null,null,null,null,null,21]
[null,null,null,null,null,null,null,null,null,null,null,null,null,null,null,null,null,null,null,null,null,null,null,null,22]
[null,null,null,null,null,null,null,null,null,null,null,null,null,null,null,null,null,null,null,null,null,null,null,null,23]
[null,null,null,null,null,null,null,null,null,null,null,null,null,null,null,null,null,null,null,null,null,null,null,null,24]
[null,null,null,null,null,null,null,null,null,null,null,null,null,null,null,null,null,null,null,null,null,null,null,null,25]
[null,null,null,null,null,null,null,null,null,null,null,null,null,null,null,null,null,null,null,null,null,null,null,null,26]
[null,null,null,null,null,null,null,null,null,null,null,null,null,null,null,null,null,null,null,null,null,null,null,null,27]
[null,null,null,null,null,null,null,null,null,null,null,null,null,null,null,null,null,null,null,null,null,null,null,null,28]
[null,null,null,null,null,null,null,null,null,null,null,null,null,null,null,null,null,null,null,null,null,null,null,null,29]
[null,null,null,null,null,null,null,null,null,null,null,null,null,null,null,null,null,null,null,null,null,null,null,null,30]
[null,null,null,null,null,null,null,null,null,null,null,null,null,null,null,null,null,null,null,null,null,null,null,null,31]
[null,null,null,null,null,null,null,null,null,null,null,null,null,null,null,null,null,null,null,null,null,null,null,null,32]
[null,null,null,null,null,null,null,null,null,null,null,null,null,null,null,null,null,null,null,null,null,null,null,null,33]
[null,null,null,null,null,null,null,null,null,null,null,null,null,null,null,null,null,null,null,null,null,null,null,null,34]
[null,null,null,null,null,null,null,null,null,null,null,null,null,null,null,null,null,null,null,null,null,null,null,null,35]
[null,null,null,null,null,null,null,null,null,null,null,null,null,null,null,null,null,null,null,null,null,null,null,null,36]
[null,null,null,null,null,null,null,null,null,null,null,null,null,null,null,null,null,null,null,null,null,null,null,null,37]
[null,null,null,null,null,null,null,null,null,null,null,null,null,null,null,null,null,null,null,null,null,null,null,null,38]
[null,null,null,null,null,null,null,null,null,null,null,null,null,null,null,null,null,null,null,null,null,null,null,null,39]
[null,null,null,null,null,null,null,null,null,null,null,null,null,null,null,null,null,null,null,null,null,null,null,null,40]
[null,null,null,null,null,null,null,null,null,null,null,null,null,null,null,null,null,null,null,null,null,null,null,null,41]
[null,null,null,null,null,null,null,null,null,null,null,null,null,null,null,null,null,null,null,null,null,null,null,null,42]
[null,null,null,null,null,null,null,null,null,null,null,null,null,null,null,null,null,null,null,null,null,null,null,null,43]
[null,null,null,null,null,null,null,null,null,null,null,null,null,null,null,null,null,null,null,null,null,null,null,null,44]
[null,null,null,null,null,null,null,null,null,null,null,null,null,null,null,null,null,null,null,null,null,null,null,null,45]
[null,null,null,null,null,null,null,null,null,null,null,null,null,null,null,null,null,null,null,null,null,null,null,null,46]
[null,null,null,null,null,null,null,null,null,null,null,null,null,null,null,null,null,null,null,null,null,null,null,null,47]
[null,null,null,null,null,null,null,null,null,null,null,null,null,null,null,null,null,null,null,null,null,null,null,null,48]
[null,null,null,null,null,null,null,null,null,null,null,null,null,null,null,null,null,null,null,null,null,null,null,null,49]
[null,null,null,null,null,null,null,null,null,null,null,null,null,null,null,null,null,null,null,null,null,null,null,null,50]
[null,null,null,null,null,null,null,null,null,null,null,null,null,null,null,null,null,null,null,null,null,null,null,null,51]
[null,null,null,null,null,null,null,null,null,null,null,null,null,null,null,null,null,null,null,null,null,null,null,null,52]
[null,null,null,null,null,null,null,null,null,null,null,null,null,null,null,null,null,null,null,null,null,null,null,null,53]
[null,null,null,null,null,null,null,null,null,null,null,null,null,null,null,null,null,null,null,null,null,null,null,null,54]
[null,null,null,null,null,null,null,null,null,null,null,null,null,null,null,null,null,null,null,null,null,null,null,null,55]
[null,null,null,null,null,null,null,null,null,null,null,null,null,null,null,null,null,null,null,null,null,null,null,null,56]
[null,null,null,null,null,null,null,null,null,null,null,null,null,null,null,null,null,null,null,null,null,null,null,null,57]
[null,null,null,null,null,null,null,null,null,null,null,null,null,null,null,null,null,null,null,null,null,null,null,null,58]
[null,null,null,null,null,null,null,null,null,null,null,null,null,null,null,null,null,null,null,null,null,null,null,null,59]
[null,null,null,null,null,null,null,null,null,null,null,null,null,null,null,null,null,null,null,null,null,null,null,null,60]
[null,null,null,null,null,null,null,null,null,null,null,null,null,null,null,null,null,null,null,null,null,null,null,null,62]
[null,null,null,null,null,null,null,null,null,null,null,null,null,null,null,null,null,null,null,null,null,null,null,null,63]
[null,null,null,null,null,null,null,null,null,null,null,null,null,null,null,null,null,null,null,null,null,null,null,null,65]
[null,null,null,null,null,null,null,null,null,null,null,null,null,null,null,null,null,null,null,null,null,null,null,null,66]
[null,null,null,null,null,null,null,null,null,null,null,null,null,null,null,null,null,null,null,null,null,null,null,null,67]
[null,null,null,null,null,null,null,null,null,null,null,null,null,null,null,null,null,null,null,null,null,null,null,null,68]
[null,null,null,null,null,null,null,null,null,null,null,null,null,null,null,null,null,null,null,null,null,null,null,null,69]
[null,null,null,null,null,null,null,null,null,null,null,null,null,null,null,null,null,null,null,null,null,null,null,null,70]
[null,null,null,null,null,null,null,null,null,null,null,null,null,null,null,null,null,null,null,null,null,null,null,null,71]
[null,null,null,null,null,null,null,null,null,null,null,null,null,null,null,null,null,null,null,null,null,null,null,null,72]
[null,null,null,null,null,null,null,null,null,null,null,null,null,null,null,null,null,null,null,null,null,null,null,null,73]
[null,null,null,null,null,null,null,null,null,null,null,null,null,null,null,null,null,null,null,null,null,null,null,null,74]
[null,null,null,null,null,null,null,null,null,null,null,null,null,null,null,null,null,null,null,null,null,null,null,null,75]
[null,null,null,null,null,null,null,null,null,null,null,null,null,null,null,null,null,null,null,null,null,null,null,null,77]
[null,null,null,null,null,null,null,null,null,null,null,null,null,null,null,null,null,null,null,null,null,null,null,null,78]
[null,null,null,null,null,null,null,null,null,null,null,null,null,null,null,null,null,null,null,null,null,null,null,null,79]
[null,null,null,null,null,null,null,null,null,null,null,null,null,null,null,null,null,null,null,null,null,null,null,null,80]
[null,null,null,null,null,null,null,null,null,null,null,null,null,null,null,null,null,null,null,null,null,null,null,null,81]
[null,null,null,null,null,null,null,null,null,null,null,null,null,null,null,null,null,null,null,null,null,null,null,null,82]
[null,null,null,null,null,null,null,null,null,null,null,null,null,null,null,null,null,null,null,null,null,null,null,null,83]
[null,null,null,null,null,null,null,null,null,null,null,null,null,null,null,null,null,null,null,null,null,null,null,null,84]
[null,null,null,null,null,null,null,null,null,null,null,null,null,null,null,null,null,null,null,null,null,null,null,null,85]
[null,null,null,null,null,null,null,null,null,null,null,null,null,null,null,null,null,null,null,null,null,null,null,null,86]
[null,null,null,null,null,null,null,null,null,null,null,null,null,null,null,null,null,null,null,null,null,null,null,null,87]
[null,null,null,null,null,null,null,null,null,null,null,null,null,null,null,null,null,null,null,null,null,null,null,null,88]
[null,null,null,null,null,null,null,null,null,null,null,null,null,null,null,null,null,null,null,null,null,null,null,null,89]
[null,null,null,null,null,null,null,null,null,null,null,null,null,null,null,null,null,null,null,null,null,null,null,null,90]
[null,null,null,null,null,null,null,null,null,null,null,null,null,null,null,null,null,null,null,null,null,null,null,null,91]
[null,null,null,null,null,null,null,null,null,null,null,null,null,null,null,null,null,null,null,null,null,null,null,null,92]
[null,null,null,null,null,null,null,null,null,null,null,null,null,null,null,null,null,null,null,null,null,null,null,null,93]
[null,null,null,null,null,null,null,null,null,null,null,null,null,null,null,null,null,null,null,null,null,null,null,null,94]
[null,null,null,null,null,null,null,null,null,null,null,null,null,null,null,null,null,null,null,null,null,null,null,null,95]
[null,null,null,null,null,null,null,null,null,null,null,null,null,null,null,null,null,null,null,null,null,null,null,null,96]
[null,null,null,null,null,null,null,null,null,null,null,null,null,null,null,null,null,null,null,null,null,null,null,null,97]
[null,null,null,null,null,null,null,null,null,null,null,null,null,null,null,null,null,null,null,null,null,null,null,null,98]
[null,null,null,null,null,null,null,null,null,null,null,null,null,null,null,null,null,null,null,null,null,null,null,null,101]
[null,null,null,null,null,null,null,null,null,null,null,null,null,null,null,null,null,null,null,null,null,null,null,null,102]
[null,null,null,null,null,null,null,null,null,null,null,null,null,null,null,null,null,null,null,null,null,null,null,null,103]
[null,null,null,null,null,null,null,null,null,null,null,null,null,null,null,null,null,null,null,null,null,null,null,null,104]
[null,null,null,null,null,null,null,null,null,null,null,null,null,null,null,null,null,null,null,null,null,null,null,null,106]
[null,null,null,null,null,null,null,null,null,null,null,null,null,null,null,null,null,null,null,null,null,null,null,null,107]
[null,null,null,null,null,null,null,null,null,null,null,null,null,null,null,null,null,null,null,null,null,null,null,null,108]
[null,null,null,null,null,null,null,null,null,null,null,null,null,null,null,null,null,null,null,null,null,null,null,null,109]
[null,null,null,null,null,null,null,null,null,null,null,null,null,null,null,null,null,null,null,null,null,null,null,null,110]
[null,null,null,null,null,null,null,null,null,null,null,null,null,null,null,null,null,null,null,null,null,null,null,null,111]
[null,null,null,null,null,null,null,null,null,null,null,null,null,null,null,null,null,null,null,null,null,null,null,null,112]
[null,null,null,null,null,null,null,null,null,null,null,null,null,null,null,null,null,null,null,null,null,null,null,null,113]
[null,null,null,null,null,null,null,null,null,null,null,null,null,null,null,null,null,null,null,null,null,null,null,null,114]
[null,null,null,null,null,null,null,null,null,null,null,null,null,null,null,null,null,null,null,null,null,null,null,null,115]
[null,null,null,null,null,null,null,null,null,null,null,null,null,null,null,null,null,null,null,null,null,null,null,null,116]
[null,null,null,null,null,null,null,null,null,null,null,null,null,null,null,null,null,null,null,null,null,null,null,null,117]
[null,null,null,null,null,null,null,null,null,null,null,null,null,null,null,null,null,null,null,null,null,null,null,null,118]
[null,null,null,null,null,null,null,null,null,null,null,null,null,null,null,null,null,null,null,null,null,null,null,null,119]
[null,null,null,null,null,null,null,null,null,null,null,null,null,null,null,null,null,null,null,null,null,null,null,null,120]
[null,null,null,null,null,null,null,null,null,null,null,null,null,null,null,null,null,null,null,null,null,null,null,null,121]
[null,null,null,null,null,null,null,null,null,null,null,null,null,null,null,null,null,null,null,null,null,null,null,null,122]
[null,null,null,null,null,null,null,null,null,null,null,null,null,null,null,null,null,null,null,null,null,null,null,null,123]
[null,null,null,null,null,null,null,null,null,null,null,null,null,null,null,null,null,null,null,null,null,null,null,null,124]
[null,null,null,null,null,null,null,null,null,null,null,null,null,null,null,null,null,null,null,null,null,null,null,null,126]
[null,null,null,null,null,null,null,null,null,null,null,null,null,null,null,null,null,null,null,null,null,null,null,null,127]
[null,null,null,null,null,null,null,null,null,null,null,null,null,null,null,null,null,null,null,null,null,null,null,null,128]
[null,null,null,null,null,null,null,null,null,null,null,null,null,null,null,null,null,null,null,null,null,null,null,null,130]
[null,null,null,null,null,null,null,null,null,null,null,null,null,null,null,null,null,null,null,null,null,null,null,null,131]
[null,null,null,null,null,null,null,null,null,null,null,null,null,null,null,null,null,null,null,null,null,null,null,null,132]
[null,null,null,null,null,null,null,null,null,null,null,null,null,null,null,null,null,null,null,null,null,null,null,null,134]
[null,null,null,null,null,null,null,null,null,null,null,null,null,null,null,null,null,null,null,null,null,null,null,null,135]
[null,null,null,null,null,null,null,null,null,null,null,null,null,null,null,null,null,null,null,null,null,null,null,null,136]
[null,null,null,null,null,null,null,null,null,null,null,null,null,null,null,null,null,null,null,null,null,null,null,null,137]
[null,null,null,null,null,null,null,null,null,null,null,null,null,null,null,null,null,null,null,null,null,null,null,null,138]
[null,null,null,null,null,null,null,null,null,null,null,null,null,null,null,null,null,null,null,null,null,null,null,null,139]
[null,null,null,null,null,null,null,null,null,null,null,null,null,null,null,null,null,null,null,null,null,null,null,null,140]
[null,null,null,null,null,null,null,null,null,null,null,null,null,null,null,null,null,null,null,null,null,null,null,null,142]
[null,null,null,null,null,null,null,null,null,null,null,null,null,null,null,null,null,null,null,null,null,null,null,null,143]
[null,null,null,null,null,null,null,null,null,null,null,null,null,null,null,null,null,null,null,null,null,null,null,null,144]
[null,null,null,null,null,null,null,null,null,null,null,null,null,null,null,null,null,null,null,null,null,null,null,null,202]
[null,null,null,null,null,null,null,null,null,null,null,null,null,null,null,null,null,null,null,null,null,null,null,null,207]
[null,null,null,null,null,null,null,null,null,null,null,null,null,null,null,null,null,null,null,null,null,null,null,null,218]
[null,null,null,null,null,null,null,null,null,null,null,null,null,null,null,null,null,null,null,null,null,null,null,null,219]
[null,null,null,null,null,null,null,null,null,null,null,null,null,null,null,null,null,null,null,null,null,null,null,null,871]
[null,null,null,null,null,null,null,null,null,null,null,null,null,null,null,null,null,null,null,null,null,null,null,null,917]

{"sheet":"Sheet2","index":7,"n_rows":2,"n_cols":5,"rows_kept":2,"cut":false,"hidden":true,"merged":[]}
["EL Subgrant",null,"Title II, Part A, Transferability",null,"Yes"]
["IY Subgrant",null,"Title IV, Part A, Transferability",null,"No"]