{"text_format":"1","workbook":"xlsx","n_sheets":18,"sheets":["Narrative & Detail Budget","Budget Summary","Transferability","GEPA","Program Requirements","35% and Above Low-Income","Below 35% Low-Income","Private School","School Improvement","Skipped School Provision","Neglected","Homeless","Early Childhood","General Assurances","Program Specific Assurances","Sheet1","DIVISION SCHOOLS","Prefills"],"not_rendered":{"charts":0,"images":68,"macros":1,"external_links":13,"defined_names":842,"comments":3,"pivot_tables":0},"unopened":[],"bounds":{"document_bytes":16777216,"sheet_cells":100000,"rows_first":2000,"rows_last":500,"rows_between":2000,"halvings":0,"cell_chars":16384,"cell_head_chars":4096},"cells_cut":0,"cells_raw":0,"read":"whole","date_system":"1900"}

{"sheet":"Narrative & Detail Budget","index":0,"n_rows":489,"n_cols":20,"rows_kept":489,"cut":false,"hidden":false,"merged":[[95,3,95,15],[96,3,96,15],[97,3,97,15],[98,3,98,15],[107,0,107,15],[135,0,135,15],[121,0,121,15],[113,0,113,15],[112,0,112,15],[116,0,116,15],[117,0,117,15],[118,0,118,15],[115,0,115,15],[120,0,120,15],[130,0,130,15],[133,0,133,15],[134,0,134,15],[125,0,125,15],[126,0,126,15],[127,2,127,15],[128,2,128,15],[101,0,101,15],[100,0,100,15],[102,0,102,15],[140,1,140,15],[152,0,152,15],[154,0,154,15],[143,0,143,15],[145,0,145,15],[186,0,186,15],[175,0,175,15],[110,0,110,15],[139,0,139,15],[141,1,141,15],[146,0,146,15],[149,0,149,15],[151,0,151,15],[144,0,144,15],[147,0,147,15],[150,0,150,15],[162,0,162,15],[165,0,165,15],[157,0,157,15],[148,0,148,15],[142,0,142,15],[123,0,123,15],[122,0,122,15],[176,0,176,15],[245,13,245,15],[246,13,246,15],[247,13,247,15],[248,13,248,15],[249,13,249,15],[225,13,225,15],[226,13,226,15],[227,13,227,15],[228,13,228,15],[229,13,229,15],[230,13,230,15],[231,13,231,15],[232,13,232,15],[233,13,233,15],[234,13,234,15],[235,13,235,15],[236,13,236,15],[237,13,237,15],[238,13,238,15],[239,13,239,15],[240,13,240,15],[70,7,71,15],[46,4,46,12],[46,13,46,15],[55,0,55,4],[55,6,55,12],[55,13,55,15],[57,0,57,4],[57,6,57,12],[57,13,57,15],[52,0,52,15],[54,0,54,4],[1,2,1,11],[2,2,2,11],[3,2,3,11],[4,2,4,11],[6,2,6,11],[7,2,7,11],[8,2,8,11],[9,2,9,11],[22,0,22,15],[19,0,19,15],[14,0,14,6],[14,9,14,15],[12,0,12,15],[13,9,13,15],[13,0,13,6],[15,0,15,6],[15,7,15,8],[103,0,103,15],[105,0,105,15],[106,0,106,15],[108,0,108,15],[109,0,109,15],[111,0,111,15],[119,0,119,15],[20,0,20,15],[21,0,21,15],[58,0,58,4],[58,6,58,12],[58,13,58,15],[94,1,94,15],[85,7,86,15],[88,7,89,15],[99,0,99,15],[90,0,90,15],[92,0,92,15],[76,7,77,15],[79,7,80,15],[82,7,83,15],[54,6,54,12],[54,13,54,15],[67,7,68,15],[45,4,45,12],[45,13,45,15],[49,0,49,15],[51,0,51,15],[73,7,74,15],[132,0,132,15],[129,0,129,15],[0,12,0,15],[1,13,1,14],[3,13,3,14],[5,14,5,15],[7,13,7,14],[61,0,61,15],[63,0,63,15],[64,7,65,15],[15,9,15,11],[15,13,15,15],[16,0,17,6],[16,7,16,15],[17,7,17,15],[18,9,18,15],[9,14,9,15],[10,2,10,11],[11,2,11,11],[248,0,248,7],[248,8,248,11],[209,0,209,15],[210,0,210,15],[206,0,206,15],[208,0,208,15],[156,0,156,15],[166,0,166,15],[168,0,168,15],[172,0,172,15],[174,0,174,15],[178,0,178,15],[181,0,181,15],[184,0,184,15],[202,0,202,15],[195,0,195,15],[200,0,200,15],[170,0,170,15],[180,0,180,15],[182,0,182,15],[173,0,173,15],[242,13,242,15],[243,13,243,15],[244,13,244,15],[179,0,179,15],[167,0,167,15],[232,0,232,7],[232,8,232,11],[212,0,212,15],[214,0,214,15],[196,0,196,15],[198,0,198,15],[203,0,203,15],[201,0,201,15],[230,0,230,7],[230,8,230,11],[231,0,231,7],[231,8,231,11],[23,17,27,19],[24,0,24,15],[25,1,25,3],[44,0,44,1],[44,13,44,15],[44,4,44,12],[42,0,42,1],[43,0,43,1],[43,2,43,3],[43,13,43,15],[42,2,42,3],[42,13,42,15],[42,4,42,12],[43,4,43,12],[27,0,27,5],[27,7,27,14],[29,0,29,5],[29,7,29,14],[31,0,31,5],[36,0,36,15],[31,7,31,14],[34,0,34,15],[136,0,136,15],[138,0,138,15],[131,0,131,15],[258,13,258,15],[259,13,259,15],[256,13,256,15],[257,13,257,15],[255,0,255,15],[250,0,250,15],[252,0,252,15],[253,0,253,15],[249,0,249,4],[254,0,254,15],[243,0,243,7],[243,8,243,11],[244,0,244,7],[244,8,244,11],[245,0,245,7],[245,8,245,11],[246,0,246,7],[246,8,246,11],[247,0,247,7],[247,8,247,11],[205,0,205,15],[265,13,265,15],[266,13,266,15],[260,13,260,15],[261,13,261,15],[264,13,264,15],[262,13,262,15],[263,13,263,15],[267,13,267,15],[263,0,263,9],[263,10,263,12],[264,0,264,9],[264,10,264,12],[265,0,265,9],[265,10,265,12],[266,0,266,9],[266,10,266,12],[267,0,267,9],[267,10,267,12],[271,10,271,12],[272,0,272,9],[272,10,272,12],[273,0,273,9],[273,10,273,12],[280,13,280,15],[281,13,281,15],[282,13,282,15],[277,13,277,15],[278,13,278,15],[279,13,279,15],[279,0,279,9],[279,10,279,12],[280,0,280,9],[280,10,280,12],[281,0,281,9],[281,10,281,12],[271,0,271,9],[278,0,278,9],[278,10,278,12],[282,0,282,9],[290,0,290,15],[293,13,293,15],[294,0,294,9],[294,10,294,12],[285,0,285,9],[285,10,285,12],[305,0,305,9],[305,10,305,12],[293,0,293,9],[293,10,293,12],[300,0,300,9],[300,10,300,12],[301,0,301,9],[301,10,301,12],[302,0,302,9],[301,13,301,15],[286,13,286,15],[304,13,304,15],[321,10,321,12],[324,0,324,15],[325,0,325,15],[312,0,312,9],[313,0,313,9],[306,13,306,15],[307,13,307,15],[308,13,308,15],[306,0,306,9],[306,10,306,12],[307,0,307,9],[307,10,307,12],[308,0,308,9],[308,10,308,12],[309,0,309,9],[309,10,309,12],[310,0,310,9],[310,10,310,12],[311,0,311,9],[311,10,311,12],[312,13,312,15],[313,13,313,15],[314,13,314,15],[312,10,312,12],[317,13,317,15],[317,0,317,9],[317,10,317,12],[318,0,318,9],[318,10,318,12],[319,0,319,9],[319,10,319,12],[320,0,320,9],[320,10,320,12],[318,13,318,15],[319,13,319,15],[320,13,320,15],[332,10,332,12],[333,0,333,9],[333,10,333,12],[334,0,334,9],[334,10,334,12],[335,0,335,9],[335,10,335,12],[330,0,330,9],[326,0,326,15],[327,0,327,15],[328,0,328,9],[328,10,328,12],[329,0,329,9],[329,10,329,12],[330,13,330,15],[330,10,330,12],[331,13,331,15],[332,13,332,15],[333,13,333,15],[334,13,334,15],[335,13,335,15],[328,13,328,15],[329,13,329,15],[336,13,336,15],[337,13,337,15],[338,13,338,15],[339,13,339,15],[358,0,358,15],[359,0,359,15],[360,0,360,15],[352,13,352,15],[353,13,353,15],[352,0,352,9],[352,10,352,12],[353,0,353,9],[353,10,353,12],[354,0,354,9],[354,10,354,12],[337,0,337,9],[337,10,337,12],[338,0,338,9],[338,10,338,12],[339,0,339,9],[339,10,339,12],[347,13,347,15],[341,0,341,9],[341,10,341,12],[375,13,375,15],[366,13,366,15],[365,13,365,15],[370,13,370,15],[371,13,371,15],[372,13,372,15],[362,0,362,9],[362,10,362,12],[378,10,378,12],[368,13,368,15],[369,13,369,15],[369,0,369,9],[369,10,369,12],[364,13,364,15],[367,13,367,15],[412,11,412,12],[412,13,412,15],[413,11,413,12],[413,13,413,15],[410,11,410,12],[410,13,410,15],[411,11,411,12],[411,13,411,15],[410,0,410,7],[410,8,410,10],[411,0,411,7],[411,8,411,10],[412,0,412,7],[412,8,412,10],[413,0,413,7],[413,8,413,10],[420,11,420,12],[420,13,420,15],[421,11,421,12],[421,13,421,15],[418,11,418,12],[418,13,418,15],[419,11,419,12],[419,13,419,15],[418,0,418,7],[418,8,418,10],[419,0,419,7],[419,8,419,10],[420,0,420,7],[420,8,420,10],[421,0,421,7],[421,8,421,10],[417,11,417,12],[417,13,417,15],[414,11,414,12],[414,13,414,15],[415,11,415,12],[415,13,415,15],[414,0,414,7],[414,8,414,10],[415,0,415,7],[415,8,415,10],[416,0,416,7],[416,8,416,10],[417,0,417,7],[417,8,417,10],[416,11,416,12],[416,13,416,15],[422,0,422,7],[422,8,422,10],[423,0,423,7],[423,8,423,10],[424,0,424,7],[424,8,424,10],[430,0,430,15],[431,0,431,15],[432,9,432,10],[450,11,450,12],[450,13,450,15],[433,9,433,10],[432,6,432,8],[433,6,433,8],[432,0,432,5],[433,0,433,5],[428,0,428,15],[429,0,429,15],[434,0,434,5],[434,6,434,8],[435,0,435,5],[435,6,435,8],[436,0,436,5],[436,6,436,8],[432,11,432,12],[432,13,432,15],[433,11,433,12],[433,13,433,15],[434,11,434,12],[434,13,434,15],[435,13,435,15],[436,11,436,12],[436,13,436,15],[445,9,445,10],[445,11,445,12],[445,13,445,15],[446,9,446,10],[446,11,446,12],[446,13,446,15],[443,9,443,10],[443,11,443,12],[443,13,443,15],[444,9,444,10],[444,11,444,12],[444,13,444,15],[481,0,481,15],[482,1,482,15],[484,0,484,15],[465,0,465,15],[451,9,451,10],[447,9,447,10],[448,0,448,5],[448,6,448,8],[449,0,449,5],[449,6,449,8],[450,0,450,5],[450,6,450,8],[447,11,447,12],[447,13,447,15],[448,9,448,10],[448,11,448,12],[448,13,448,15],[454,0,454,5],[454,6,454,8],[455,0,455,5],[455,6,455,8],[451,0,451,5],[451,6,451,8],[449,9,449,10],[453,0,453,5],[453,6,453,8],[453,13,453,15],[454,9,454,10],[454,11,454,12],[454,13,454,15],[455,9,455,10],[483,1,483,15],[485,1,485,15],[459,13,459,15],[459,10,459,12],[463,0,463,15],[457,9,457,10],[457,11,457,12],[457,13,457,15],[458,9,458,10],[458,11,458,12],[458,13,458,15],[457,0,457,5],[457,6,457,8],[458,0,458,5],[458,6,458,8],[479,1,479,15],[480,1,480,15],[452,11,452,12],[452,13,452,15],[158,0,158,15],[160,0,160,15],[161,0,161,15],[164,0,164,15],[215,0,215,15],[218,0,218,15],[221,0,221,15],[222,8,222,11],[223,8,223,11],[222,0,222,7],[223,0,223,7],[219,0,219,15],[220,0,220,15],[222,13,222,15],[223,13,223,15],[207,0,207,15],[204,0,204,15],[452,0,452,5],[452,6,452,8],[449,11,449,12],[449,13,449,15],[450,9,450,10],[159,0,159,15],[305,13,305,15],[295,13,295,15],[296,13,296,15],[297,13,297,15],[298,13,298,15],[299,13,299,15],[300,13,300,15],[188,0,188,15],[194,0,194,15],[224,0,224,7],[224,8,224,11],[224,13,224,15],[283,10,283,12],[284,0,284,9],[284,10,284,12],[283,13,283,15],[284,13,284,15],[274,13,274,15],[275,13,275,15],[276,13,276,15],[272,13,272,15],[273,13,273,15],[271,13,271,15],[315,13,315,15],[316,13,316,15],[311,13,311,15],[316,0,316,9],[316,10,316,12],[315,0,315,9],[315,10,315,12],[268,0,268,9],[268,10,268,12],[274,0,274,9],[274,10,274,12],[275,0,275,9],[275,10,275,12],[276,0,276,9],[276,10,276,12],[277,0,277,9],[277,10,277,12],[313,10,313,12],[314,0,314,9],[314,10,314,12],[285,13,285,15],[286,10,286,12],[287,0,287,15],[289,0,289,15],[400,13,400,15],[370,0,370,9],[370,10,370,12],[373,0,373,9],[373,10,373,12],[374,0,374,9],[374,10,374,12],[375,0,375,9],[375,10,375,12],[376,0,376,9],[376,10,376,12],[371,0,371,9],[371,10,371,12],[372,0,372,9],[372,10,372,12],[377,0,377,9],[377,10,377,12],[378,0,378,9],[390,0,390,9],[390,10,390,12],[379,13,379,15],[380,13,380,15],[381,13,381,15],[383,0,383,9],[392,0,392,15],[346,0,346,9],[346,10,346,12],[347,0,347,9],[347,10,347,12],[348,0,348,9],[348,10,348,12],[344,0,344,9],[344,10,344,12],[379,0,379,9],[379,10,379,12],[380,0,380,9],[380,10,380,12],[381,0,381,9],[381,10,381,12],[388,13,388,15],[389,13,389,15],[362,13,362,15],[363,13,363,15],[376,13,376,15],[377,13,377,15],[378,13,378,15],[373,13,373,15],[374,13,374,15],[401,11,401,12],[401,13,401,15],[402,11,402,12],[402,13,402,15],[391,13,391,15],[391,10,391,12],[394,0,394,15],[395,0,395,15],[406,11,406,12],[406,13,406,15],[401,8,401,10],[396,0,396,15],[403,11,403,12],[403,13,403,15],[404,11,404,12],[404,13,404,15],[405,11,405,12],[405,13,405,15],[398,13,398,15],[397,0,397,15],[398,11,398,12],[399,11,399,12],[399,13,399,15],[400,11,400,12],[407,13,407,15],[437,9,437,10],[437,11,437,12],[437,13,437,15],[438,9,438,10],[438,11,438,12],[438,13,438,15],[437,0,437,5],[437,6,437,8],[438,0,438,5],[438,6,438,8],[426,0,426,15],[434,9,434,10],[435,9,435,10],[435,11,435,12],[436,9,436,10],[424,11,424,12],[424,13,424,15],[425,13,425,15],[422,11,422,12],[422,13,422,15],[423,11,423,12],[423,13,423,15],[425,10,425,12],[486,1,486,15],[461,0,461,15],[439,9,439,10],[439,11,439,12],[439,13,439,15],[440,9,440,10],[440,11,440,12],[440,13,440,15],[439,0,439,5],[439,6,439,8],[440,0,440,5],[440,6,440,8],[441,9,441,10],[441,11,441,12],[441,13,441,15],[442,9,442,10],[442,11,442,12],[442,13,442,15],[441,0,441,5],[444,0,444,5],[444,6,444,8],[445,0,445,5],[445,6,445,8],[446,0,446,5],[446,6,446,8],[447,0,447,5],[447,6,447,8],[478,0,478,15],[467,0,467,15],[468,0,468,15],[470,1,470,15],[472,1,472,15],[473,0,473,15],[474,1,474,15],[475,1,475,15],[477,1,477,15],[455,11,455,12],[455,13,455,15],[456,9,456,10],[456,11,456,12],[456,13,456,15],[453,9,453,10],[453,11,453,12],[456,0,456,5],[456,6,456,8],[451,11,451,12],[451,13,451,15],[452,9,452,10],[309,13,309,15],[310,13,310,15],[443,0,443,5],[443,6,443,8],[441,6,441,8],[442,0,442,5],[442,6,442,8],[408,11,408,12],[408,13,408,15],[409,11,409,12],[409,13,409,15],[407,0,407,7],[407,8,407,10],[408,0,408,7],[408,8,408,10],[409,0,409,7],[409,8,409,10],[407,11,407,12],[356,0,356,15],[331,0,331,9],[331,10,331,12],[332,0,332,9],[336,0,336,9],[336,10,336,12],[488,0,488,15],[249,9,249,11],[256,10,256,12],[257,10,257,12],[256,0,256,9],[257,0,257,9],[258,0,258,9],[258,10,258,12],[259,0,259,9],[259,10,259,12],[260,0,260,9],[260,10,260,12],[261,0,261,9],[261,10,261,12],[262,0,262,9],[262,10,262,12],[268,13,268,15],[303,0,303,9],[303,10,303,12],[304,0,304,9],[304,10,304,12],[303,13,303,15],[270,13,270,15],[321,13,321,15],[233,0,233,7],[233,8,233,11],[234,0,234,7],[234,8,234,11],[241,13,241,15],[225,0,225,7],[225,8,225,11],[226,0,226,7],[226,8,226,11],[227,0,227,7],[227,8,227,11],[228,0,228,7],[228,8,228,11],[229,0,229,7],[229,8,229,11],[241,0,241,7],[241,8,241,11],[242,0,242,7],[242,8,242,11],[302,10,302,12],[295,0,295,9],[295,10,295,12],[296,0,296,9],[296,10,296,12],[297,0,297,9],[297,10,297,12],[298,0,298,9],[298,10,298,12],[299,0,299,9],[299,10,299,12],[291,0,291,15],[292,0,292,15],[294,13,294,15],[302,13,302,15],[269,13,269,15],[269,0,269,9],[269,10,269,12],[270,0,270,9],[270,10,270,12],[282,10,282,12],[283,0,283,9],[342,0,342,9],[342,10,342,12],[343,0,343,9],[342,13,342,15],[340,13,340,15],[341,13,341,15],[348,13,348,15],[344,13,344,15],[345,13,345,15],[345,0,345,9],[345,10,345,12],[355,13,355,15],[355,10,355,12],[354,13,354,15],[349,13,349,15],[350,13,350,15],[351,13,351,15],[349,0,349,9],[349,10,349,12],[346,13,346,15],[350,0,350,9],[350,10,350,12],[351,0,351,9],[351,10,351,12],[385,10,385,12],[386,0,386,9],[386,10,386,12],[387,0,387,9],[387,10,387,12],[388,0,388,9],[388,10,388,12],[340,0,340,9],[340,10,340,12],[343,10,343,12],[363,0,363,9],[363,10,363,12],[366,0,366,9],[366,10,366,12],[367,0,367,9],[367,10,367,12],[368,0,368,9],[368,10,368,12],[364,0,364,9],[364,10,364,12],[365,0,365,9],[365,10,365,12],[361,0,361,15],[343,13,343,15],[398,8,398,10],[399,8,399,10],[398,0,398,7],[399,0,399,7],[400,0,400,7],[400,8,400,10],[402,0,402,7],[193,0,193,15],[199,0,199,15],[390,13,390,15],[385,13,385,15],[386,13,386,15],[387,13,387,15],[385,0,385,9],[382,13,382,15],[383,13,383,15],[384,13,384,15],[382,0,382,9],[382,10,382,12],[389,0,389,9],[389,10,389,12],[383,10,383,12],[384,0,384,9],[384,10,384,12],[402,8,402,10],[403,0,403,7],[403,8,403,10],[404,0,404,7],[404,8,404,10],[405,0,405,7],[405,8,405,10],[406,0,406,7],[406,8,406,10],[322,0,322,15],[59,0,59,15],[38,0,38,15],[191,0,191,15],[185,0,185,15],[177,0,177,15],[171,0,171,15],[163,0,163,15],[189,0,189,15],[192,0,192,15],[187,0,187,15],[190,0,190,15],[235,0,235,7],[235,8,235,11],[236,0,236,7],[236,8,236,11],[237,0,237,7],[237,8,237,11],[238,0,238,7],[238,8,238,11],[239,0,239,7],[239,8,239,11],[240,0,240,7],[240,8,240,11]]}
[null,null,null,null,null,null,null,null,null,null,null,null,"Place an \"X\" by the applicable response."]
[null,null,"Virginia Department of Education",null,null,null,null,null,null,null,null,null,"X"," Original "]
[null,null,"Office of ESEA Programs"]
[null,null,"P. O. Box 2120",null,null,null,null,null,null,null,null,null,null,"Revision:   "]
[null,null,"Richmond, Virginia 23218-2120",null,null,null,null,null,null,null,null,null,null,"Revision #"]
[null,null,null,null,null,null,null,null,null,null,null,null,null,"Date:"]
[null,null,"         A.  COVER PAGE",null,null,null,null,null,null,null,null,null,null,"Explain"]
[null,null,"  Title I, Part A, Improving Basic Programs",null,null,null,null,null,null,null,null,null,null,"Amendment:"]
[null,null,"2020-2021  Individual Program Application",null,null,null,null,null,null,null,null,null,null,"Amendment # "]
[null,null,"Due by July 1, 2020",null,null,null,null,null,null,null,null,null,null,"Date:       "]
[null,null,"Elementary and Secondary Education Act of 1965 (ESEA), as amended by",null,null,null,null,null,null,null,null,null,null,"Explain"]
[null,null,"the Every Student Succeeds Act of 2015 (ESSA), Public Law 114-95 "]
["To be Completed by School Division"]
["Applicant  (Legal Name of Agency):",null,null,null,null,null,null,"Division Number:",null,"Title I, Part A, Coordinator:"]
["ALBEMARLE COUNTY PUBLIC SCHOOLS",null,null,null,null,null,null,null,{"$f":"IF(ISBLANK(A15),\" \",VLOOKUP(A15,Prefills!A2:B147,2))","v":2},"Catrina Sims"]
["Mailing Address (Street, City or Town, Zip Code):",null,null,null,null,null,null,"Phone:",null,"434-296-5820",null,null,"Ext:"]
["401 McIntire Road\nCharlottesville, VA 22902",null,null,null,null,null,null,"Email:"]
[null,null,null,null,null,null,null,"csims2@k12albemarle.org"]
[]
["LOCAL EDUCATIONAL AGENCY CERTIFICATION"]
["Use of Funds:  The applicant designated above applies for an allocation of federal assistance as appropriated under ESEA.  Funds are available to support local education reform efforts that are consistent with statewide education reform efforts to: 1) provide funding to implement promising education reform programs and school improvement programs based on evidence-based research;  2) provide a continuing source of innovative and educational improvement;  3) meet the educational needs of all students; and 4) develop and implement education programs to improve student achievement and teacher performance. \n\nSpecific uses of funds for this application are found in the \"Guidelines, Instructions, and Assurances\" document. "]
[]
["Assurances:  The local educational agency assures that Title I, Part A, will be administered and implemented in compliance with all applicable statutes, regulations, policies, and program plans under ESEA.  Additionally, the local educational agency agrees by signing below to implement the general and program specific assurances included in the application. The assurances and signed cover page are to be retained at the division level and, for the Title I, Part A, application (individual or consolidated form), a scanned PDF of the signed cover page must be emailed to ESSA@doe.virginia.gov.  "]
[null,null,null,null,null,null,null,null,null,null,null,null,null,null,null,null,null,"Title I, Part A, Only\nFor the sheet to print you must have activated either the 35 percent and Above Low-Income or the Below 35 percent Low-Income button."]
["Certification:  We hereby certify that, to the best of our knowledge, the information contained in this application is correct.  The agency named above has authorized us as its representatives to file this application, and such action is recorded in the minutes of the School Board meeting held"]
["on","2020-05-28",null,null,"."]
[]
[null,null,null,null,null,null,null,"     "]
["Superintendent’s Signature",null,null,null,null,null,null,"Board Chairperson’s Signature"]
["Matthew S. Haas",null,null,null,null,null,null,"Jonno Alcaro"]
["Superintendent’s Name",null,null,null,null,null,null,"Board Chairperson’s Name"]
["2020-06-11",null,null,null,null,null,null,"2020-06-11"]
["Date",null,null,null,null,null,null,"Date"]
[]
["Application Submission, Approval, and LEA Expenditure of Funds: Applications for Federal Funds are due by July 1, 2020.  Revisions and Amendments should be submitted in a timely manner.  Please note, in order for the funds to be expendable by July 1, 2020, the electronic application must be received at the Virginia Department of Education by July 1, 2020, through the file submission process of the Online Management of Education Grant Awards (OMEGA) system.  "]
[]
[]
[]
["Page 1"]
[null,null,null,null,"School Division:",null,{"$f":"$A$15","v":"ALBEMARLE COUNTY PUBLIC SCHOOLS"},null,null,null,null,null,"Division Number:",null,null,{"$f":"$I$15","v":2}]
[" APPLICATION INFORMATION"]
[]
["2019-2020 Allocation",null,"2019-2020 \nConsolidated\nYes or No",null,"ELIGIBLE PROGRAM",null,null,null,null,null,null,null,null,"2020-2021 Allocation Total"]
[{"$f":"IF(ISBLANK($A$15),\" \",VLOOKUP($P$40,Prefills!$Z$3:$AC$142,4))","v":1494988.23},null,"No",null,"Title I, Part A, Improving Basic Programs Operated by the LEAs",null,null,null,null,null,null,null,null,1494988]
[null,null,null,null,"Title II, Part A Transferability",null,null,null,null,null,null,null,null,{"$f":"N56","v":0},null,null,null,null,"Yes","No"]
[null,null,null,null,"Title IV, Part A Transferability",null,null,null,null,null,null,null,null,{"$f":"N59","v":0}]
[null,null,null,null,"Total Allocation",null,null,null,null,null,null,null,null,{"$f":"SUM(N44:P46)","v":1494988}]
[]
[]
["TRANSFERABILITY"]
[]
["Section 5103(b)(2) of the Every Student Succeeds Act allows LEAs to transfer funds between certain qualifying federal programs. If funds are transferred out of the Title II, Part A, or Title IV, Part A programs, PRIOR APPROVAL IS REQUIRED, and a separate Transferability approval form must be submitted. "]
["Transfer Request Form"]
[]
["Program from which funds will be transferred",null,null,null,null,null,"Program TO which funds will be transferred:",null,null,null,null,null,null,"Amount"]
["Title II, Part A",null,null,null,null,"TO","Title I, Part A, Improving Basic Programs Operated by the LEAs"]
[]
["Program from which funds will be transferred",null,null,null,null,null,"Program TO which funds will be transferred:",null,null,null,null,null,null,"Amount"]
["Title IV, Part A",null,null,null,null,"TO","Title I, Part A, Improving Basic Programs Operated by the LEAs"]
["Page 2"]
[null,null,null,null,"School Division:",null,{"$f":"$A$15","v":"ALBEMARLE COUNTY PUBLIC SCHOOLS"},null,null,null,null,null,"Division Number:",null,null,{"$f":"$I$15","v":2}]
["REVISIONS AND AMENDMENTS"]
[]
["Place an \"X\" in the first box indicating whether it is a revision or amendment. Enter the date of the revision or amendment.  Indicate the tab(s) that have been changed. Provide a concise description of changes (for example, \"Programmatic Changes--purchase of additional reading materials, object code 6000; Budget Changes--decreased travel budget in object code 5000 and increased materials to purchase additional reading materials in object code 6000\"). When completing an amendment, changes to the program overview may be reflected as additions at the end of the narrative.\n\nNOTE: Any changes to the program budget should first be reflected in an amended application, followed by a budget transfer within 7 business days of approval of the amended application. Budget transfers will not be accepted without an approved amended application reflecting budget changes."]
["1.","Revision",null,null,null,"Date:"]
[null,"Amendment",null,null,null,"Date:"]
[]
["2.","Revision",null,null,null,"Date:"]
[null,"Amendment",null,null,null,"Date:"]
[]
["3.","Revision",null,null,null,"Date:"]
[null,"Amendment",null,null,null,"Date:"]
[]
["4.","Revision",null,null,null,"Date:"]
[null,"Amendment",null,null,null,"Date:"]
[]
["5.","Revision",null,null,null,"Date:"]
[null,"Amendment",null,null,null,"Date:"]
[]
["6.","Revision",null,null,null,"Date:"]
[null,"Amendment",null,null,null,"Date:"]
[]
["7.","Revision",null,null,null,"Date:"]
[null,"Amendment",null,null,null,"Date:"]
[]
["8.","Revision",null,null,null,"Date:"]
[null,"Amendment",null,null,null,"Date:"]
[]
["9.","Revision",null,null,null,"Date:"]
[null,"Amendment",null,null,null,"Date:"]
["Page 3"]
[null,null,null,null,"School Division:",null,{"$f":"$A$15","v":"ALBEMARLE COUNTY PUBLIC SCHOOLS"},null,null,null,null,null,"Division Number:",null,null,{"$f":"$I$15","v":2}]
["B.  PROGRAM OVERVIEW (3 PAGES)"]
["In narrative format:"]
[null,"Describe how the local educational agency will monitor students' progress in meeting the challenging State academic standards by:"]
[null,null,"a. ","developing and implementing a well-rounded program of instruction to meet the academic needs of all students;"]
[null,null,"b. ","identifying students who may be at risk for academic failure;"]
[null,null,"c.","providing additional educational assistance to individual students the local educational agency or school determines need help in meeting the challenging State academic standards; and"]
[null,null,"d.","identifying and implementing instructional and other strategies intended to strengthen academic programs and improve school conditions for student learning."]
["1. Describe the division's instructional program as supported by the federal grant.  Explain how the instructional program or program of services supplements, not supplants, the core instructional program or services offered by the LEA to all students and/or all schools.  For Title I, Part A, include delivery model (targeted assistance and/or schoolwide), subject(s) addressed, grade span(s), etc."]
["Albemarle County Public Schools (ACPS) is a growing school division now serving 14,307 students at fifteen elementary schools, six middle schools, and four high schools. Our strategic student-centered mission remains that all students will graduate having actively mastered the lifelong learning competencies they will need to succeed as 21st century learners, workers, and citizens.\n\nIn order to meet this goal and ensure schools reach their accreditation targets, ACPS focuses Title I funds on literacy and mathematics in the six elementary schools and two preschool programs we serve through the targeted assistance model. School eligibility for Title I services is determined by the schools that have a free and reduced lunch percentage that is above the County average of 32.6%. The Low-Income Factor Above 35% formula has been used to determine school allocations for the 2020-21 school year. In order to provide support and leadership to teachers and administrators at identified schools, Title I monies fund positions to ensure compliance, as well as administrative and technical support to both teachers and principals in all identified schools."]
[" During school year 2020-21, our FTE levels will remain generally consistent among the Title I schools compared with last year, in order to meet student needs throughout grades K-5. We have large numbers of students who are academically challenged in reading and/or mathematics, as measured by specific assessments detailed in the application.  With the increases in numbers of at-risk students, as well as gradual increases in Title I schools' free and reduced lunch percentages in recent years, sustaining increases in staffing remains the primary goal for Title I services and funding.\n\nOur Title I preschool programs are located at Agnor-Hurt and Red Hill Elementary Schools. Each program serves up to 18 at-risk four year olds from the local community. Students who score the lowest on the locally-developed assessment and accompanying parent survey are invited to attend.  \n\n\n"]
[" The ACPS Title I team re-examines the philosophical foundation and materials used for Title I instruction annually. Accelerated student achievement is a result of the intersection of lifelong learner standards and state-established standards in reading and math. In addition, ACPS offers ongoing professional development for teachers in best practices for implementation of curriculum, assessment, and instruction in literacy, mathematics, and family engagement. Title I teachers meet regularly as an Intervention PLC to network, reflect on current practices, share new findings, and continue on a trajectory for professional, continuous growth. All ACPS Title I teachers are fully licensed; 70% have their Master's degrees, one has a doctorate degree, and just under 50% have Reading Specialist degrees, based on data for the 2019-20 school year.  \n\nAs has been typical in years past, Title I schools plan to offer a Summer Kindergarten Jumpstart Program for rising Kindergarten students, to provide a headstart on Kindergarten and build an early relationship with families.  \n\n"]
["Page 4"]
[null,null,null,null,"School Division:",null,{"$f":"$A$15","v":"ALBEMARLE COUNTY PUBLIC SCHOOLS"},null,null,null,null,null,"Division Number:",null,null,{"$f":"$I$15","v":2}]
["B.  PROGRAM OVERVIEW (CONTINUED)"]
["2. Provide information about the needs assessment process, including a brief analysis of student achievement data and other data sources reviewed.  "]
["ELEMENTARY K-5: The typical  process for determining eligibility for Title I begins in the spring for all grade levels. In May of each year, school-based Title I teams, in collaboration with classroom and other intervention/resource teachers and building administrators, identify students in need of intervention in order to get ready for the next school year. These teams of teachers carefully consider the literacy and math profiles for each student and make recommendations for those in need of additional support outside of Tier 1: differentiating among those students that should continue reading and/or math intervention, new students who should receive interventions, those who should be released and placed on ‘monitor’ status, and, ultimately, to ensure that planned interventions match student needs. Title I teams track this information electronically in order to streamline the process and ease communication across Title/Intervention teams, classroom teachers, and the building level administrators. In August, the new teams of teachers cross-check the Eligibility Lists that were based on the Spring Needs Assessment, add in new students and delete those who have moved, and determine the neediest students who will receive Title I services as soon as parent permission letters are received. By starting this process in the spring, Title I teachers are able to begin Title I services in the first weeks of school. \nIn light of COVID-19, we revised our process for determining eligibility slightly. Title I teams met with all Tier I teachers to make recommendations for those students who would benefit from having additional support outside of the regular classroom based on assessments "]
["given in January. Teachers  used January data as it was the most comprehensive information they had with the early school closure. "]
["3. Describe the evidence-based activities that will be implemented for each subject addressed, and how these activities address deficiencies noted in the needs assessment.   "]
[" READING: Title I reading instruction supplements the ACPS English Language Arts Curriculum Framework and is above and beyond the 90 minute daily reading block. The County curriculum offers students a balanced diet of phonemic awareness, phonics, fluency, comprehension, vocabulary, writing and word study. Title I instruction is targeted to one or more of these areas based on student needs as demonstrated by their literacy profile. (Details for the needs assessment process is outlined above). Title I teachers deliver instruction in small groups or individually as determined by student needs in push-in and/or pull-out models.\nMATH: Spatial-Temporal Math (ST Math) and Do the Math are remedial programs used in Title I instruction of students below grade level in math.  ST Math is subscription-based and employs students’ spatial and temporal reasoning abilities to explain, understand, and solve multi-step math problems. Lessons are presented visually so language skills do not present a barrier to learning math.  Do The Math was developed by Marilyn Burns and helps students develop the skills they need to compute with accuracy and efficiency, the number sense they need to reason, and the ability to apply their skills and reasoning to solve problems. Title I math instruction is an enhancement to the ACPS Mathematics Curriculum Framework which emphasizes a daily balance of conceptual understanding, computational fluency, and problem-solving experiences."]
[]
[]
["Page 5"]
[null,null,null,null,"School Division:",null,{"$f":"$A$15","v":"ALBEMARLE COUNTY PUBLIC SCHOOLS"},null,null,null,null,null,"Division Number:",null,null,{"$f":"$I$15","v":2}]
["B.  PROGRAM OVERVIEW (CONTINUED)"]
["4. For Title I, Part A, explain how the division ensures that meaningful parent and family engagement activities are planned and implemented at each Title I school.   "]
[" The Title I Office provides coordination, technical assistance, and other support to assist Title I schools in planning and implementing effective parental involvement activities that improve student academic achievement and school performance. An agenda item at every Title I teacher meeting is sharing ways to engage parents in their child’s education. Each school annually updates their parental involvement plan with input from Title I families. The Title I Coordinator assists with the review of written plans and attendance at events as needed. Albemarle County’s Title I Parent Advisory is built upon the relationships established at fall school events. In addition, the Title I Coordinator connects with a variety of other departments, including Community Engagement and ESOL, in order to provide the best possible experiences for our families.  While the Division shares best practices and ideas with school teachers and administrators, attendance demonstrates that school-based programs are the most meaningful to families.  The six Title I schools hold carefully planned Family Reading/Literacy evening events each semester, with the Fall program designed to acquaint and involve parents with the Title I mission, program design and goals, as well as supportive practices at home. An academic content theme is typically part of the event design.  The Spring programs follow a similar approach but with a view toward helping parents focus on summer literacy and continued academic support at home, based on use of engaging family activities. Take-home books are included with both Fall and Spring Family events. Take-home reading books and guides for interactive approaches for parents are also planned for use in stemming the loss of reading interest and skills during school breaks,"]
["both in summer and due to COVID-19 closures."]
["C.  COORDINATION OF SERVICES "]
["Describe the partnerships within the division among the programs in this application and other federal, state, and/or local programs in the delivery of services to the targeted population(s).  Describe the collaboration of program staff, parents, and the community to provide services and activities that will contribute to the attainment of the measurable objectives in this application."]
["To optimize the division's  instructional program for teachers, parents, and students in preschool through grade five, a monthly meeting of federal program leadership is held and includes coordinators of  Title I, Parts A and Part C, Title II, Title III, Adult ESOL and Homeless.  Title I and Title III, along with Community Engagement and Adult ESOL, collaborate as follows: the ESOL coordinator helps oversee the student selection process at Title I schools through conversation with ESOL teachers.  The Office of Student Learning staff share methods to increase parent involvement; impact family literacy; help families support instruction in the home; provide interpretive services to increase parent participation at school events; and arrange transportation for families from identified communities to school events. Adult ESOL provides Family Literacy classes for Title I ESOL students and their families.  Tutors for identified Homeless children and partial salary for the ACPS Homeless Liaison are funded through this grant. \n\nAlbemarle County hosts four preschool programs [Bright Stars, Title I, MACAA’s Head Start, and Early Childhood Special Education (ECSE)] which cooperate to serve the needs of students, families and teachers. This “Albemarle County Preschool Network” collaborates to support joint professional development for teachers, parent training and workshops at individual schools, and enrichment activities that support success for all at-risk children. The Preschool Leadership Team meets monthly to coordinate and plan for program needs, public awareness and continuous quality improvements."]
["Preschool program community support has come from local restaurants, a Dental Grant from Sentara Martha Jefferson Hospital to provide dental services, local churches providing food and clothing for students' families, local toy drives that makes available holiday gifts, and a grant from the Charlottesville Area Community Foundation used to provide parenting classes."]
["Page 6"]
[null,null,null,null,"School Division:",null,{"$f":"$A$15","v":"ALBEMARLE COUNTY PUBLIC SCHOOLS"},null,null,null,null,null,"Division Number:",null,null,{"$f":"$I$15","v":2}]
["D.  EFFECTIVE TRANSITIONS"]
["Describe how the local educational agency will implement strategies to facilitate effective transitions for students from middle grades to high school and from high school to postsecondary education including, if applicable-"]
[null,"a. ","through coordination with institutions of higher education, employers, and other local partners; and"]
[null,"b. ","through increased student access to early college high school or dual or concurrent enrollment opportunities, or career counseling to identify student interests and skills."]
["Albemarle School Division provides opportunities and builds programmatic structures that facilitate these transitions.  Our four high schools host visitation events in both the spring and summer for rising 9th grade students. These are designed to help new students understand academic choices and to increase comfort with the higher demands of high school. Registration \"fairs\" are also held, at which time students visit booths featuring high school academy representatives, academic departments, special programs such as AVID (rigorous college prep program), and extracurricular clubs and sports.\n\nEntering high school students in Albemarle are assigned a teacher mentor, who provides guidance for the student until graduation. Freshman Seminars afford an advisory period focused on relationship building and meeting the social-emotional and career development needs of students. High schools offer internships in the community, CTE classes that include credentialing, and numerous college fairs and counselor fairs designed to give students ample opportunity to learn about career choices and postsecondary school choices and programs. High school Career Connection Centers are another source of information and guidance for students.  And, dual enrollment at PVCC (Piedmont Virginia Community College) is another available opportunity for academic advancement for students."]
[]
[]
["E.  REDUCTION OF EXCLUSIONARY DISCIPLINE PRACTICES"]
["Describe how the local educational agency will support efforts to reduce the overuse of discipline practices that remove students from the classroom, which may include identifying and supporting schools with high rates of discipline, disaggregated by each of the subgroups of students, as defined in section 1111(c)(2)."]
["Albemarle County Schools uses multiple approaches that support efforts to reduce the overuse of practices that remove students from classrooms when discipline issues occur.  All schools in the division use Responsive Classroom methods, and teachers receive professional development in this intervention program. The new Social, Emotional, & Academic Development (SEAD) program in our urban ring schools is charged with removing barriers correlated to social or cultural factors that may disrupt learning. SEAD team members are designated to provide another layer of support when discipline and/or attendance interventions are needed.  \nSchools implemented the Short-Term Education Program (STEP). The STEP, cuts down on out-of-school suspension by keeping kids in school, with specialized emotional and academic support.This program decreases disproportionate suspension of minority students, as well as decreasing overall out of school suspension rates. Division level approval is required before suspension of any primary grade student may occur.  Within middle and high schools, the STEP program is used in place of out-of-school suspension, where appropriate, by allowing students to receive instruction within the STEP program setting. \nOn an annual basis, district level staff review school-based discipline practices and statistics, with the goal of reducing punitive measures.\n"]
[]
["Page 7"]
[null,null,null,null,"School Division:",null,{"$f":"$A$15","v":"ALBEMARLE COUNTY PUBLIC SCHOOLS"},null,null,null,null,null,"Division Number:",null,null,{"$f":"$I$15","v":2}]
["F.  MEASURABLE OBJECTIVES "]
["What is a Measurable Objective?\n A measurable objective has four components:\na) Subject (Who is the target or focus?);\nb) Behavior (What will be changed/improved?);\nc) Specific criteria for assessing improvement, readiness, or achievement, and tools to be used to measure effectiveness; and\nd) Time period for performance or assessment. \n\n                                                                                                                                                                                                                                               "]
["1.","State up to ten measurable objectives that will guide the development of the program to be funded with the requested ESEA federal funds. "]
["2.","Describe the evidence-based research that supports the services and activities (programs, models, instructional methods, and techniques) that will be implemented to achieve each objective and that will be supported by the requested funds. \n"]
["Measurable Objective 1:"]
["Measurable Objective 1: By the end of the 2020-2021 school year, 85% of Title I students in K-1 will pass the Spring PALS assessment.  The Spring passing score for Kindergarten is 83 and for grade 1 is 35. The assessment will be administered three times over the course of the school year to monitor growth.\n"]
[]
["Evidence-based research services and activities that will be implemented and supported by the requested funds to achieve the objective:"]
["Evidence-based research services...:\nProfessional development to improve literacy instruction for Title I students will be offered to their classroom teachers in partnership with their Title I teachers. Targeted areas for professional development will be based on the ACPS Literacy Profile and Literacy Assessment Guidelines.\nIn coordination with the Response to Intervention (RTI) model, teachers will receive professional development in administering and interpreting progress monitoring tools. This assessment information will inform teachers of student growth and equip them to make necessary adjustments to instruction.\nTeacher teams will develop Personalized Learning Plans (PLPs) for identified students on the Title I Eligibility Lists. These PLPs will include targets for growth based on the ACPS Literacy Profile, and will be shared with parents quarterly.\nProfessional Learning Communities (PLCs) will provide the structure for grade level conversations for improving student achievement.  Conversations and action plans will be individualized for each Title I student, and will be based on data in the ACPS Literacy Profile.\n\n"]
[]
["Measurable Objective 2:"]
["Measurable Objective 2: By the end of the 2020-2021 school year, 90% of Title I students in grades 2-5 will show more than a year’s growth according to fluency benchmarks -- advancing at least one grade level on the Word Recognition in Isolation (WRI) task. This assessment will be administered three times over the course of the school year to monitor for growth.\n "]
[]
["Evidence-based research services and activities that will be implemented and supported by the requested funds to achieve the objective:"]
["Evidence-based research services ...\nProfessional development to improve literacy instruction for Title I students will be offered to their classroom teachers in partnership with their Title I teachers. Targeted areas for professional development will be based on the ACPS Literacy Profile and Literacy Assessment Guidelines.\nIn coordination with the Response to Intervention (RTI) model, teachers will receive professional development in administering and interpreting progress monitoring tools. This assessment information will inform teachers of student growth and equip them to make necessary adjustments to instruction.\nTeacher teams will develop Personalized Learning Plans (PLPs) for identified students on the Title I Eligibility Lists. These PLPs will include targets for growth based on the ACPS Literacy Profile, and will be shared with parents quarterly.\nProfessional Learning Communities (PLCs) will provide the structure for grade level conversations for improving student achievement.  Conversations and action plans will be individualized for each Title I student, and will be based on data in the ACPS Literacy Profile."]
[]
["Page 8"]
[null,null,null,null,"School Division:",null,{"$f":"$A$15","v":"ALBEMARLE COUNTY PUBLIC SCHOOLS"},null,null,null,null,null,"Division Number:",null,null,{"$f":"$I$15","v":2}]
["F.  MEASURABLE OBJECTIVES (CONTINUED)"]
["Measurable Objective 3:"]
["Measurable Objective 3: By the end of the 2020-2021 school year, all Title I schools will meet accreditation requirements in the “All” category and in the related subgroups in grades 3, 4 and 5 as verified by the 2021 Reading SOLs.\n\n"]
[]
["Evidence-based research services and activities that will be implemented and supported by the requested funds to achieve the objective:"]
["Evidence-based research services...:\nProfessional development to improve literacy instruction for Title I students will be offered to their classroom teachers in partnership with their Title I teachers. Targeted areas for professional development will be based on the ACPS Literacy Profile and Literacy Assessment Guidelines.\nIn coordination with the Response to Intervention (RTI) model, teachers will receive professional development in administering and interpreting progress monitoring tools. This assessment information will inform teachers of student growth and equip them to make necessary adjustments to instruction.\nTeacher teams will develop Personalized Learning Plans (PLPs) for students on the Title I Eligibility Lists. These PLPs will include targets for growth based on the ACPS Literacy Profile, and will be shared with parents quarterly.\nProfessional Learning Communities (PLCs) will provide the structure for grade level conversations for improving student achievement.  Conversations and action plans will be individualized for each Title I student, and will be based on data in the ACPS Literacy Profile."]
[]
["Measurable Objective 4:"]
["Measurable Objective 4: By the end of the 2020-2021 school year, Title I students in Kindergarten through grade 5 will meet 65% of the levels of proficiency as defined by ST Math.   \n"]
[]
["Evidence-based research services and activities that will be implemented and supported by the requested funds to achieve the objective:"]
["Evidence-based research services ...:\nResearch indicates that achieving this goal through the use of the self-paced program supports students in reaching over-all math proficiency. In order to best empower teachers to utilize the program with students, professional development will be provided for all teachers implementing ST Math at the eight Title I schools.\nInstructional coaches help connect teachers across schools. This collaboration and sharing encourages best practices for implementing ST Math. These formal and informal connections among coaches and teachers are supplemented by midyear (and per-request) visits from the ST Math consultant, and year-round support of the ACPS Math Coordinator upon request.\nProfessional Learning Communities (PLCs) will provide the structure for teachers to review and analyze student ST Math reports, adjusting for student needs throughout the year.  ST Math reports by student, school and district are provided by ST Math on a monthly basis to be reviewed by the PLC groups, principals and division-level support. \n"]
["Page 9"]
[null,null,null,null,"School Division:",null,{"$f":"$A$15","v":"ALBEMARLE COUNTY PUBLIC SCHOOLS"},null,null,null,null,null,"Division Number:",null,null,{"$f":"$I$15","v":2}]
["F.  MEASURABLE OBJECTIVES (CONTINUED)"]
["Measurable Objective 5:"]
["Measurable Objective 5: By the end of the 2020-2021 school year, all Title I schools will meet accreditation requirements in the “All” category and in the related subgroups in grades 3, 4 and 5 as verified by the 2021 Math SOLs."]
[]
["Evidence-based research services and activities that will be implemented and supported by the requested funds to achieve the objective:"]
[" Evidence-based research services...:\nProfessional development to improve math instruction for Title I students will be offered to teachers in Title I schools. Targeted areas for professional development will be based on the ACPS Mathematics Profile, notably through the introduction of the Do the Math program.\nIn coordination with the Response to Intervention (RTI) model, teachers will receive professional development in administering and interpreting progress monitoring tools. This assessment information will inform teachers of student growth and equip them to make necessary adjustments to instruction.\nProfessional Learning Communities (PLCs) will provide the structure for grade level conversations for improving student achievement.  Conversations and action plans will be individualized for each Title I student, and will be based on data in the ACPS Mathematics Profile."]
[]
["Measurable Objective 6:"]
["Measurable Objective 6: By the end of the 2020-21 school year, 100% of the students in the Title I Preschool programs at Red Hill and Agnor-Hurt Elementary Schools will score within the PALS-identified developmental ranges for the 8 preschool tasks [Name Writing, Upper-Case Alphabet Recognition, Letter Sounds, Beginning Sound Awareness, Print and Word Awareness, Rhyme Awareness, and Nursery Rhyme Awareness]."]
[]
["Evidence-based research services and activities that will be implemented and supported by the requested funds to achieve the objective:"]
["Evidence-based research services...:\nTitle I Preschool teachers will continue professional development with other teachers in the Albemarle County Preschool Network, working towards common curriculum, instruction, and assessment practices that align with the ACPS Framework for Quality Learning.\nThe ACPS Preschool Curriculum HighScope vertically aligns with the ACPS English Language Arts Curriculum Framework and the ACPS Mathematics Curriculum Framework to streamline instruction between preschool and the elementary grades.\nFamilies of children selected for the Title I Preschool classrooms commit to attending regular meetings with the teacher and participating in school-based opportunities that promote supporting their child’s success in school and life.\nIn coordination with the Response to Intervention (RTI) model, teachers will receive professional development in administering and interpreting progress monitoring tools. This assessment information will inform teachers of student growth and equip them to make necessary adjustments to instruction."]
["Page 10"]
[null,null,null,null,"School Division:",null,{"$f":"$A$15","v":"ALBEMARLE COUNTY PUBLIC SCHOOLS"},null,null,null,null,null,"Division Number:",null,null,{"$f":"$I$15","v":2}]
["F.  MEASURABLE OBJECTIVES (CONTINUED)"]
["Measurable Objective 7:"]
["By the end of the 2020-2021 school year, 50% of Title I students' families at the six Title I schools will have participated in at least one Title I parent engagement activity as measured by attendance sheets. "]
[]
["Evidence-based research services and activities that will be implemented and supported by the requested funds to achieve the objective:"]
[" Title I Parent Nights are held in the Fall and Spring and provide an opportunity for teachers to engage with parents through a variety of approaches.  These include literacy activities, family-style meals, presentations on Title I programming and curriculum and performance standards, take-home books and interactive learning activities. In some instances, school bus transportation for families is provided to assist in getting them to schools for these programs."]
[]
["Measurable Objective 8:"]
[]
[]
["Evidence-based research services and activities that will be implemented and supported by the requested funds to achieve the objective:"]
[]
["Page 11"]
[null,null,null,null,"School Division:",null,{"$f":"$A$15","v":"ALBEMARLE COUNTY PUBLIC SCHOOLS"},null,null,null,null,null,"Division Number:",null,null,{"$f":"$I$15","v":2}]
["F.  MEASURABLE OBJECTIVES (CONTINUED)"]
["Measurable Objective 9:"]
[]
[]
["Evidence-based research services and activities that will be implemented and supported by the requested funds to achieve the objective:"]
["       "]
[]
["Measurable Objective 10:"]
[]
[]
["Evidence-based research services and activities that will be implemented and supported by the requested funds to achieve the objective:"]
["       "]
["Page 12"]
[null,null,null,null,"School Division:",null,{"$f":"$A$15","v":"ALBEMARLE COUNTY PUBLIC SCHOOLS"},null,null,null,null,null,"Division Number:",null,null,{"$f":"$I$15","v":2}]
["G. DETAIL BUDGET BREAKDOWN"]
[]
["Prepare a detailed breakdown of the budget categories for Object Codes 1000-6000 and 8000."]
["The amounts by program and object code totals are to be entered on the Budget Sheet under the appropriate area."]
["Do the totals equal the Budget Summary sheet? ",null,null,null,null,null,null,null,{"$f":"IF(SUM('Budget Summary'!G43)=SUM(N250,N287,N322,N356,N392,N426,N460),\"Yes\",\"No -please review your entries.\")","v":"Yes"}]
[]
["DETAILED BUDGET DESCRIPTION OF OBJECT CODE 1000"]
["Provide a description of the positions supported with funds from this program. Indicate if any positions are newly funded under this program.  Explain the supplementary nature of any new positions. Required if staff positions are to be funded by federal funds."]
["The majority of our Title I funding is allocated for Title I teachers at our six Title I schools. In addition, a Title I Coordinator provides administrative and technical support to both teachers and principals in all identified schools. She is also responsible for compliance as well as the oversight of the program. The Management Analyst submits the grant and monitors the amendment and reimbursement process in OMEGA. She manages the student enrollment in the local student information system and tracks the Needs Assessment process which identifies eligible students throughout the year. She also prepares and submits all required reports. "]
["The Homeless Liaison coordinates a systematic program to identify and serve all eligible Homeless students. She collaborates with the Title I staff, provides tutoring and counseling, and arranges transportation for students when needed. Homeless tutors provide services to identified Homeless students.  "]
["Types of Staff Positions\nAdministrative, Teacher, Paraprofessional, Reading Specialist, Parent and Family Engagement Liaison, Other",null,null,null,null,null,null,null,"Set Aside Category",null,null,null,"FTEs","Total Cost"]
["Coordinator",null,null,null,null,null,null,null,"Division",null,null,null,0.8,56895]
["Management Analyst",null,null,null,null,null,null,null,"Division",null,null,null,0.5,24196]
["Homeless Liaison",null,null,null,null,null,null,null,"Homeless",null,null,null,0.6,59017]
["Homeless Tutors",null,null,null,null,null,null,null,"Homeless",null,null,null,"NA",10000]
["Teachers (Agnor-Hurt) ( (Red Hill)",null,null,null,null,null,null,null,"Early Childhood",null,null,null,2,106464]
["Teaching Assistants (Agnor-Hurt) (Red Hill)",null,null,null,null,null,null,null,"Early Childhood",null,null,null,1.5,31209]
["Substitutes",null,null,null,null,null,null,null,"Early Childhood",null,null,null,"NA",850]
["Teachers",null,null,null,null,null,null,null,null,null,null,null,13.5,763305]
["Hourly Pay for Summer Jumpstart Teachers, Interpreters",null,null,null,null,null,null,null,null,null,null,null,"NA",10000]
["Tutors for Private School Students ($25 per hour)",null,null,null,null,null,null,null,"Private School",null,null,null,"NA",8476.33]
[]
[]
[]
[]
[]
[]
[]
[]
[]
[]
[]
[]
[]
[]
[]
[]
[null,null,null,null,"   ",null,null,null,null,"Total for Object Code:",null,null,{"$f":"SUM(M224:M249)","v":18.899999999999999},{"$f":"SUM(N224:P249)","v":1070412.33}]
["Page 13"]
[null,null,null,null,"School Division:",null,{"$f":"$A$15","v":"ALBEMARLE COUNTY PUBLIC SCHOOLS"},null,null,null,null,null,"Division Number:",null,null,{"$f":"$I$15","v":2}]
["DETAILED BUDGET DESCRIPTION OF OBJECT CODE 2000"]
["Indicate the fixed charge categories (such as FICA, health, etc.) and specify the amount of each."]
["Employee benefits are paid on behalf of most FTE positions and include FICA, VSRS, Group Life Insurance, Health Insurance, and Dental Insurance. \nPart-time life insurance and part-time annuity are paid on behalf of part-time employees. Only FICA is paid on hourly salaries, such as Homeless tutors and substitutes.  Per direction from VDOE, benefits have been totaled within the respective set-aside and non-set-aside programs."]
[]
["Item Description",null,null,null,null,null,null,null,null,null,"Set Aside Category",null,null,"Total Cost"]
["Benefits for 1.3 FTE Division Staff and Part-Time Staff Benefits",null,null,null,null,null,null,null,null,null,"Division",null,null,29938]
["Benefits for .6 FTE Coordinator and for Tutors",null,null,null,null,null,null,null,null,null,"Homeless",null,null,23280]
["Benefits for 3.5 FTE and Substitutes",null,null,null,null,null,null,null,null,null,"Early Childhood",null,null,66980]
["FICA for Private School Tutors",null,null,null,null,null,null,null,null,null,"Private School",null,null,648.44000000000005]
["Benefits for Teachers, Interpreters",null,null,null,null,null,null,null,null,null,null,null,null,268187.18]
[]
[]
[]
[]
[]
[]
[]
[]
[]
[]
[]
[]
[]
[]
[]
[]
[]
[]
[]
[]
[]
[]
[]
[]
[null,null,null,null,"      ",null,null,null,null,null,"Total for Object Code:",null,null,{"$f":"SUM(N258:P286)","v":389033.62}]
["Page 14"]
[null,null,null,null,"School Division:",null,{"$f":"$A$15","v":"ALBEMARLE COUNTY PUBLIC SCHOOLS"},null,null,null,null,null,"Division Number:",null,null,{"$f":"$I$15","v":2}]
["DETAILED BUDGET DESCRIPTION OF OBJECT CODE 3000 "]
["Please indicate how these funds will support any services and activities that are described in the application.  Services acquired from outside sources (i.e., private vendors, public authorities, or other governmental entities).  "]
["Parent Involvement: Meals and services provided by outside contractors and restaurants will be included for Title I students and their families during family engagement events, which may include family literacy nights, special programs, and family field trips.  Meals for division-level Parent Advisory Meetings will be provided. \nST Math student licenses and associated professional development will be provided for identified students at the six Title I schools."]
[]
["Item Description",null,null,null,null,null,null,null,null,null,"Set Aside Category",null,null,"Total Cost"]
["Family Engagement meals and contractor services",null,null,null,null,null,null,null,null,null,"PFE (School Level)",null,null,6800]
["Meals for Title I Parent Advisory Meetings",null,null,null,null,null,null,null,null,null,"PFE (Division)",null,null,200]
["ST Math Licenses and Professional Development",null,null,null,null,null,null,null,null,null,null,null,null,20000]
[]
[]
[]
[]
[]
[]
[]
[]
[]
[]
[]
[]
[]
[]
[]
[]
[]
[]
[]
[]
[]
[]
[]
[]
[null,null,null,null,"      ",null,null,null,null,null,"Total for Object Code:",null,null,{"$f":"SUM(N295:P321)","v":27000}]
["Page 15"]
[null,null,null,null,"School Division:",null,{"$f":"$A$15","v":"ALBEMARLE COUNTY PUBLIC SCHOOLS"},null,null,null,null,null,"Division Number:",null,null,{"$f":"$I$15","v":2}]
["DETAILED BUDGET DESCRIPTION OF OBJECT CODE 4000"]
["Provide a description of charges from an Internal Service Fund to other functions/activities/elements of the local government for the use of intergovernmental services.  "]
[]
[]
["Item Description",null,null,null,null,null,null,null,null,null,"Set Aside Category",null,null,"Total Cost"]
[]
[]
[]
[]
[]
[]
[]
[]
[]
[]
[]
[]
[]
[]
[]
[]
[]
[]
[]
[]
[]
[]
[]
[]
[]
[]
[null,null,null,null,"      ",null,null,null,null,null,"Total for Object Code:",null,null,{"$f":"SUM(N330:P355)","v":0}]
["Page 16"]
[null,null,null,null,"School Division:",null,{"$f":"$A$15","v":"ALBEMARLE COUNTY PUBLIC SCHOOLS"},null,null,null,null,null,"Division Number:",null,null,{"$f":"$I$15","v":2}]
["DETAILED BUDGET DESCRIPTION FOR OBJECT CODE 5000"]
["Includes expenditures that support the program, including utilities (maintenance and operation of plant), staff/administrative/consultant travel, office phone charges, training, leases/rental, indirect cost, and other."]
[]
[]
["Item Description",null,null,null,null,null,null,null,null,null,"Set Aside Category",null,null,"Total Cost"]
[]
[]
[]
[]
[]
[]
[]
[]
[]
[]
[]
[]
[]
[]
[]
[]
[]
[]
[]
[]
[]
[]
[]
[]
[]
[]
[]
[]
[null,null,null,null,"      ",null,null,null,null,null,"Total for Object Code:",null,null,{"$f":"SUM(N364:P391)","v":0}]
["Page 17"]
[null,null,null,null,"School Division:",null,{"$f":"$A$15","v":"ALBEMARLE COUNTY PUBLIC SCHOOLS"},null,null,null,null,null,"Division Number:",null,null,{"$f":"$I$15","v":2}]
["DETAILED BUDGET DESCRIPTION FOR OBJECT CODE 6000"]
["Provide a description for expenses related to object code 6000 Materials and Supplies.  Include items that are consumed or materially altered when used and minor equipment that is not capitalized. Equipment under $5,000, including computer equipment, should be reported under this object code unless the LEA has set a lower capitalization threshold.  Indicate the quantity for each item.  "]
[" Parental Involvement: ACPS Title I teachers and staff purchase books, project supplies, and literacy and math games, that empower families to support their children's academic progress at home.  Snacks and student-made foods are planned for familiy events. \n\nAdministrative supplies may include books or refreshments for Title I teachers as part of quarterly professional development meetings."]
[]
["Item Description",null,null,null,null,null,null,null,"Set Aside Category",null,null,"Quantity",null,"Total Cost"]
["Family Engagement Supplies and Materials: Books, snack and grocery items,",null,null,null,null,null,null,null,"PFE (School Level)",null,null,null,null,7949.88]
["materials for student and family projects"]
["Books, materials for Title I Staff PLC Meetings",null,null,null,null,null,null,null,"Division",null,null,null,null,500]
["Supplies for Family Engagement events, activities",null,null,null,null,null,null,null,"Private School",null,null,null,null,92.17]
[]
[]
[]
[]
[]
[]
[]
[]
[]
[]
[]
[]
[]
[]
[]
[]
[]
[]
[]
[]
[]
[]
[null,null,null,null,"      ",null,null,null,null,null,"Total for Object Code:",null,null,{"$f":"SUM(N400:P425)","v":8542.0500000000011}]
["Page 18"]
[null,null,null,null,"School Division:",null,{"$f":"$A$15","v":"ALBEMARLE COUNTY PUBLIC SCHOOLS"},null,null,null,null,null,"Division Number:",null,null,{"$f":"$I$15","v":2}]
["DETAILED BUDGET DESCRIPTION FOR OBJECT CODE 8000"]
["All capital outlay expenditures over $5,000 per unit must be approved in advance by the Virginia Department of Education. If the school division has established a threshold of a lesser amount, items equal to that amount or greater must also receive prior approval by the Virginia Department of Education.  Nonconsumable items must be listed in the application.  Equipment quantities must be specified. "]
[]
[]
["Item Description",null,null,null,null,null,"Set Aside Category",null,null,"Quantity",null,"Cost Per Item",null,"Total Cost"]
[]
[]
[]
[]
[]
[]
[]
[]
[]
[]
[]
[]
[]
[]
[]
[]
[]
[]
[]
[]
[]
[]
[]
[]
[]
[]
[null,null,null,null,"      ",null,null,null,null,null,"Total for Object Code:",null,null,{"$f":"SUM(N434:P459)","v":0}]
[]
["Page 19"]
[null,null,null,null,"School Division:",null,{"$f":"$A$15","v":"ALBEMARLE COUNTY PUBLIC SCHOOLS"},null,null,null,null,null,"Division Number:",null,null,{"$f":"$I$15","v":2}]
["EXPENDITURE ACCOUNTS DESCRIPTIONS"]
[]
["These accounts are for budgeting and recording expenditures of the educational agency for activities under its control.  Below are definitions of the major expenditure categories.  The descriptions provided are examples only.   For further clarification on the proper expenditures of funds, contact your school division budget or finance office, the grant specialist in the Virginia Department of Education, or refer to the appropriate federal act."]
[]
["OBJECT CODE DEFINITIONS:"]
["(revised 5/16/17)"]
[]
[1000,"PERSONAL SERVICES - Includes all compensation for the direct labor of persons in the employment of the local government.  Salaries and wages paid to employees for full‐ and part‐time work, including overtime, shift differential, and similar compensation. Includes payments for time not worked, including sick leave, vacation, holidays, jury duty, military leave, and other paid absences that are earned during the reporting period.  \n\nFor the purposes of this report, the term “salaries” means all compensation including base wage.  This also includes amounts paid through salary reduction plans, such as tax‐sheltered annuities and flexible benefit plans.  Do not confuse this definition with the Virginia Retirement System (VRS) definition, which excludes supplements for retirement calculation purposes in some circumstances.\n"]
[]
[2000,"EMPLOYEE BENEFITS - Job related benefits provided to employees as part of their total compensation.  Fringe benefits include the employer’s portion of FICA, pensions, insurance (life, health, disability income, etc.) and employee allowances.  \n\nNOTE:  Fringe Benefits are a significant component of employee compensation and, like salaries and wages, are charged to the appropriate object of expenditure within each program.  If possible, fringe benefit costs should be charged to the applicable educational program or activity on an ongoing basis.  An alternative is to charge all fringe benefits to various benefit accounts.  As part of the year‐end closing process, these accounts are closed, and all costs are allocated to the appropriate educational program or activity.  The following methods are suggested for allocating such cost at year‐end.  If these methods do not provide reasonable allocations based on circumstances within the school division, then the school division should use another reasonable allocation method.  Consistency in application should be maintained at all times.\n\n• Allocation by percentage of payroll dollars\n• Allocation by Head Count\n• Direct to Program or Activity\n"]
["Page 20"]
[3000,"PURCHASED/CONTRACTUAL SERVICES - Services acquired from outside sources (i.e., private vendors, public authorities, or other governmental entities).  Purchase of the service is on a fee basis or fixed time contract basis.  Payments for rentals and utilities are not included in this account description.  Allowable payments would be to individual or firms that are independent contractors and not employees of the grantee or sub‐grantee organization.  The word honorarium is sometimes used to characterize such payments; the term “fee” is preferred.\n\n• Food Purchases – Prepared meals, working meals, and/or catered services purchased through a vendor are included in this object code.  Reimbursement is capped at the per diem rate for the meal listed according to the state travel regulations.  Examples for this object code include meals provided during day‐long professional development sessions, or meals provided to support attendance at family engagement activities.  Food purchased from catering services and restaurants such as Pizza Hut, Panera Bread, and Subway is included in this object code.\n\n• Transportation Services Public Carriers – Payments to public carriers for transportation of pupils on vehicles that are used by the public. Include payments for pupils transported in intra‐city transit buses, taxicabs, airplanes, and intercity/interstate passenger buses.\n\n• Transportation Services Private Carriers – Payments (either cash or tokens) to parents for transportation of pupils in lieu of providing transportation on school buses. Include allowable payments to parents for pupils attending public, private, and non‐sectarian schools. Include costs associated with transporting special education students in school board‐owned vehicles to and from school.\n\n• Transportation Services by Contract – Payments to private owners of school buses who contract with the school board to transport pupils to and from public schools. Include payments to owners of private vehicles that contract with the school board to transport pupils to and from designated public and private schools.\n\n"]
[null,"• Purchase of Service from Other Governmental Entities – Payments for services purchased from other governmental entities (i.e., other local governments, public authorities, state agencies, and other LEAs) on a contract/fee basis. Tuition payments to other local governments for a jointly operated center are not included here but are reported under “Payments to Joint Operations” (object code 7000).\n\n• Tuition Paid – Other Divisions In‐State, Tuition Paid – Other Divisions Out‐of‐State, and Tuition Paid – Private Schools are included in this object code.\n"]
[]
[4000,"INTERNAL SERVICES - Charges from an Internal Service Fund to other functions/activities/elements of the local government for the use of intergovernmental services, such as data processing, automotive/motor pool, central purchasing/central stores, print shop, and risk management. These services are provided by internal services within the School District and possibly the county but not a vendor.  \n\n• Food Purchases – Food purchased from the food services department of a school division or subgrantee equivalent to support professional development or family engagement events is included in this object code.  For example, internal expenses for school cafeterias to provide meals to support attendance at family engagement activities are included in this object code.\n"]
["Page 21"]
[5000,"OTHER CHARGES - Include expenditures that support the use of programs. Includes expenditures that support the program, including utilities (maintenance and operation of plant), staff/administrative/consultant travel, office phone charges, training, leases/rental, indirect cost, and other.\n\n• Food Purchases – Food Purchases under this object code are restricted to food purchases related to travel reimbursement for meals only (see Travel below). If the sub‐recipient’s internal travel policies conform to state travel regulations, reimbursement is allowable at per diem meals rates according to state travel regulations. If the sub‐recipient’s internal travel policies require reimbursement for the cost of each meal, reimbursement is capped at the per diem rate for the meal listed according to the state travel regulations. Sub‐recipients must elect either meals per diem or per meals costs as their internal travel policy.\n\n• Telecommunications – Include expenditures for recurring telecommunications services for the use of on‐line computer technology (e.g., telephone/telecommunications line charges).  Telephone charges for line service for Internet connectivity and the Electronic Classroom program.\n\n• Utilities – Payments for heat, electricity, water, and sewer services regardless of whether the service is provided by a private enterprise authority or an enterprise fund operated by a local government.\n\n• Communications – Payments for postal, messenger, and telecommunications services, typically office voice telephone charges.  (Telecommunication costs directly related to technology uses should be coded under 6000.) In addition, office telephone charges would be coded under this code.\n\n• Insurance – Payments for insurance except those that relate to personal services (i.e., hospitalization, group life, worker’s compensation, unemployment)\n\n• Leases and Rentals – Includes payments for leases that are not capitalized and rental of land, structures, and equipment. Do not include payments made under a lease‐purchase agreement.\n\n"]
[null,"• Travel – includes payments for travel reimbursement for staff/administrative/consultant travel. These are travel costs that are being reimbursed directly to travelers.  These costs may include lodging, mileage, meals, and incidentals as allowable according to state travel regulations or documented subrecipient internal travel policies. If the sub‐recipient does not have documented internal travel policies, state travel regulations will prevail.\n\n• Contributions to Other Entities – Includes payments to other governmental entities or community organizations that are not related to the direct purchase of a service on a fee basis (which is reported under object code 3000) or payments to joint operations (which are reflected under object code 7000).\n\n• Public Assistance Payments – Payments to individuals for public assistance programs (general government use only).\n\n• Miscellaneous Other Charges – Includes expenditures that support the program, including indirect costs and other costs.\n"]
["Page 22"]
[6000,"MATERIALS AND SUPPLIES - Includes articles and commodities that are consumed or materially altered when used and minor equipment that is not capitalized.  This includes any equipment purchased under $5,000, unless the LEA has set a lower capitalization threshold.  Therefore, computer equipment under $5,000 would be reported in “materials and supplies.”\n\n• Food Purchases – Food items purchased from a grocery store or its equivalent for snacks or breaks is included in this object code.  Examples include bottled water, granola bars, cookies, and fruit purchased from a store such as Wal‐Mart, Food Lion, Costco, etc.  Prepared meals is not included in this object code; see object code 3000 for prepared/working/catered meals as purchased/contracted services.\n\n• Vehicle and Powered Equipment Fuels – Gasoline, lubricating oils, or such other fuel used in the operation of vehicles and powered equipment (e.g., lawnmowers) purchased from private sources or governmental agencies.\n\n• Vehicle and Powered Equipment Supplies – Tires, spark plugs, batteries, and chains used in the operation of vehicles and powered equipment purchased from private sources or governmental agencies.\n\n• Textbooks – All textbooks and workbooks purchased to be used in the classroom.\n\n• Instructional Materials – Books (not textbooks) and other materials.\n\n"]
[null,"• Technology Software/On‐line Content – Include expenditures for videodiscs and computer programs used in the classroom for instructional purposes, operating system software (i.e., standalone software, not software that is pre‐installed and included in hardware costs), application software, and on‐line or downloadable software and content. Include expenditures for both additions and replacement.\n\n• Non‐Capitalized Technology Hardware – Include expenditures for hardware or classroom technology equipment that is not capitalized.\n\n• Non‐Capitalized Technology Infrastructure – Include expenditures for technology infrastructure that is not capitalized.\n"]
["Page 23"]
[8000,"CAPITAL OUTLAY - Note: Indirect cost cannot be claimed against capital outlay and equipment.\nOutlays that result in the acquisition of or additions to fixed assets.  Capital Outlay includes the purchase\nof fixed assets both replacement and/or additional.\n\nCapital Outlay Replacement\n\n• Technology – Hardware Replacements – Include capital outlay for replacement of hardware or classroom technology equipment. (For further clarification on which expenditures should be included in this object code, see the “Special Note” below.)\n\n• Technology – Infrastructure Replacements – Include capital outlay for replacement of technology infrastructure. (For further clarification on which expenditures should be included in this object code, see the “Special Note” below.)\n\n• Capital Outlay Additions – Include machinery, equipment, furniture, fixtures, communications equipment, motor vehicles, etc. that are capitalized.\n\n• Technology – Hardware Additions – Include capital outlay for additional hardware or classroom technology equipment. (For further clarification on which expenditures should be included in this object code, see the “Special Note” below.)  \n\n• Technology – Infrastructure Additions – Include capital outlay for additional technology infrastructure. (For further clarification on which expenditures should be included in this object code, see the “Special Note” below.)\n\n"]
[null,"• Special Note ‐ Classification of Hardware and Infrastructure Expenditures: \n\nReport expenditures under technology “hardware” for computers, associated peripheral equipment, and other specialized technology equipment. Computers include desktop and laptop machines, handheld computers (i.e., Personal Digital Assistants or PDAs), and mainframe machines. Peripheral equipment includes devices attached to computers, such as monitors, keyboards, disk drives, modems, printers, scanners, cameras and speakers, etc.\n\nReport other specialized computer devices under technology “hardware” such as fax‐back and voicemail resources; videoconferencing and other distance education tools, including satellite transmitters and receivers; cable‐based receivers; and modem or codec‐based video equipment; projection devices, from transparent and opaque projectors to video monitors; and graphing calculators and other specialized computational aids.\n\nReport expenditures under technology “infrastructure” for equipment and devices that enable the linking of computers or video hardware to networks (such as routers, hubs, switches, access servers, modems, or codecs). Infrastructure also refers to cabling installations, whether wire, fiber optic, or coaxial, as well as electrical capacity expansion or HVAC upgrades to support networks. In wireless networking systems, include receivers and transmitters under infrastructure.\n"]
[]
["Page 24"]

{"sheet":"Budget Summary","index":1,"n_rows":48,"n_cols":14,"rows_kept":48,"cut":false,"hidden":false,"merged":[[17,11,20,13],[21,11,21,13],[1,0,1,14],[7,0,11,0],[10,1,10,5],[15,1,15,5],[25,1,25,5],[12,0,16,0],[17,0,21,0],[16,1,16,5],[23,1,23,5],[20,1,20,5],[21,1,21,5],[4,1,6,5],[4,0,6,0],[4,6,6,10],[12,1,12,5],[13,1,13,5],[12,11,15,13],[4,11,6,13],[11,11,11,13],[16,11,16,13],[7,11,10,13],[7,6,7,10],[8,6,8,10],[10,6,10,10],[47,0,47,14],[3,0,3,14],[37,0,41,0],[32,0,36,0],[7,1,7,5],[8,1,8,5],[17,1,17,5],[27,0,31,0],[36,1,36,5],[27,1,27,5],[28,1,28,5],[33,1,33,5],[30,1,30,5],[45,1,45,5],[23,6,23,10],[25,6,25,10],[12,6,12,10],[13,6,13,10],[11,6,11,10],[9,6,9,10],[16,6,16,10],[41,11,41,13],[37,11,40,13],[32,11,35,13],[46,1,46,14],[42,1,42,5],[38,1,38,5],[21,6,21,10],[22,1,22,5],[45,6,45,10],[41,1,41,5],[42,6,42,10],[37,1,37,5],[40,1,40,5],[38,6,38,10],[44,1,44,5],[41,6,41,10],[44,6,44,10],[40,6,40,10],[37,6,37,10],[27,11,30,13],[22,11,25,13],[26,11,26,13],[31,11,31,13],[36,11,36,13],[34,1,34,5],[22,0,26,0],[28,6,28,10],[30,6,30,10],[31,6,31,10],[32,6,32,10],[24,1,24,5],[24,6,24,10],[29,1,29,5],[29,6,29,10],[26,6,26,10],[22,6,22,10],[31,1,31,5],[32,1,32,5],[26,1,26,5],[27,6,27,10],[34,6,34,10],[39,1,39,5],[39,6,39,10],[43,1,43,5],[43,6,43,10],[9,1,9,5],[14,1,14,5],[14,6,14,10],[19,1,19,5],[19,6,19,10],[18,1,18,5],[11,1,11,5],[36,6,36,10],[17,6,17,10],[18,6,18,10],[20,6,20,10],[35,1,35,5],[33,6,33,10],[35,6,35,10],[15,6,15,10]]}
[null,null,null,"School Division:",null,{"$f":"'Narrative & Detail Budget'!A15","v":"ALBEMARLE COUNTY PUBLIC SCHOOLS"},null,null,null,null,"Division Number:",null,null,{"$f":"'Narrative & Detail Budget'!I15","v":2}]
["H.   BUDGET SUMMARY "]
[]
["(Projected dollar amount of Title I, Part A, funds required for administration and implementation of this program.  Enter the budget in the unlocked cells.)"]
["OBJECT CODE","EXPENDITURE",null,null,null,null,"AMOUNT BUDGETED\nTitle I, Part A",null,null,null,null,"Does the Budget Summary Match \"Narrative & Detail Budget\" Tab?"]
[]
[]
["1000 -  Personal Services","Non Set-Aside",null,null,null,null,773305]
[null,"Set-Aside",null,null,null,null,288631]
[null,"Parent and Family Engagement Set-Aside"]
[null,"Private School Set-Aside",null,null,null,null,8476.33]
[null,"Total Personal Services",null,null,null,null,{"$f":"SUM(G8:K11)","v":1070412.33},null,null,null,null,{"$f":"IF(SUM('Narrative & Detail Budget'!N250)=SUM(G12),\"Yes\",\"No - Please review your entries.\")","v":"Yes"}]
["2000 - Employee Benefits","Non Set-Aside",null,null,null,null,268187.18]
[null,"Set-Aside",null,null,null,null,120198]
[null,"Parent and Family Engagement Set-Aside"]
[null,"Private School Set-Aside",null,null,null,null,648.44000000000005]
[null,"Total Employee Benefits",null,null,null,null,{"$f":"SUM(G13:K16)","v":389033.62},null,null,null,null,{"$f":"IF(SUM('Narrative & Detail Budget'!N287)=SUM(G17),\"Yes\",\"No - Please review your entries.\")","v":"Yes"}]
["3000 - Purchased/\nContracted Services","Non Set-Aside",null,null,null,null,20000]
[null,"Set-Aside"]
[null,"Parent and Family Engagement Set-Aside",null,null,null,null,7000]
[null,"Private School Set-Aside"]
[null,"Total Purchased/Contracted Services",null,null,null,null,{"$f":"SUM(G18:K21)","v":27000},null,null,null,null,{"$f":"IF(SUM('Narrative & Detail Budget'!N322)=SUM(G22),\"Yes\",\"No - Please review your entries.\")","v":"Yes"}]
["4000 - Internal Services","Non Set-Aside"]
[null,"Set-Aside"]
[null,"Parent and Family Engagement Set-Aside"]
[null,"Private School Set-Aside"]
[null,"Total Internal Services",null,null,null,null,{"$f":"SUM(G23:K26)","v":0},null,null,null,null,{"$f":"IF(SUM('Narrative & Detail Budget'!N356)=SUM(G27),\"Yes\",\"No - Please review your entries.\")","v":"Yes"}]
["5000 - Other Charges","Non Set-Aside"]
[null,"Set-Aside"]
[null,"Parent and Family Engagement Set-Aside"]
[null,"Private School Set-Aside"]
[null,"Total Other Charges",null,null,null,null,{"$f":"SUM(G28:K31)","v":0},null,null,null,null,{"$f":"IF(SUM('Narrative & Detail Budget'!N392)=SUM(G32),\"Yes\",\"No - Please review your entries.\")","v":"Yes"}]
["6000 - Materials and Supplies","Non Set-Aside"]
[null,"Set-Aside",null,null,null,null,500]
[null,"Parent and Family Engagement Set-Aside",null,null,null,null,7949.88]
[null,"Private School Set-Aside",null,null,null,null,92.17]
[null,"Total Materials and Supplies",null,null,null,null,{"$f":"SUM(G33:K36)","v":8542.0500000000011},null,null,null,null,{"$f":"IF(SUM('Narrative & Detail Budget'!N426)=SUM(G37),\"Yes\",\"No - Please review your entries.\")","v":"Yes"}]
["8000 - Capital Outlay","Non Set-Aside"]
[null,"Set-Aside"]
[null,"Parent and Family Engagement Set-Aside"]
[null,"Private School Set-Aside"]
[null,"Total Capital Outlay",null,null,null,null,{"$f":"SUM(G38:K41)","v":0},null,null,null,null,{"$f":"IF(SUM('Narrative & Detail Budget'!N460)=SUM(G42),\"Yes\",\"No - Please review your entries.\")","v":"Yes"}]
[null,"TOTAL BUDGET",null,null,null,null,{"$f":"SUM(G12+G17+G22+G27+G32+G37+G42)","v":1494988.0000000002}]
[null,"TOTAL PARENT AND FAMILY ENGAGEMENT SET-ASIDE",null,null,null,null,{"$f":"SUM(G10+G15+G20+G25+G30+G35+G40)","v":14949.880000000001}]
[null,"TOTAL PRIVATE SCHOOL SET-ASIDE",null,null,null,null,{"$f":"SUM(G11+G16+G21+G26+G31+G36+G41)","v":9216.94}]
[null,"Does the Total Budget Match the Allocation on the \"Narrative & Detail Budget\" Tab? ",null,null,null,null,{"$f":"IF(SUM(G43)=SUM('Narrative & Detail Budget'!N44),\"Yes\",\"No - please review your entries.\")","v":"Yes"}]
[]
["Page 25"]

{"sheet":"Transferability","index":2,"n_rows":330,"n_cols":16,"rows_kept":330,"cut":false,"hidden":false,"merged":[[84,6,84,8],[85,6,85,8],[86,6,86,8],[87,6,87,8],[88,6,88,8],[89,6,89,8],[90,6,90,8],[91,6,91,8],[92,6,92,8],[75,6,75,8],[76,6,76,8],[77,6,77,8],[78,6,78,8],[79,6,79,8],[80,6,80,8],[81,6,81,8],[82,6,82,8],[83,6,83,8],[48,0,48,2],[48,9,48,10],[78,0,78,5],[79,0,79,5],[80,0,80,5],[81,0,81,5],[82,0,82,5],[83,0,83,5],[84,0,84,5],[83,9,83,11],[84,9,84,11],[55,0,55,2],[58,0,58,2],[59,0,59,2],[59,9,59,10],[63,0,63,13],[65,0,65,13],[56,9,56,10],[58,9,58,10],[56,0,56,2],[54,0,54,2],[54,9,54,10],[73,6,73,8],[74,6,74,8],[320,0,320,4],[321,0,321,4],[320,8,320,10],[321,8,321,10],[322,8,322,10],[323,8,323,10],[320,5,320,7],[321,5,321,7],[322,0,322,4],[322,5,322,7],[323,0,323,4],[323,5,323,7],[319,0,319,4],[316,0,316,4],[317,0,317,4],[316,8,316,10],[317,8,317,10],[318,8,318,10],[319,8,319,10],[316,5,316,7],[317,5,317,7],[318,5,318,7],[319,5,319,7],[314,0,314,4],[315,0,315,4],[312,0,312,4],[313,0,313,4],[312,8,312,10],[313,8,313,10],[314,8,314,10],[315,8,315,10],[318,0,318,4],[314,5,314,7],[315,5,315,7],[312,5,312,7],[313,5,313,7],[306,0,306,4],[307,0,307,4],[304,0,304,4],[305,0,305,4],[310,0,310,4],[311,0,311,4],[308,0,308,4],[309,0,309,4],[308,8,308,10],[309,8,309,10],[310,8,310,10],[311,8,311,10],[305,5,305,7],[306,5,306,7],[307,5,307,7],[308,5,308,7],[309,5,309,7],[310,5,310,7],[311,5,311,7],[251,10,251,12],[252,10,252,12],[257,0,257,13],[258,0,258,13],[259,0,259,13],[253,10,253,12],[256,0,256,13],[251,0,251,6],[251,7,251,9],[252,0,252,6],[252,7,252,9],[248,10,248,12],[249,10,249,12],[250,10,250,12],[245,10,245,12],[246,10,246,12],[247,10,247,12],[245,0,245,6],[245,7,245,9],[246,0,246,6],[246,7,246,9],[247,0,247,6],[247,7,247,9],[248,0,248,6],[248,7,248,9],[249,0,249,6],[249,7,249,9],[250,0,250,6],[250,7,250,9],[242,10,242,12],[243,10,243,12],[244,10,244,12],[239,10,239,12],[240,10,240,12],[241,10,241,12],[239,0,239,6],[239,7,239,9],[240,0,240,6],[240,7,240,9],[241,0,241,6],[241,7,241,9],[242,0,242,6],[242,7,242,9],[243,0,243,6],[243,7,243,9],[244,0,244,6],[244,7,244,9],[236,10,236,12],[237,10,237,12],[238,10,238,12],[233,10,233,12],[234,10,234,12],[235,10,235,12],[233,0,233,6],[233,7,233,9],[234,0,234,6],[234,7,234,9],[235,0,235,6],[235,7,235,9],[236,0,236,6],[236,7,236,9],[237,0,237,6],[237,7,237,9],[238,0,238,6],[238,7,238,9],[230,10,230,12],[231,10,231,12],[232,10,232,12],[227,10,227,12],[228,10,228,12],[229,10,229,12],[227,0,227,6],[227,7,227,9],[228,0,228,6],[228,7,228,9],[229,0,229,6],[229,7,229,9],[230,0,230,6],[230,7,230,9],[231,0,231,6],[231,7,231,9],[232,0,232,6],[232,7,232,9],[224,10,224,12],[225,10,225,12],[226,10,226,12],[218,0,218,13],[221,10,221,12],[222,10,222,12],[223,10,223,12],[219,0,219,13],[220,0,220,13],[221,0,221,6],[221,7,221,9],[222,0,222,6],[222,7,222,9],[223,0,223,6],[223,7,223,9],[224,0,224,6],[224,7,224,9],[225,0,225,6],[225,7,225,9],[226,0,226,6],[226,7,226,9],[214,10,214,12],[217,0,217,13],[211,10,211,12],[212,10,212,12],[213,10,213,12],[208,10,208,12],[209,10,209,12],[210,10,210,12],[208,0,208,6],[208,7,208,9],[209,0,209,6],[209,7,209,9],[210,0,210,6],[210,7,210,9],[211,0,211,6],[211,7,211,9],[212,0,212,6],[212,7,212,9],[213,0,213,6],[213,7,213,9],[205,10,205,12],[206,10,206,12],[207,10,207,12],[202,10,202,12],[203,10,203,12],[204,10,204,12],[202,0,202,6],[202,7,202,9],[203,0,203,6],[203,7,203,9],[204,0,204,6],[204,7,204,9],[205,0,205,6],[205,7,205,9],[206,0,206,6],[206,7,206,9],[207,0,207,6],[207,7,207,9],[199,10,199,12],[200,10,200,12],[201,10,201,12],[196,10,196,12],[197,10,197,12],[198,10,198,12],[196,0,196,6],[196,7,196,9],[197,0,197,6],[197,7,197,9],[198,0,198,6],[198,7,198,9],[199,0,199,6],[199,7,199,9],[200,0,200,6],[200,7,200,9],[201,0,201,6],[201,7,201,9],[193,10,193,12],[194,10,194,12],[195,10,195,12],[190,10,190,12],[191,10,191,12],[192,10,192,12],[190,0,190,6],[190,7,190,9],[191,0,191,6],[191,7,191,9],[192,0,192,6],[192,7,192,9],[193,0,193,6],[193,7,193,9],[194,0,194,6],[194,7,194,9],[195,0,195,6],[195,7,195,9],[187,10,187,12],[188,10,188,12],[189,10,189,12],[184,10,184,12],[185,10,185,12],[186,10,186,12],[184,0,184,6],[184,7,184,9],[185,0,185,6],[185,7,185,9],[186,0,186,6],[186,7,186,9],[187,0,187,6],[187,7,187,9],[188,0,188,6],[188,7,188,9],[189,0,189,6],[189,7,189,9],[175,10,175,12],[176,10,176,12],[181,0,181,13],[183,0,183,13],[182,0,182,13],[177,10,177,12],[180,0,180,13],[175,0,175,6],[175,7,175,9],[176,0,176,6],[176,7,176,9],[172,10,172,12],[173,10,173,12],[174,10,174,12],[169,10,169,12],[170,10,170,12],[171,10,171,12],[169,0,169,6],[169,7,169,9],[170,0,170,6],[170,7,170,9],[171,0,171,6],[171,7,171,9],[172,0,172,6],[172,7,172,9],[173,0,173,6],[173,7,173,9],[174,0,174,6],[174,7,174,9],[166,10,166,12],[167,10,167,12],[168,10,168,12],[163,10,163,12],[164,10,164,12],[165,10,165,12],[163,0,163,6],[163,7,163,9],[164,0,164,6],[164,7,164,9],[165,0,165,6],[165,7,165,9],[166,0,166,6],[166,7,166,9],[167,0,167,6],[167,7,167,9],[168,0,168,6],[168,7,168,9],[160,10,160,12],[161,10,161,12],[162,10,162,12],[157,10,157,12],[158,10,158,12],[159,10,159,12],[157,0,157,6],[157,7,157,9],[158,0,158,6],[158,7,158,9],[159,0,159,6],[159,7,159,9],[160,0,160,6],[160,7,160,9],[161,0,161,6],[161,7,161,9],[162,0,162,6],[162,7,162,9],[154,10,154,12],[155,10,155,12],[156,10,156,12],[151,10,151,12],[152,10,152,12],[153,10,153,12],[151,0,151,6],[151,7,151,9],[152,0,152,6],[152,7,152,9],[153,0,153,6],[153,7,153,9],[154,0,154,6],[154,7,154,9],[155,0,155,6],[155,7,155,9],[156,0,156,6],[156,7,156,9],[146,0,146,13],[148,0,148,13],[149,10,149,12],[147,0,147,13],[150,10,150,12],[140,10,140,12],[141,10,141,12],[143,0,143,13],[145,0,145,13],[142,10,142,12],[140,0,140,6],[140,7,140,9],[141,0,141,6],[141,7,141,9],[149,0,149,6],[149,7,149,9],[150,0,150,6],[150,7,150,9],[137,10,137,12],[138,10,138,12],[139,10,139,12],[134,10,134,12],[135,10,135,12],[136,10,136,12],[134,0,134,6],[134,7,134,9],[135,0,135,6],[135,7,135,9],[136,0,136,6],[136,7,136,9],[137,0,137,6],[137,7,137,9],[138,0,138,6],[138,7,138,9],[139,0,139,6],[139,7,139,9],[131,10,131,12],[132,10,132,12],[133,10,133,12],[128,10,128,12],[129,10,129,12],[130,10,130,12],[128,0,128,6],[128,7,128,9],[129,0,129,6],[129,7,129,9],[130,0,130,6],[130,7,130,9],[131,0,131,6],[131,7,131,9],[132,0,132,6],[132,7,132,9],[133,0,133,6],[133,7,133,9],[125,10,125,12],[126,10,126,12],[127,10,127,12],[122,10,122,12],[123,10,123,12],[124,10,124,12],[122,0,122,6],[122,7,122,9],[123,0,123,6],[123,7,123,9],[124,0,124,6],[124,7,124,9],[125,0,125,6],[125,7,125,9],[126,0,126,6],[126,7,126,9],[127,0,127,6],[127,7,127,9],[119,10,119,12],[120,10,120,12],[121,10,121,12],[116,10,116,12],[117,10,117,12],[118,10,118,12],[120,0,120,6],[120,7,120,9],[121,0,121,6],[121,7,121,9],[116,0,116,6],[116,7,116,9],[117,0,117,6],[117,7,117,9],[118,0,118,6],[118,7,118,9],[119,0,119,6],[119,7,119,9],[113,10,113,12],[114,10,114,12],[115,10,115,12],[107,0,107,13],[108,0,108,13],[111,10,111,12],[109,0,109,13],[110,0,110,13],[112,10,112,12],[111,7,111,9],[112,7,112,9],[111,0,111,6],[112,0,112,6],[113,0,113,6],[113,7,113,9],[114,0,114,6],[114,7,114,9],[115,0,115,6],[115,7,115,9],[104,0,104,4],[105,0,105,13],[104,9,104,11],[100,9,100,11],[101,9,101,11],[102,9,102,11],[103,9,103,11],[100,0,100,5],[101,0,101,5],[102,0,102,5],[103,0,103,5],[100,6,100,8],[101,6,101,8],[102,6,102,8],[103,6,103,8],[95,9,95,11],[96,9,96,11],[97,9,97,11],[98,9,98,11],[99,9,99,11],[95,0,95,5],[96,0,96,5],[97,0,97,5],[98,0,98,5],[99,0,99,5],[96,6,96,8],[97,6,97,8],[98,6,98,8],[99,6,99,8],[95,6,95,8],[89,9,89,11],[90,9,90,11],[91,9,91,11],[92,9,92,11],[93,9,93,11],[94,9,94,11],[89,0,89,5],[90,0,90,5],[91,0,91,5],[92,0,92,5],[93,0,93,5],[94,0,94,5],[93,6,93,8],[94,6,94,8],[85,9,85,11],[86,9,86,11],[87,9,87,11],[88,9,88,11],[87,0,87,5],[88,0,88,5],[72,0,72,13],[73,9,73,11],[74,9,74,11],[75,9,75,11],[76,9,76,11],[77,9,77,11],[78,9,78,11],[79,9,79,11],[80,9,80,11],[81,9,81,11],[82,9,82,11],[73,0,73,5],[74,0,74,5],[75,0,75,5],[76,0,76,5],[77,0,77,5],[85,0,85,5],[86,0,86,5],[46,0,46,2],[46,9,46,10],[43,9,43,10],[44,9,44,10],[45,0,45,2],[45,9,45,10],[43,0,43,2],[44,0,44,2],[42,0,42,2],[42,9,42,10],[55,9,55,10],[51,0,51,2],[51,9,51,10],[52,0,52,2],[52,9,52,10],[49,0,49,2],[49,9,49,10],[50,0,50,2],[50,9,50,10],[39,0,39,2],[39,9,39,10],[40,0,40,2],[40,9,40,10],[36,0,36,2],[36,9,36,10],[32,9,32,10],[33,0,33,2],[33,9,33,10],[38,0,38,2],[32,0,32,2],[37,9,37,10],[38,9,38,10],[1,0,1,15],[9,3,9,15],[10,11,10,12],[3,0,4,15],[6,0,6,15],[13,0,13,2],[14,0,14,2],[11,9,11,10],[12,9,12,10],[12,0,12,2],[13,9,13,10],[14,9,14,10],[10,3,10,4],[10,5,10,6],[10,7,10,8],[10,9,10,10],[10,14,10,15],[7,0,7,15],[15,0,15,2],[15,9,15,10],[328,11,328,12],[22,0,22,2],[22,9,22,10],[16,0,16,2],[16,9,16,10],[18,0,18,2],[18,9,18,10],[30,0,30,2],[30,9,30,10],[19,9,19,10],[20,9,20,10],[21,0,21,2],[19,0,19,2],[20,0,20,2],[25,9,25,10],[26,9,26,10],[27,0,27,2],[27,9,27,10],[28,0,28,2],[28,9,28,10],[25,0,25,2],[26,0,26,2],[329,0,329,13],[292,0,292,13],[254,0,254,13],[215,0,215,13],[178,0,178,13],[61,0,61,15],[71,0,71,13],[66,0,66,13],[69,0,69,13],[70,0,70,13],[290,11,290,12],[260,9,260,11],[261,9,261,11],[262,9,262,11],[263,9,263,11],[264,9,264,11],[265,9,265,11],[266,9,266,11],[267,9,267,11],[268,9,268,11],[269,9,269,11],[270,9,270,11],[271,9,271,11],[272,9,272,11],[282,9,282,11],[283,9,283,11],[284,9,284,11],[285,9,285,11],[286,9,286,11],[287,9,287,11],[288,9,288,11],[289,9,289,11],[260,6,260,8],[261,6,261,8],[273,9,273,11],[274,9,274,11],[275,9,275,11],[276,9,276,11],[277,9,277,11],[278,9,278,11],[279,9,279,11],[280,9,280,11],[281,9,281,11],[260,0,260,5],[261,0,261,5],[262,0,262,5],[262,6,262,8],[263,0,263,5],[263,6,263,8],[264,0,264,5],[264,6,264,8],[265,0,265,5],[265,6,265,8],[266,0,266,5],[266,6,266,8],[267,0,267,5],[267,6,267,8],[268,0,268,5],[268,6,268,8],[269,0,269,5],[269,6,269,8],[270,0,270,5],[270,6,270,8],[271,0,271,5],[271,6,271,8],[272,0,272,5],[272,6,272,8],[273,0,273,5],[273,6,273,8],[274,0,274,5],[274,6,274,8],[275,0,275,5],[275,6,275,8],[276,0,276,5],[276,6,276,8],[277,0,277,5],[277,6,277,8],[278,0,278,5],[278,6,278,8],[279,0,279,5],[279,6,279,8],[280,0,280,5],[280,6,280,8],[281,0,281,5],[281,6,281,8],[282,0,282,5],[282,6,282,8],[283,0,283,5],[283,6,283,8],[284,0,284,5],[284,6,284,8],[285,0,285,5],[285,6,285,8],[286,0,286,5],[286,6,286,8],[287,0,287,5],[287,6,287,8],[288,0,288,5],[288,6,288,8],[289,0,289,5],[289,6,289,8],[298,8,298,10],[295,0,295,13],[294,0,294,13],[296,0,296,13],[297,0,297,13],[298,0,298,4],[299,8,299,10],[300,8,300,10],[301,8,301,10],[302,8,302,10],[303,8,303,10],[304,8,304,10],[305,8,305,10],[306,8,306,10],[307,8,307,10],[299,0,299,4],[298,5,298,7],[299,5,299,7],[300,5,300,7],[301,5,301,7],[302,5,302,7],[303,5,303,7],[304,5,304,7],[302,0,302,4],[303,0,303,4],[300,0,300,4],[301,0,301,4],[324,0,324,4],[324,5,324,7],[325,0,325,4],[325,5,325,7],[326,0,326,4],[326,5,326,7],[327,0,327,4],[327,5,327,7],[324,8,324,10],[325,8,325,10],[326,8,326,10],[327,8,327,10],[47,0,47,2],[47,9,47,10],[53,0,53,2],[53,9,53,10],[57,0,57,2],[57,9,57,10],[17,0,17,2],[17,9,17,10],[23,0,23,2],[23,9,23,10],[29,0,29,2],[29,9,29,10],[35,0,35,2],[35,9,35,10],[41,0,41,2],[41,9,41,10],[31,0,31,2],[34,0,34,2],[34,9,34,10],[31,9,31,10],[21,9,21,10],[24,0,24,2],[24,9,24,10],[37,0,37,2]]}
[null,null,null,null,"School Division:",null,{"$f":"'Narrative & Detail Budget'!A15","v":"ALBEMARLE COUNTY PUBLIC SCHOOLS"},null,null,null,null,null,null,"Division Number:",null,{"$f":"'Narrative & Detail Budget'!$I$15","v":2}]
["I.  TRANSFERABILITY"]
[]
["Section 5103(b)(2) of ESSA allows divisions to transfer all or a portion of the funds received from Title II, Part A, or Title IV, Part A, into: Title I, Part A; Title I, Part C; Title I, Part D; Title II, Part A; Title III, Part A; Title IV, Part A; or Title V, Part B.  "]
[]
[]
["Complete the tab below if funds will be transferred under Section 5103(b)(2). Please note that prior approval is required to transfer funds. "]
["Transfer Request Form"]
[]
[null,null,null,"Amount Budgeted"]
[null,null,null,"Title I, Part A",null,"Title I, Part C",null,"Title I, Part D",null,"Title II, Part A",null,"Title III, Part A",null,"Title IV, Part A","Title V, Part B"]
[null,null,null,"Title II, Part A, Transferability\nAward S367A200044\nProject Coe APE61481\n","Title IV, Part A, Transferability\nAward S424A200048\nProject Code APE60019\n","Title II, Part A, Transferability","Title IV, Part A, Transferability","Title II, Part A, Transferability","Title IV, Part A, Transferability","Title IV, Part A, Transferability",null,"Title II, Part A, Transferability","Title IV, Part A, Transferability","Title II, Part A, Transferability","Title II, Part A, Transferability","Title IV, Part A, Transferability"]
["Amount Transferred to Program",null,null,{"$f":"'Narrative & Detail Budget'!N56","v":0},{"$f":"'Narrative & Detail Budget'!N59","v":0}]
["OBJECT CODE - EXPENDITURE TYPE"]
["1000 -  Personal Services"]
["Non Set-Aside",null,null,0,0]
["Set-Aside",null,null,0,0]
["Parent and Family Engagement Set-Aside",null,null,0,0]
["Private School Set-Aside ",null,null,0,0]
["Total Personal Services",null,null,{"$f":"SUM(D16:D19)","v":0},{"$f":"SUM(E16:E19)","v":0}]
["2000 - Employee Benefits"]
["Non Set-Aside",null,null,0,0]
["Set-Aside",null,null,0,0]
["Parent and Family Engagement Set-Aside",null,null,0,0]
["Private School Set-Aside ",null,null,0,0]
["Total Employee Benefits",null,null,{"$f":"SUM(D22:D25)","v":0},{"$f":"SUM(E22:E25)","v":0}]
["3000 - Purchased/Contracted Services"]
["Non Set-Aside",null,null,0,0]
["Set-Aside",null,null,0,0]
["Parent and Family Engagement Set-Aside",null,null,0,0]
["Private School Set-Aside ",null,null,0,0]
["Total Purchased/Contracted Services",null,null,{"$f":"SUM(D28:D31)","v":0},{"$f":"SUM(E28:E31)","v":0}]
["4000 - Internal Services"]
["Non Set-Aside",null,null,0,0]
["Set-Aside",null,null,0,0]
["Parent and Family Engagement Set-Aside",null,null,0,0]
["Private School Set-Aside ",null,null,0,0]
["Total Internal Services",null,null,{"$f":"SUM(D34:D37)","v":0},{"$f":"SUM(E34:E37)","v":0}]
["5000 - Other Charges"]
["Non Set-Aside",null,null,0,0]
["Set-Aside",null,null,0,0]
["Parent and Family Engagement Set-Aside",null,null,0,0]
["Private School Set-Aside ",null,null,0,0]
["Total Other Charges",null,null,{"$f":"SUM(D40:D43)","v":0},{"$f":"SUM(E40:E43)","v":0}]
["6000 - Materials and Supplies"]
["Non Set-Aside",null,null,0,0]
["Set-Aside",null,null,0,0]
["Parent and Family Engagement Set-Aside",null,null,0,0]
["Private School Set-Aside ",null,null,0,0]
["Total Materials and Supplies",null,null,{"$f":"SUM(D46:D49)","v":0},{"$f":"SUM(E46:E49)","v":0}]
["8000 - Capital Outlay"]
["Non Set-Aside",null,null,0,0]
["Set-Aside",null,null,0,0]
["Parent and Family Engagement Set-Aside",null,null,0,0]
["Private School Set-Aside ",null,null,0,0]
["Total Capital Outlay",null,null,{"$f":"SUM(D52:D55)","v":0},{"$f":"SUM(E52:E55)","v":0}]
["Total Budget",null,null,{"$f":"SUM(D20+D26+D32+D38+D44+D50+D56)","v":0},{"$f":"SUM(E20+E26+E32+E38+E44+E50+E56)","v":0}]
["Total Parent and Family Engagement Set-Aside",null,null,{"$f":"SUM(D18+D24+D30+D36+D42+D48+D54)","v":0},{"$f":"SUM(E18+E24+E30+E36+E42+E48+E54)","v":0}]
["Total Private School Set-Aside",null,null,{"$f":"SUM(D19+D25+D31+D37+D43+D49+D55)","v":0},{"$f":"SUM(E19+E25+E31+E37+E43+E49+E55)","v":0}]
["Does the Total Budget Match the Amount Transferred into Program?",null,null,{"$f":"IF(D57=D13,\"Yes\",\"No\")","v":"Yes"},{"$f":"IF(E57=E13,\"Yes\",\"No\")","v":"Yes"}]
[]
["Page 26"]
[null,null,null,null,"School Division:",null,{"$f":"'Narrative & Detail Budget'!A15","v":"ALBEMARLE COUNTY PUBLIC SCHOOLS"},null,null,null,null,null,"Division Number:",null,{"$f":"'Narrative & Detail Budget'!$I$15","v":2}]
["DETAIL BUDGET BREAKDOWN"]
[]
["Prepare a detailed breakdown of the budget categories for Object Codes 1000-6000 and 8000."]
["The amounts by program and object code totals are to be entered on the Budget Sheet under the appropriate area."]
["Do the totals equal the Transferability Budget Summary? ",null,null,null,null,null,null,null,{"$f":"IF(SUM(D57:E57)=SUM(N105,N143,N178,N215,N254,N291,N329),\"Yes\",\"No - please review your entries.\")","v":"Yes"}]
[]
["DETAILED BUDGET DESCRIPTION OF OBJECT CODE 1000"]
["Provide a description of the positions supported with funds from this program. Indicate if any positions are newly funded under this program.  Explain the supplementary nature of any new positions. Required if staff positions are to be funded by federal funds."]
[]
[]
["Types of Staff Positions\nAdministrative, Teacher, Paraprofessional, Reading Specialist, Home School Coordinator, Other",null,null,null,null,null,"Set Aside Category",null,null,"Funding Source",null,null,"FTEs","Total Cost"]
[]
[]
[]
[]
[]
[]
[]
[]
[]
[]
[]
[]
[]
[]
[]
[]
[]
[]
[]
[]
[]
[]
[]
[]
[]
[]
[]
[]
[]
[]
[null,null,null,null,"   ",null,null,null,null,"Total for Object Code:",null,null,{"$f":"SUM(M75:M104)","v":0},{"$f":"SUM(N75:N104)","v":0}]
["Page 27"]
[null,null,null,null,"School Division:",null,{"$f":"'Narrative & Detail Budget'!A15","v":"ALBEMARLE COUNTY PUBLIC SCHOOLS"},null,null,null,null,null,"Division Number:",null,{"$f":"'Narrative & Detail Budget'!$I$15","v":2}]
["DETAILED BUDGET DESCRIPTION OF OBJECT CODE 2000"]
["Indicate the fixed charge categories (such as FICA, health, etc.) and specify the amount of each."]
[]
[]
["Item Description",null,null,null,null,null,null,"Set Aside Category",null,null,"Funding Source",null,null,"Total Cost"]
[]
[]
[]
[]
[]
[]
[]
[]
[]
[]
[]
[]
[]
[]
[]
[]
[]
[]
[]
[]
[]
[]
[]
[]
[]
[]
[]
[]
[]
[]
[null,null,null,null,"      ",null,null,null,null,null,"Total for Object Code:",null,null,{"$f":"SUM(N113:N142)","v":0}]
["Page 28"]
[null,null,null,null,"School Division:",null,{"$f":"'Narrative & Detail Budget'!A15","v":"ALBEMARLE COUNTY PUBLIC SCHOOLS"},null,null,null,null,null,"Division Number:",null,{"$f":"'Narrative & Detail Budget'!$I$15","v":2}]
["DETAILED BUDGET DESCRIPTION OF OBJECT CODE 3000 "]
["Please indicate how these funds will support any services and activities that are described in the application.  Services acquired from outside sources (i.e., private vendors, public authorities, or other governmental entities).  "]
[]
[]
["Item Description",null,null,null,null,null,null,"Set Aside Category",null,null,"Funding Source",null,null,"Total Cost"]
[]
[]
[]
[]
[]
[]
[]
[]
[]
[]
[]
[]
[]
[]
[]
[]
[]
[]
[]
[]
[]
[]
[]
[]
[]
[]
[]
[null,null,null,null,"      ",null,null,null,null,null,"Total for Object Code:",null,null,{"$f":"SUM(N151:N177)","v":0}]
["Page 29"]
[null,null,null,null,"School Division:",null,{"$f":"'Narrative & Detail Budget'!A15","v":"ALBEMARLE COUNTY PUBLIC SCHOOLS"},null,null,null,null,null,"Division Number:",null,{"$f":"'Narrative & Detail Budget'!$I$15","v":2}]
["DETAILED BUDGET DESCRIPTION OF OBJECT CODE 4000"]
["Provide a description of charges from an Internal Service Fund to other functions/activities/elements of the local government for the use of intergovernmental services.  Public school choice pupil transportation for Title I, Part A, if applicable, should be included here (if your division is paying this expense from other sources, indicate this in your narrative). "]
[]
[]
["Item Description",null,null,null,null,null,null,"Set Aside Category",null,null,"Funding Source",null,null,"Total Cost"]
[]
[]
[]
[]
[]
[]
[]
[]
[]
[]
[]
[]
[]
[]
[]
[]
[]
[]
[]
[]
[]
[]
[]
[]
[]
[]
[]
[]
[]
[null,null,null,null,"      ",null,null,null,null,null,"Total for Object Code:",null,null,{"$f":"SUM(N186:N214)","v":0}]
["Page 30"]
[null,null,null,null,"School Division:",null,{"$f":"'Narrative & Detail Budget'!A15","v":"ALBEMARLE COUNTY PUBLIC SCHOOLS"},null,null,null,null,null,"Division Number:",null,{"$f":"'Narrative & Detail Budget'!$I$15","v":2}]
["DETAILED BUDGET DESCRIPTION FOR OBJECT CODE 5000"]
["Includes expenditures that support the program, including utilities (maintenance and operation of plant), staff/administrative/consultant travel, office phone charges, training, leases/rental, indirect cost, and other."]
[]
[]
["Item Description",null,null,null,null,null,null,"Set Aside Category",null,null,"Funding Source",null,null,"Total Cost"]
[]
[]
[]
[]
[]
[]
[]
[]
[]
[]
[]
[]
[]
[]
[]
[]
[]
[]
[]
[]
[]
[]
[]
[]
[]
[]
[]
[]
[]
[]
[]
[null,null,null,null,"      ",null,null,null,null,null,"Total for Object Code:",null,null,{"$f":"SUM(N223:N253)","v":0}]
["Page 31"]
[null,null,null,null,"School Division:",null,{"$f":"'Narrative & Detail Budget'!A15","v":"ALBEMARLE COUNTY PUBLIC SCHOOLS"},null,null,null,null,null,"Division Number:",null,{"$f":"'Narrative & Detail Budget'!$I$15","v":2}]
["DETAILED BUDGET DESCRIPTION FOR OBJECT CODE 6000"]
["Provide a description for expenses related to object code 6000 Materials and Supplies.  Include items that are consumed or materially altered when used and minor equipment that is not capitalized. Equipment under $5,000, including computer equipment, should be reported under this object code unless the LEA has set a lower capitalization threshold.  Indicate the quantity for each item.  "]
[]
[]
["Item Description",null,null,null,null,null,"Set Aside Category",null,null,"Funding Source",null,null,"Quantity","Total Cost"]
[]
[]
[]
[]
[]
[]
[]
[]
[]
[]
[]
[]
[]
[]
[]
[]
[]
[]
[]
[]
[]
[]
[]
[]
[]
[]
[]
[]
[]
[null,null,null,null,"      ",null,null,null,null,null,null,"Total for Object Code:",null,{"$f":"SUM(N262:N290)","v":0}]
[]
["Page 32"]
[null,null,null,null,"School Division:",null,{"$f":"'Narrative & Detail Budget'!A15","v":"ALBEMARLE COUNTY PUBLIC SCHOOLS"},null,null,null,null,null,"Division Number:",null,{"$f":"'Narrative & Detail Budget'!$I$15","v":2}]
["DETAILED BUDGET DESCRIPTION FOR OBJECT CODE 8000"]
["All capital outlay expenditures over $5,000 per unit must be approved in advance by the Virginia Department of Education. If the school division has established a threshold of a lesser amount, items equal to that amount or greater must also receive prior approval by the Virginia Department of Education.  Nonconsumable items must be listed in the application.  Equipment quantities must be specified. "]
[]
[]
["Item Description",null,null,null,null,"Set Aside Category",null,null,"Funding Source",null,null,"Quantity","Cost Per Item","Total Cost"]
[]
[]
[]
[]
[]
[]
[]
[]
[]
[]
[]
[]
[]
[]
[]
[]
[]
[]
[]
[]
[]
[]
[]
[]
[]
[]
[]
[]
[]
[null,null,null,null,"      ",null,null,null,null,null,null,"Total for Object Code:",null,{"$f":"SUM(N300:N328)","v":0}]
["Page 33"]

{"sheet":"GEPA","index":3,"n_rows":10,"n_cols":16,"rows_kept":10,"cut":false,"hidden":false,"merged":[[14,5,14,6],[14,7,14,8],[14,9,14,10],[12,5,12,6],[12,7,12,8],[12,9,12,10],[13,5,13,6],[13,7,13,8],[13,9,13,10],[7,0,7,15],[9,0,9,15],[11,5,11,6],[11,7,11,8],[11,9,11,10],[0,3,0,5],[1,0,1,15],[3,0,3,15],[5,0,5,15],[6,0,6,15]]}
[null,null,null,"School Division:",null,null,{"$f":"'Narrative & Detail Budget'!A15","v":"ALBEMARLE COUNTY PUBLIC SCHOOLS"},null,null,null,null,null,"Division Number:",null,null,{"$f":"'Narrative & Detail Budget'!I15","v":2}]
["J.  GENERAL EDUCATION PROVISIONS ACT (GEPA) SECTION 427"]
[]
["Section 427 of the General Education Provisions Act (GEPA) requires applicants for federal funds to include in their applications a description of the steps the applicant will take to ensure equitable access to, and participation in, federally-assisted programs for students, teachers, and other program beneficiaries with special needs. The provision allows applicants discretion in developing the required description. The statute highlights six types of barriers that can impede equitable access or participation: gender, race, national origin, color, disability, or age. Based on local circumstances, the applicant should determine whether these or other barriers may prevent students, teachers, etc., from such access or participation in the federally-funded project or activity. The description in the application of steps to be taken to overcome these barriers need not be lengthy; the application may provide a clear and succinct description of how the applicant plans to address those barriers that are applicable to their circumstances."]
[]
["Describe the steps the division will take to ensure equitable access to, and participation in, grant-funded programs for students, teachers, and other program beneficiaries with special needs as required by the General Education Provisions Act (GEPA) 427, OMB Control No. 1894-00045, Section 427."]
["Albemarle County is committed to providing equitable access for students, teachers and families in all grant-funded programs and opportunities as required by GEPA 427: \n\n1.Ensuring all events are held in handicapped accessible facilities in geographically convenient locations. Events are held during the day, evening, and on weekends to accommodate family school/work schedules in order to maximize participation.\n2. Materials provided are accessible for literate and non-readers as well as in electronic and paper copy formats to inform families that may not have access to social media and email. This includes translation of documents into Spanish and other languages as needed. The ESOL Office annually vets, hires and trains additional interpreters and translators to ensure a high-level of quality with a personalized experience for families.  Simultaneous interpretation equipment is used in large-group settings, and InterpreTalk Language Line services are used when necessary. \n \n\n\n"]
["\n3.Albemarle County conducts a variety of outreach programs to address gender and/or race inequalities. Some of these include: Teacher summer reading project, Girls in STEM initiatives, Summer Immersion Excursion programs for newcomers, Camp Invention modules, CoderDojo, World Peace Game, and Saturday family engagement experiences to STEM fairs and other local attractions. \n4.Efforts to involve diverse stakeholders in program planning and implementation are robust and include seventeen diverse teams. Advisory groups include Parent Council, Student Advisory, Special Education, Gifted, Title I, and Diversity and Equity.  Last but certainly not least, the Title I, Title III, Migrant and Homeless Coordinators all meet monthly with the Director of Federal Programs to collaborate and ensure our students have equitable access to all division opportunities. \n5. Lastly, as set forth on our Human Resources website \"hiring for Albemarle County shall be accomplished without regard to race, color, religion, national origin, gender, pregnancy, childbirth or related medical conditions, age, marital status or disability unless otherwise permitted by County policy or applicable law\".\n\n\n\n"]
[]
["Page 34"]

{"sheet":"Program Requirements","index":4,"n_rows":340,"n_cols":15,"rows_kept":340,"cut":false,"hidden":false,"merged":[[19,0,19,12],[23,1,23,4],[23,5,23,6],[23,7,23,8],[23,9,23,10],[23,11,23,12],[3,0,3,12],[5,0,5,12],[9,0,9,12],[12,0,12,12],[13,0,13,12],[17,0,17,12],[22,1,22,4],[22,5,22,6],[22,7,22,8],[22,9,22,10],[22,11,22,12],[21,1,21,8],[10,0,10,12],[24,1,24,4],[24,5,24,6],[24,7,24,8],[24,9,24,10],[24,11,24,12],[25,1,25,4],[25,5,25,6],[25,7,25,8],[25,9,25,10],[25,11,25,12],[29,0,29,12],[30,0,30,1],[30,2,30,5],[30,8,30,9],[26,1,26,4],[26,5,26,6],[26,7,26,8],[26,9,26,10],[26,11,26,12],[27,1,27,4],[27,5,27,6],[27,7,27,8],[27,9,27,10],[27,11,27,12],[285,9,285,11],[286,9,286,11],[287,9,287,11],[280,0,280,12],[31,0,31,12],[72,13,72,15],[74,5,74,10],[76,0,76,2],[76,3,76,4],[71,0,71,12],[282,0,282,12],[35,0,35,12],[36,0,36,12],[44,0,44,12],[47,0,47,3],[47,4,47,5],[47,7,47,10],[47,11,47,12],[43,0,43,12],[38,0,38,12],[40,0,40,12],[42,2,42,12],[74,13,74,15],[75,3,75,4],[296,9,296,11],[297,9,297,11],[298,9,298,11],[299,9,299,11],[288,9,288,11],[289,9,289,11],[290,9,290,11],[291,9,291,11],[292,9,292,11],[293,9,293,11],[338,9,338,11],[339,0,339,15],[1,0,1,12],[4,0,4,12],[7,0,7,12],[11,0,11,12],[14,0,14,4],[15,0,15,12],[330,9,330,11],[331,9,331,11],[332,9,332,11],[333,9,333,11],[334,9,334,11],[335,9,335,11],[324,9,324,11],[325,9,325,11],[326,9,326,11],[327,9,327,11],[328,9,328,11],[329,9,329,11],[318,9,318,11],[319,9,319,11],[320,9,320,11],[321,9,321,11],[336,9,336,11],[337,9,337,11],[322,9,322,11],[323,9,323,11],[312,9,312,11],[313,9,313,11],[314,9,314,11],[315,9,315,11],[316,9,316,11],[317,9,317,11],[306,9,306,11],[307,9,307,11],[308,9,308,11],[309,9,309,11],[310,9,310,11],[311,9,311,11],[300,9,300,11],[49,0,49,12],[54,1,54,6],[55,9,55,12],[59,2,59,3],[59,11,59,12],[61,0,61,7],[63,0,63,12],[64,0,64,2],[64,9,64,11],[68,0,68,12],[301,9,301,11],[302,9,302,11],[303,9,303,11],[304,9,304,11],[305,9,305,11],[294,9,294,11],[295,9,295,11],[75,0,75,2],[75,13,76,15],[64,3,64,4],[32,11,32,12],[33,11,33,12],[32,9,32,10],[33,9,33,10],[32,5,32,6],[32,7,32,8],[33,5,33,6],[33,7,33,8],[32,1,32,4],[33,1,33,4],[51,0,51,12],[52,0,52,12],[57,1,57,7],[57,9,57,10],[59,0,59,1],[46,0,46,12]]}
[null,null,null,null,"School Division:",null,{"$f":"'Narrative & Detail Budget'!$A$15","v":"ALBEMARLE COUNTY PUBLIC SCHOOLS"},null,null,null,"Division Number:",null,{"$f":"'Narrative & Detail Budget'!I15","v":2}]
["K.  STUDENT ELIGIBILITY CRITERIA FOR TITLE I TARGETED ASSISTANCE SCHOOLS"]
["     "]
["Describe the eligibility criteria by subject area that will be used to select students for participation in the Title I program in Targeted Assistance schools.  Eligible children are children identified by the school as failing, or most at risk of failing, to meet the state’s challenging student academic achievement standards on the basis of multiple, educationally related, objective criteria established by the school divisions with input from the schools.  Children from Early Childhood through grade 2 shall be selected solely on the basis of such criteria as teacher judgment, interviews with parents, and developmentally appropriate measures.  [ESEA, Title I, Part A, Section 1115]    "]
["The process for determining eligibility for Title I services was described in depth in the Program Overview Section B, #2.  In review, the needs assessment process is designed to begin in the spring, and then student eligibility is determined when school starts again in August. Title I teachers support the selection of the neediest students on the Title I Eligibility List (E-List) within grade level PLCs.  The data examined by grade level are the results of the following assessments: PALS, QRI, Six-Minute Solution, Student Numeracy Assessment Progressions (SNAP), Albemarle County’s Assessment of Math Benchmarks (ACAMB), and Standards of Learning (SOL) tests. Services begin after parent permission is received within the first weeks of the start of the school year.\n\nFurther, the Reading Eligibility Lists for each school show identified students, rank-ordered by their calculated composite scores. ACPS Title I uses a scoring system that allocates points for student performance levels on PALS, QRI, WRI, Six-Minute Solution, and SOLs, dependent on the grade level of the student.  This composite, rank-ordered scoring system ensures that no student is bypassed in receiving services.\n"]
["The Math eligibility process is based on the benchmark score for the particular grade level assessment used - SNAP, ACAMB or SOL. Students below benchmark levels are served, with emphasis on those most below the benchmark levels."]
[]
["L.  TITLE I, PART A, NEW SCHOOLWIDE SCHOOL PROGRAMS FOR 2020-2021 "]
[]
["Plans for any new schoolwide programs must be submitted in advance of the application.  Contact your Title I specialist in the Office of ESEA Programs for due date and additional information.  For those schools that are already schoolwide, remember that you must do an annual review including a need assessment.  Funds should be targeted in accordance with the academic needs of the students."]
["Name of School(s) Implementing New Schoolwide Programs for 2020-2021:       "]
["   "]
["Name of school below 40% poverty for which the division applied for a schoolwide waiver:"]
[]
["Was the waiver granted by the SEA?  ",null,null,null,null,null,"Yes",null,"No"]
["Page 35"]
[null,null,null,null,"School Division:",null,{"$f":"'Narrative & Detail Budget'!$A$15","v":"ALBEMARLE COUNTY PUBLIC SCHOOLS"},null,null,null,"Division Number:",null,{"$f":"'Narrative & Detail Budget'!I15","v":2}]
["M.  TARGETED ASSISTANCE PROGRAMS"]
[]
["Provide the number of full-time equivalent (FTE) staff funded through Title I, Part A, participating in targeted assistance programs by job category.  For administrators and supervisors who serve both targeted assistance and schoolwide programs, report the FTE attributable to the targeted assistance duties only. See guidelines for full description of staff categories. Staffing information in this section must be identical to the information listed on the 35% and Above or Below 35% Low-Income tab (whichever is applicable), in the TITLE I, PART A, ALLOCATION TO ELIGIBLE SCHOOLS section in Columns 8-11 for Targeted Assistance Program.\n"]
[]
[null,"Please include staff FTE and percentage qualified for 2020-2021 school year."]
[null,"Staff Category",null,null,null,"Staff FTE \n2020-2021",null,"Percentage Qualified\n2020-2021"]
[null,"Teachers",null,null,null,13.5,null,1]
[null,"Paraprofessionals"]
[null,"Other Paraprofessionals (paraprofessionals that do not provide instructional support such as parental involvement, computer assistance)"]
[null,"Clerical support staff",null,null,null,0.5,null,"NA"]
[null,"Administrators (nonclerical)",null,null,null,1.4,null,1]
[]
["SCHOOLWIDE PROGRAMS"]
[]
["Provide the number of FTE paraprofessionals who serve in schoolwide program schools and the percentage of these paraprofessionals who are qualified in accordance with Section 1119 (c) and (d) of ESEA.  This number includes ALL paraprofessionals, not only Title I funded paraprofessionals.\n"]
[null,null,null,null,null,"Paraprofessionals FTE \n2020-2021",null,"Percentage  Qualified\n2020-2021"]
[null,"Paraprofessionals"]
[]
["Describe how the local educational agency will identify and address, as required under State plans as described in section 1111(g)(1)(B), any disparities that result in low-income students and minority students being taught at higher rates than other students by ineffective, inexperienced, or out-of-field teachers."]
["ACPS has designed an intensive instructional coaching model, which is the foundation for developing the skills and instructional capabilities of new teachers. Instructional coaches serve as instructional resources in content areas, teaching methods, classroom management and assessment.  Instructional coaches assist new teachers in using data to plan and target instruction to student needs and also are available to provide support to experienced teachers, when needed.  Our structured induction program includes a four-day New Teacher Academy prior to start of school, where new teachers are instructed in the school division vision, mission, priorities, and strategic practices.  Ongoing, planned professional development activities occur throughout the first year, though instructional coaches work with teachers for two years, through job-embedded, real-time activities resulting in a highly collaborative approach to new teacher development. Our Human Resources Department works to ensure that provisionally licensed teachers become fully licensed and also meets with principals regarding teachers who are teaching outside their content/endorsement areas to guide them toward taking and passing appropriate Praxis tests. The IPAL report and HR reports guide identification of disparity issues among teachers and schools."]
[]
["Page 36"]
[null,null,null,null,"School Division:",null,{"$f":"'Narrative & Detail Budget'!$A$15","v":"ALBEMARLE COUNTY PUBLIC SCHOOLS"},null,null,null,"Division Number:",null,{"$f":"'Narrative & Detail Budget'!I15","v":2}]
["N.  IMPROVEMENT PLAN REQUIREMENTS"]
[]
[null,"X","The LEA understands that schools designated as comprehensive support and targeted support and improvement schools will be required to use an improvement planning tool as determined by the Office of School Quality."]
[]
["O.  TITLE I, PART A, MAINTENANCE OF EFFORT"]
[]
["Average Per Pupil Expenditure from Non-Federal Funds:"]
["(A) For FY Ending June 30, 2018",null,null,null,14137,null,null,"(B) For FY Ending June 30, 2019",null,null,null,14366]
[]
["P.  TITLE I, PART A, ELIGIBLE ATTENDANCE AREAS  "]
[]
["SOURCES OF DATA FOR DETERMINING UNDUPLICATED NUMBER OF CHILDREN, AGES 5-17,"]
["FROM LOW-INCOME FAMILIES  (Indicate ALL Sources with an “X”)"]
[null,null,null,null,null,null,null,null,null,"CEP"]
["X"," Free/Reduced Lunch/Household Applications",null,null,null,null,null,null,null,"Children Eligible for Medicaid"]
[null," Temporary Assistance for Needy Families (TANF)  ",null,null,null,null,null,null,null,"Most Recent U. S. Census Bureau Information"]
["ELIGIBLE ATTENDANCE AREAS   (Indicate with an “X”)"]
["X","Grade-Span Ranking - select the Grade Span(s) you are serving below",null,null,null,null,null,null,null,"Rank Order",null,"X","Division Average"]
[]
["First Grade Span",null,"PK - 05",null,null,null,null,"Second Grade Span, if applicable"]
["PRIVATE SCHOOL MEMBERSHIP"]
["Is your school division in the Bypass for Private Schools?",null,null,null,null,null,null,null,null,"Yes",null,"X","No"]
["If your division is in the Bypass, do not enter the private school membership numbers."]
["If your school division is not in the bypass for private schools, does the division maintain documented efforts to obtain private school membership and the signed affirmation of consultation with private school officials?     "]
[null,null,null,"X",null,"Yes",null,"No",null,"No Private Schools"]
[]
[]
[]
["Page 37"]
[null,null,null,null,"School Division:",null,{"$f":"'Narrative & Detail Budget'!$A$15","v":"ALBEMARLE COUNTY PUBLIC SCHOOLS"},null,null,null,"Division Number:",null,{"$f":"'Narrative & Detail Budget'!I15","v":2}]
[]
["ELIGIBLE ATTENDANCE AREAS (Indicate requested information in columns.)\nAfter completing the ELIGIBLE ATTENDANCE AREAS section, continue to the bottom of the sheet.\n\n"]
[]
[]
[null,null,null,null,null,"Total Number of Children Residing in Attendance Areas"]
["Name of Public School",null,null,"Grade Span of School",null,"Total School Membership","Low-Income Private School Membership","Low-Income Public School Membership","Total Low-Income ","CEP School*  (Yes/No)","CEP Multiplier Applied* (Yes/No)","Low-Income Count used to Allocate Title I Funds","Percentage of Low-Income","*For more information on the Community Eligibility Provision (CEP), refer to the Eligible Attendance Areas section of the Application Guidelines, Instructions, and Assurances."]
[1,null,null,"2",null,"3","4","5","6","7","8","9","10"]
["Mary Carr Greer Elementary",null,null,"PK - 05",null,509,5,380,{"$f":"SUM(G78:H78)","v":385},null,null,{"$f":"IF(O78>=F78,F78,IF(O78<F78,O78))","v":380},{"$f":"IF(K78=\"Yes\",L78/F78,H78/F78)","v":0.74656188605108054},null,{"$f":"IF(K78=\"Yes\",H78*1.6,H78)","v":380}]
["Woodbrook Elementary",null,null,"PK - 05",null,585,2,391,393,null,null,391,0.66837606837606833,null,391]
["Jack Jouett Middle",null,null,"06 - 08",null,642,null,372,372,null,null,372,0.57943925233644855,null,372]
["Agnor-Hurt Elementary",null,null,"PK - 05",null,483,2,270,272,null,null,270,0.55900621118012417,null,270]
["Red Hill Elementary",null,null,"PK - 05",null,206,null,111,111,null,null,111,0.53883495145631066,null,111]
["Scottsville Elementary",null,null,"PK - 05",null,228,null,107,107,null,null,107,0.4692982456140351,null,107]
["Paul H. Cale Elementary",null,null,"PK - 05",null,779,1,353,354,null,null,353,0.45314505776636715,null,353]
["Jackson P. Burley Middle",null,null,"06 - 08",null,585,null,258,258,null,null,258,0.44102564102564101,null,258]
["Leslie H. Walton Middle",null,null,"06 - 08",null,339,null,145,145,null,null,145,0.42772861356932151,null,145]
["Monticello High",null,null,"09 - 12",null,1196,null,399,399,null,null,399,0.33361204013377926,null,399]
["Albemarle High",null,null,"09 - 12",null,1910,null,620,620,null,null,620,0.32460732984293195,null,620]
["Stony Point Elementary",null,null,"KG - 05",null,224,null,72,72,null,null,72,0.32142857142857145,null,72]
["Crozet Elementary",null,null,"KG - 05",null,343,null,105,105,null,null,105,0.30612244897959184,null,105]
["Stone Robinson Elementary",null,null,"PK - 05",null,511,1,149,150,null,null,149,0.29158512720156554,null,149]
["Baker-Butler Elementary",null,null,"PK - 05",null,677,null,181,181,null,null,181,0.2673559822747415,null,181]
["Murray High",null,null,"09 - 12",null,81,null,21,21,null,null,21,0.25925925925925924,null,21]
["Albemarle County Community Public Charter School",null,null,"06 - 08",null,58,null,13,13,null,null,13,0.22413793103448276,null,13]
["Mortimer Y. Sutherland Middle",null,null,"06 - 08",null,595,null,131,131,null,null,131,0.22016806722689075,null,131]
["Broadus Wood Elementary",null,null,"PK - 05",null,288,null,55,55,null,null,55,0.19097222222222221,null,55]
["Hollymead Elementary",null,null,"PK - 05",null,430,null,75,75,null,null,75,0.1744186046511628,null,75]
["Joseph T. Henley Middle",null,null,"06 - 08",null,913,null,136,136,null,null,136,0.14895947426067907,null,136]
["Western Albemarle High",null,null,"09 - 12",null,1198,null,152,152,null,null,152,0.12687813021702837,null,152]
["Brownsville Elementary",null,null,"PK - 05",null,865,null,106,106,null,null,106,0.12254335260115606,null,106]
["Meriwether Lewis Elementary",null,null,"KG - 05",null,400,null,48,48,null,null,48,0.12,null,48]
["Virginia L. Murray Elementary",null,null,"PK - 05",null,262,null,18,18,null,null,18,6.8702290076335881E-2,null,18]
[null,null,null,null,null,null,null,null,{"$f":"SUM(G103:H103)","v":0},null,null,{"$f":"IF(O103>=F103,F103,IF(O103<F103,O103))","v":0},{"$f":"IF(K103=\"Yes\",L103/F103,H103/F103)","v":{"$error":"#DIV/0!"}},null,{"$f":"IF(K103=\"Yes\",H103*1.6,H103)","v":0}]
[null,null,null,null,null,null,null,null,0,null,null,0,{"$error":"#DIV/0!"},null,0]
[null,null,null,null,null,null,null,null,0,null,null,0,{"$error":"#DIV/0!"},null,0]
[null,null,null,null,null,null,null,null,0,null,null,0,{"$error":"#DIV/0!"},null,0]
[null,null,null,null,null,null,null,null,0,null,null,0,{"$error":"#DIV/0!"},null,0]
[null,null,null,null,null,null,null,null,0,null,null,0,{"$error":"#DIV/0!"},null,0]
[null,null,null,null,null,null,null,null,0,null,null,0,{"$error":"#DIV/0!"},null,0]
[null,null,null,null,null,null,null,null,0,null,null,0,{"$error":"#DIV/0!"},null,0]
[null,null,null,null,null,null,null,null,0,null,null,0,{"$error":"#DIV/0!"},null,0]
[null,null,null,null,null,null,null,null,0,null,null,0,{"$error":"#DIV/0!"},null,0]
[null,null,null,null,null,null,null,null,0,null,null,0,{"$error":"#DIV/0!"},null,0]
[null,null,null,null,null,null,null,null,0,null,null,0,{"$error":"#DIV/0!"},null,0]
[null,null,null,null,null,null,null,null,0,null,null,0,{"$error":"#DIV/0!"},null,0]
[null,null,null,null,null,null,null,null,0,null,null,0,{"$error":"#DIV/0!"},null,0]
[null,null,null,null,null,null,null,null,0,null,null,0,{"$error":"#DIV/0!"},null,0]
[null,null,null,null,null,null,null,null,0,null,null,0,{"$error":"#DIV/0!"},null,0]
[null,null,null,null,null,null,null,null,0,null,null,0,{"$error":"#DIV/0!"},null,0]
[null,null,null,null,null,null,null,null,0,null,null,0,{"$error":"#DIV/0!"},null,0]
[null,null,null,null,null,null,null,null,0,null,null,0,{"$error":"#DIV/0!"},null,0]
[null,null,null,null,null,null,null,null,0,null,null,0,{"$error":"#DIV/0!"},null,0]
[null,null,null,null,null,null,null,null,0,null,null,0,{"$error":"#DIV/0!"},null,0]
[null,null,null,null,null,null,null,null,0,null,null,0,{"$error":"#DIV/0!"},null,0]
[null,null,null,null,null,null,null,null,0,null,null,0,{"$error":"#DIV/0!"},null,0]
[null,null,null,null,null,null,null,null,0,null,null,0,{"$error":"#DIV/0!"},null,0]
[null,null,null,null,null,null,null,null,0,null,null,0,{"$error":"#DIV/0!"},null,0]
[null,null,null,null,null,null,null,null,0,null,null,0,{"$error":"#DIV/0!"},null,0]
[null,null,null,null,null,null,null,null,0,null,null,0,{"$error":"#DIV/0!"},null,0]
[null,null,null,null,null,null,null,null,0,null,null,0,{"$error":"#DIV/0!"},null,0]
[null,null,null,null,null,null,null,null,0,null,null,0,{"$error":"#DIV/0!"},null,0]
[null,null,null,null,null,null,null,null,0,null,null,0,{"$error":"#DIV/0!"},null,0]
[null,null,null,null,null,null,null,null,0,null,null,0,{"$error":"#DIV/0!"},null,0]
[null,null,null,null,null,null,null,null,0,null,null,0,{"$error":"#DIV/0!"},null,0]
[null,null,null,null,null,null,null,null,0,null,null,0,{"$error":"#DIV/0!"},null,0]
[null,null,null,null,null,null,null,null,0,null,null,0,{"$error":"#DIV/0!"},null,0]
[null,null,null,null,null,null,null,null,0,null,null,0,{"$error":"#DIV/0!"},null,0]
[null,null,null,null,null,null,null,null,0,null,null,0,{"$error":"#DIV/0!"},null,0]
[null,null,null,null,null,null,null,null,0,null,null,0,{"$error":"#DIV/0!"},null,0]
[null,null,null,null,null,null,null,null,0,null,null,0,{"$error":"#DIV/0!"},null,0]
[null,null,null,null,null,null,null,null,0,null,null,0,{"$error":"#DIV/0!"},null,{"$f":"IF(K141=\"Yes\",H141*1.6,H141)","v":0}]
[null,null,null,null,null,null,null,null,0,null,null,{"$f":"IF(O142>=F142,F142,IF(O142<F142,O142))","v":0},{"$error":"#DIV/0!"},null,0]
[null,null,null,null,null,null,null,null,0,null,null,0,{"$f":"IF(K143=\"Yes\",L143/F143,H143/F143)","v":{"$error":"#DIV/0!"}},null,0]
[null,null,null,null,null,null,null,null,0,null,null,0,{"$error":"#DIV/0!"},null,0]
[null,null,null,null,null,null,null,null,0,null,null,0,{"$error":"#DIV/0!"},null,0]
[null,null,null,null,null,null,null,null,0,null,null,0,{"$error":"#DIV/0!"},null,0]
[null,null,null,null,null,null,null,null,0,null,null,0,{"$error":"#DIV/0!"},null,0]
[null,null,null,null,null,null,null,null,0,null,null,0,{"$error":"#DIV/0!"},null,0]
[null,null,null,null,null,null,null,null,0,null,null,0,{"$error":"#DIV/0!"},null,0]
[null,null,null,null,null,null,null,null,0,null,null,0,{"$error":"#DIV/0!"},null,0]
[null,null,null,null,null,null,null,null,0,null,null,0,{"$error":"#DIV/0!"},null,0]
[null,null,null,null,null,null,null,null,0,null,null,0,{"$error":"#DIV/0!"},null,0]
[null,null,null,null,null,null,null,null,{"$f":"SUM(G153:H153)","v":0},null,null,0,{"$error":"#DIV/0!"},null,0]
[null,null,null,null,null,null,null,null,0,null,null,0,{"$error":"#DIV/0!"},null,0]
[null,null,null,null,null,null,null,null,0,null,null,0,{"$error":"#DIV/0!"},null,0]
[null,null,null,null,null,null,null,null,0,null,null,0,{"$error":"#DIV/0!"},null,0]
[null,null,null,null,null,null,null,null,0,null,null,0,{"$error":"#DIV/0!"},null,0]
[null,null,null,null,null,null,null,null,0,null,null,0,{"$error":"#DIV/0!"},null,0]
[null,null,null,null,null,null,null,null,0,null,null,0,{"$error":"#DIV/0!"},null,0]
[null,null,null,null,null,null,null,null,0,null,null,0,{"$error":"#DIV/0!"},null,0]
[null,null,null,null,null,null,null,null,0,null,null,0,{"$error":"#DIV/0!"},null,0]
[null,null,null,null,null,null,null,null,0,null,null,0,{"$error":"#DIV/0!"},null,0]
[null,null,null,null,null,null,null,null,0,null,null,0,{"$error":"#DIV/0!"},null,0]
[null,null,null,null,null,null,null,null,0,null,null,0,{"$error":"#DIV/0!"},null,0]
[null,null,null,null,null,null,null,null,0,null,null,0,{"$error":"#DIV/0!"},null,0]
[null,null,null,null,null,null,null,null,0,null,null,0,{"$error":"#DIV/0!"},null,0]
[null,null,null,null,null,null,null,null,0,null,null,0,{"$error":"#DIV/0!"},null,0]
[null,null,null,null,null,null,null,null,0,null,null,0,{"$error":"#DIV/0!"},null,0]
[null,null,null,null,null,null,null,null,0,null,null,0,{"$error":"#DIV/0!"},null,0]
[null,null,null,null,null,null,null,null,0,null,null,0,{"$error":"#DIV/0!"},null,0]
[null,null,null,null,null,null,null,null,0,null,null,0,{"$error":"#DIV/0!"},null,0]
[null,null,null,null,null,null,null,null,0,null,null,0,{"$error":"#DIV/0!"},null,0]
[null,null,null,null,null,null,null,null,0,null,null,0,{"$error":"#DIV/0!"},null,0]
[null,null,null,null,null,null,null,null,0,null,null,0,{"$error":"#DIV/0!"},null,0]
[null,null,null,null,null,null,null,null,0,null,null,0,{"$error":"#DIV/0!"},null,0]
[null,null,null,null,null,null,null,null,0,null,null,0,{"$error":"#DIV/0!"},null,0]
[null,null,null,null,null,null,null,null,0,null,null,0,{"$error":"#DIV/0!"},null,0]
[null,null,null,null,null,null,null,null,0,null,null,0,{"$error":"#DIV/0!"},null,0]
[null,null,null,null,null,null,null,null,0,null,null,0,{"$error":"#DIV/0!"},null,0]
[null,null,null,null,null,null,null,null,0,null,null,0,{"$error":"#DIV/0!"},null,0]
[null,null,null,null,null,null,null,null,0,null,null,0,{"$error":"#DIV/0!"},null,0]
[null,null,null,null,null,null,null,null,0,null,null,0,{"$error":"#DIV/0!"},null,0]
[null,null,null,null,null,null,null,null,0,null,null,0,{"$error":"#DIV/0!"},null,0]
[null,null,null,null,null,null,null,null,0,null,null,0,{"$error":"#DIV/0!"},null,0]
[null,null,null,null,null,null,null,null,0,null,null,0,{"$error":"#DIV/0!"},null,0]
[null,null,null,null,null,null,null,null,0,null,null,0,{"$error":"#DIV/0!"},null,0]
[null,null,null,null,null,null,null,null,0,null,null,0,{"$error":"#DIV/0!"},null,0]
[null,null,null,null,null,null,null,null,0,null,null,0,{"$error":"#DIV/0!"},null,0]
[null,null,null,null,null,null,null,null,0,null,null,0,{"$error":"#DIV/0!"},null,0]
[null,null,null,null,null,null,null,null,0,null,null,0,{"$error":"#DIV/0!"},null,0]
[null,null,null,null,null,null,null,null,0,null,null,0,{"$error":"#DIV/0!"},null,0]
[null,null,null,null,null,null,null,null,0,null,null,0,{"$error":"#DIV/0!"},null,0]
[null,null,null,null,null,null,null,null,0,null,null,0,{"$error":"#DIV/0!"},null,0]
[null,null,null,null,null,null,null,null,0,null,null,0,{"$error":"#DIV/0!"},null,0]
[null,null,null,null,null,null,null,null,0,null,null,0,{"$error":"#DIV/0!"},null,0]
[null,null,null,null,null,null,null,null,0,null,null,0,{"$error":"#DIV/0!"},null,0]
[null,null,null,null,null,null,null,null,0,null,null,0,{"$error":"#DIV/0!"},null,0]
[null,null,null,null,null,null,null,null,0,null,null,0,{"$error":"#DIV/0!"},null,0]
[null,null,null,null,null,null,null,null,0,null,null,0,{"$error":"#DIV/0!"},null,0]
[null,null,null,null,null,null,null,null,0,null,null,0,{"$error":"#DIV/0!"},null,0]
[null,null,null,null,null,null,null,null,0,null,null,0,{"$error":"#DIV/0!"},null,0]
[null,null,null,null,null,null,null,null,0,null,null,0,{"$error":"#DIV/0!"},null,0]
[null,null,null,null,null,null,null,null,0,null,null,0,{"$error":"#DIV/0!"},null,0]
[null,null,null,null,null,null,null,null,0,null,null,0,{"$error":"#DIV/0!"},null,0]
[null,null,null,null,null,null,null,null,0,null,null,0,{"$error":"#DIV/0!"},null,{"$f":"IF(K205=\"Yes\",H205*1.6,H205)","v":0}]
[null,null,null,null,null,null,null,null,0,null,null,{"$f":"IF(O206>=F206,F206,IF(O206<F206,O206))","v":0},{"$error":"#DIV/0!"},null,0]
[null,null,null,null,null,null,null,null,0,null,null,0,{"$f":"IF(K207=\"Yes\",L207/F207,H207/F207)","v":{"$error":"#DIV/0!"}},null,0]
[null,null,null,null,null,null,null,null,0,null,null,0,{"$error":"#DIV/0!"},null,0]
[null,null,null,null,null,null,null,null,0,null,null,0,{"$error":"#DIV/0!"},null,0]
[null,null,null,null,null,null,null,null,0,null,null,0,{"$error":"#DIV/0!"},null,0]
[null,null,null,null,null,null,null,null,0,null,null,0,{"$error":"#DIV/0!"},null,0]
[null,null,null,null,null,null,null,null,0,null,null,0,{"$error":"#DIV/0!"},null,0]
[null,null,null,null,null,null,null,null,0,null,null,0,{"$error":"#DIV/0!"},null,0]
[null,null,null,null,null,null,null,null,0,null,null,0,{"$error":"#DIV/0!"},null,0]
[null,null,null,null,null,null,null,null,0,null,null,0,{"$error":"#DIV/0!"},null,0]
[null,null,null,null,null,null,null,null,0,null,null,0,{"$error":"#DIV/0!"},null,0]
[null,null,null,null,null,null,null,null,{"$f":"SUM(G217:H217)","v":0},null,null,0,{"$error":"#DIV/0!"},null,0]
[null,null,null,null,null,null,null,null,0,null,null,0,{"$error":"#DIV/0!"},null,0]
[null,null,null,null,null,null,null,null,0,null,null,0,{"$error":"#DIV/0!"},null,0]
[null,null,null,null,null,null,null,null,0,null,null,0,{"$error":"#DIV/0!"},null,0]
[null,null,null,null,null,null,null,null,0,null,null,0,{"$error":"#DIV/0!"},null,0]
[null,null,null,null,null,null,null,null,0,null,null,0,{"$error":"#DIV/0!"},null,0]
[null,null,null,null,null,null,null,null,0,null,null,0,{"$error":"#DIV/0!"},null,0]
[null,null,null,null,null,null,null,null,0,null,null,0,{"$error":"#DIV/0!"},null,0]
[null,null,null,null,null,null,null,null,0,null,null,0,{"$error":"#DIV/0!"},null,0]
[null,null,null,null,null,null,null,null,0,null,null,0,{"$error":"#DIV/0!"},null,0]
[null,null,null,null,null,null,null,null,0,null,null,0,{"$error":"#DIV/0!"},null,0]
[null,null,null,null,null,null,null,null,0,null,null,0,{"$error":"#DIV/0!"},null,0]
[null,null,null,null,null,null,null,null,0,null,null,0,{"$error":"#DIV/0!"},null,0]
[null,null,null,null,null,null,null,null,0,null,null,0,{"$error":"#DIV/0!"},null,0]
[null,null,null,null,null,null,null,null,0,null,null,0,{"$error":"#DIV/0!"},null,0]
[null,null,null,null,null,null,null,null,0,null,null,0,{"$error":"#DIV/0!"},null,0]
[null,null,null,null,null,null,null,null,0,null,null,0,{"$error":"#DIV/0!"},null,0]
[null,null,null,null,null,null,null,null,0,null,null,0,{"$error":"#DIV/0!"},null,0]
[null,null,null,null,null,null,null,null,0,null,null,0,{"$error":"#DIV/0!"},null,0]
[null,null,null,null,null,null,null,null,0,null,null,0,{"$error":"#DIV/0!"},null,0]
[null,null,null,null,null,null,null,null,0,null,null,0,{"$error":"#DIV/0!"},null,0]
[null,null,null,null,null,null,null,null,0,null,null,0,{"$error":"#DIV/0!"},null,0]
[null,null,null,null,null,null,null,null,0,null,null,0,{"$error":"#DIV/0!"},null,0]
[null,null,null,null,null,null,null,null,0,null,null,0,{"$error":"#DIV/0!"},null,0]
[null,null,null,null,null,null,null,null,0,null,null,0,{"$error":"#DIV/0!"},null,0]
[null,null,null,null,null,null,null,null,0,null,null,0,{"$error":"#DIV/0!"},null,0]
[null,null,null,null,null,null,null,null,0,null,null,0,{"$error":"#DIV/0!"},null,0]
[null,null,null,null,null,null,null,null,0,null,null,0,{"$error":"#DIV/0!"},null,0]
[null,null,null,null,null,null,null,null,0,null,null,0,{"$error":"#DIV/0!"},null,0]
[null,null,null,null,null,null,null,null,0,null,null,0,{"$error":"#DIV/0!"},null,0]
[null,null,null,null,null,null,null,null,0,null,null,0,{"$error":"#DIV/0!"},null,0]
[null,null,null,null,null,null,null,null,0,null,null,0,{"$error":"#DIV/0!"},null,0]
[null,null,null,null,null,null,null,null,0,null,null,0,{"$error":"#DIV/0!"},null,0]
[null,null,null,null,null,null,null,null,0,null,null,0,{"$error":"#DIV/0!"},null,0]
[null,null,null,null,null,null,null,null,0,null,null,0,{"$error":"#DIV/0!"},null,0]
[null,null,null,null,null,null,null,null,0,null,null,0,{"$error":"#DIV/0!"},null,0]
[null,null,null,null,null,null,null,null,0,null,null,0,{"$error":"#DIV/0!"},null,0]
[null,null,null,null,null,null,null,null,0,null,null,0,{"$error":"#DIV/0!"},null,0]
[null,null,null,null,null,null,null,null,0,null,null,0,{"$error":"#DIV/0!"},null,0]
[null,null,null,null,null,null,null,null,0,null,null,0,{"$error":"#DIV/0!"},null,0]
[null,null,null,null,null,null,null,null,0,null,null,0,{"$error":"#DIV/0!"},null,0]
[null,null,null,null,null,null,null,null,0,null,null,0,{"$error":"#DIV/0!"},null,0]
[null,null,null,null,null,null,null,null,0,null,null,0,{"$error":"#DIV/0!"},null,0]
[null,null,null,null,null,null,null,null,0,null,null,0,{"$error":"#DIV/0!"},null,0]
[null,null,null,null,null,null,null,null,0,null,null,0,{"$error":"#DIV/0!"},null,0]
[null,null,null,null,null,null,null,null,0,null,null,0,{"$error":"#DIV/0!"},null,0]
[null,null,null,null,null,null,null,null,0,null,null,0,{"$error":"#DIV/0!"},null,0]
[null,null,null,null,null,null,null,null,0,null,null,0,{"$error":"#DIV/0!"},null,0]
[null,null,null,null,null,null,null,null,0,null,null,0,{"$error":"#DIV/0!"},null,0]
[null,null,null,null,null,null,null,null,0,null,null,0,{"$error":"#DIV/0!"},null,0]
[null,null,null,null,null,null,null,null,0,null,null,0,{"$error":"#DIV/0!"},null,0]
[null,null,null,null,null,null,null,null,0,null,null,0,{"$error":"#DIV/0!"},null,0]
[null,null,null,null,null,null,null,null,0,null,null,0,{"$error":"#DIV/0!"},null,{"$f":"IF(K269=\"Yes\",H269*1.6,H269)","v":0}]
[null,null,null,null,null,null,null,null,0,null,null,{"$f":"IF(O270>=F270,F270,IF(O270<F270,O270))","v":0},{"$error":"#DIV/0!"},null,0]
[null,null,null,null,null,null,null,null,0,null,null,0,{"$f":"IF(K271=\"Yes\",L271/F271,H271/F271)","v":{"$error":"#DIV/0!"}},null,0]
[null,null,null,null,null,null,null,null,0,null,null,0,{"$error":"#DIV/0!"},null,0]
[null,null,null,null,null,null,null,null,0,null,null,0,{"$error":"#DIV/0!"},null,0]
[null,null,null,null,null,null,null,null,0,null,null,0,{"$error":"#DIV/0!"},null,0]
[null,null,null,null,null,null,null,null,0,null,null,0,{"$error":"#DIV/0!"},null,0]
[null,null,null,null,null,null,null,null,0,null,null,0,{"$error":"#DIV/0!"},null,0]
[null,null,null,null,null,null,null,null,0,null,null,0,{"$error":"#DIV/0!"},null,0]
[null,null,null,null,"Total",{"$f":"SUM(F78:F277)","v":14307},{"$f":"SUM(G78:G277)","v":11},{"$f":"SUM(H78:H277)","v":4668},{"$f":"SUM(I78:I277)","v":4679},null,null,{"$f":"SUM(L78:L277)","v":4668}]
[]
[null,null,null,null,null,null,null,null,"Divisionwide Average",null,null,null,{"$f":"IF(ISERROR(L278/F278),0,L278/F278)","v":0.32627385196057873}]
["Page 41"]
[null,null,null,null,"School Division:",null,{"$f":"'Narrative & Detail Budget'!$A$15","v":"ALBEMARLE COUNTY PUBLIC SCHOOLS"},null,null,null,"Division Number:",null,{"$f":"'Narrative & Detail Budget'!I15","v":2}]
["Grade Span Averages"]
[]
[null,null,null,"Grade Spans",null,null,null,null,"Grade Span Average"]
[null,null,null,null,"PK - PK",null,null,null,null,{"$f":"IF(ISERROR(SUMIF($D$78:$D$277,E286,$L$78:$L$277)/SUMIF($D$78:$D$277,E286,$F$78:$F$277)),\"\",SUMIF($D$78:$D$277,E286,$L$78:$L$277)/SUMIF($D$78:$D$277,E286,$F$78:$F$277))","v":""}]
[null,null,null,null,"PK - KG",null,null,null,null,{"$f":"IF(ISERROR(SUMIF($D$78:$D$277,E287,$L$78:$L$277)/SUMIF($D$78:$D$277,E287,$F$78:$F$277)),\"\",SUMIF($D$78:$D$277,E287,$L$78:$L$277)/SUMIF($D$78:$D$277,E287,$F$78:$F$277))","v":""}]
[null,null,null,null,"PK - 01",null,null,null,null,""]
[null,null,null,null,"PK - 02",null,null,null,null,""]
[null,null,null,null,"PK - 03",null,null,null,null,""]
[null,null,null,null,"PK - 04",null,null,null,null,""]
[null,null,null,null,"PK - 05",null,null,null,null,0.37712519319938176]
[null,null,null,null,"PK - 06",null,null,null,null,""]
[null,null,null,null,"PK - 07",null,null,null,null,""]
[null,null,null,null,"PK - 08",null,null,null,null,""]
[null,null,null,null,"PK - 12",null,null,null,null,""]
[null,null,null,null,"KG - 01",null,null,null,null,""]
[null,null,null,null,"KG - 02",null,null,null,null,""]
[null,null,null,null,"KG - 03",null,null,null,null,""]
[null,null,null,null,"KG - 04",null,null,null,null,""]
[null,null,null,null,"KG - 05",null,null,null,null,0.23267838676318511]
[null,null,null,null,"KG - 06",null,null,null,null,""]
[null,null,null,null,"KG - 07",null,null,null,null,""]
[null,null,null,null,"KG - 08",null,null,null,null,""]
[null,null,null,null,"KG - 12",null,null,null,null,""]
[null,null,null,null,"01 - 05",null,null,null,null,""]
[null,null,null,null,"01 - 07",null,null,null,null,""]
[null,null,null,null,"01 - 08",null,null,null,null,""]
[null,null,null,null,"02 - 04",null,null,null,null,""]
[null,null,null,null,"02 - 05",null,null,null,null,""]
[null,null,null,null,"02 - 06",null,null,null,null,""]
[null,null,null,null,"03 - 04",null,null,null,null,""]
[null,null,null,null,"03 - 05",null,null,null,null,""]
[null,null,null,null,"03 - 06",null,null,null,null,""]
[null,null,null,null,"03 - 07",null,null,null,null,""]
[null,null,null,null,"03 - 08",null,null,null,null,""]
[null,null,null,null,"04 - 05",null,null,null,null,""]
[null,null,null,null,"04 - 06",null,null,null,null,""]
[null,null,null,null,"04 - 07",null,null,null,null,""]
[null,null,null,null,"04 - 08",null,null,null,null,""]
[null,null,null,null,"05 - 06",null,null,null,null,""]
[null,null,null,null,"05 - 07",null,null,null,null,""]
[null,null,null,null,"05 - 08",null,null,null,null,""]
[null,null,null,null,"06 - 06",null,null,null,null,""]
[null,null,null,null,"06 - 07",null,null,null,null,""]
[null,null,null,null,"06 - 08",null,null,null,null,0.33684546615581096]
[null,null,null,null,"06 - 12",null,null,null,null,""]
[null,null,null,null,"07 - 08",null,null,null,null,""]
[null,null,null,null,"07 - 09",null,null,null,null,""]
[null,null,null,null,"07 - 11",null,null,null,null,""]
[null,null,null,null,"07 - 12",null,null,null,null,""]
[null,null,null,null,"08 - 08",null,null,null,null,""]
[null,null,null,null,"08 - 09",null,null,null,null,""]
[null,null,null,null,"08 - 12",null,null,null,null,""]
[null,null,null,null,"09 - 10",null,null,null,null,""]
[null,null,null,null,"09 - 11",null,null,null,null,""]
[null,null,null,null,"09 - 12",null,null,null,null,0.27183580387685291]
[null,null,null,null,"10 - 12",null,null,null,null,""]
[null,null,null,null,"11 - 12",null,null,null,null,""]
["Page 42"]

{"sheet":"35% and Above Low-Income","index":5,"n_rows":255,"n_cols":26,"rows_kept":255,"cut":false,"hidden":false,"merged":[[250,16,250,17],[250,18,250,19],[250,20,250,21],[250,22,250,23],[251,16,251,17],[251,18,251,19],[251,20,251,21],[251,22,251,23],[248,16,248,17],[248,18,248,19],[248,20,248,21],[248,22,248,23],[249,16,249,17],[249,18,249,19],[249,20,249,21],[249,22,249,23],[254,0,254,24],[252,16,252,17],[252,18,252,19],[252,20,252,21],[252,22,252,23],[253,16,253,17],[253,18,253,19],[253,20,253,21],[253,22,253,23],[246,16,246,17],[246,18,246,19],[246,20,246,21],[246,22,246,23],[247,16,247,17],[247,18,247,19],[247,20,247,21],[247,22,247,23],[244,16,244,17],[244,18,244,19],[244,20,244,21],[244,22,244,23],[245,16,245,17],[245,18,245,19],[245,20,245,21],[245,22,245,23],[242,16,242,17],[242,18,242,19],[242,20,242,21],[242,22,242,23],[243,16,243,17],[243,18,243,19],[243,20,243,21],[243,22,243,23],[240,16,240,17],[240,18,240,19],[240,20,240,21],[240,22,240,23],[241,16,241,17],[241,18,241,19],[241,20,241,21],[241,22,241,23],[238,16,238,17],[238,18,238,19],[238,20,238,21],[238,22,238,23],[239,16,239,17],[239,18,239,19],[239,20,239,21],[239,22,239,23],[236,16,236,17],[236,18,236,19],[236,20,236,21],[236,22,236,23],[237,16,237,17],[237,18,237,19],[237,20,237,21],[237,22,237,23],[234,16,234,17],[234,18,234,19],[234,20,234,21],[234,22,234,23],[235,16,235,17],[235,18,235,19],[235,20,235,21],[235,22,235,23],[232,16,232,17],[232,18,232,19],[232,20,232,21],[232,22,232,23],[233,16,233,17],[233,18,233,19],[233,20,233,21],[233,22,233,23],[230,16,230,17],[230,18,230,19],[230,20,230,21],[230,22,230,23],[231,16,231,17],[231,18,231,19],[231,20,231,21],[231,22,231,23],[228,16,228,17],[228,18,228,19],[228,20,228,21],[228,22,228,23],[229,16,229,17],[229,18,229,19],[229,20,229,21],[229,22,229,23],[226,16,226,17],[226,18,226,19],[226,20,226,21],[226,22,226,23],[227,16,227,17],[227,18,227,19],[227,20,227,21],[227,22,227,23],[224,16,224,17],[224,18,224,19],[224,20,224,21],[224,22,224,23],[225,16,225,17],[225,18,225,19],[225,20,225,21],[225,22,225,23],[222,16,222,17],[222,18,222,19],[222,20,222,21],[222,22,222,23],[223,16,223,17],[223,18,223,19],[223,20,223,21],[223,22,223,23],[220,16,220,17],[220,18,220,19],[220,20,220,21],[220,22,220,23],[221,16,221,17],[221,18,221,19],[221,20,221,21],[221,22,221,23],[218,16,218,17],[218,18,218,19],[218,20,218,21],[218,22,218,23],[219,16,219,17],[219,18,219,19],[219,20,219,21],[219,22,219,23],[216,16,216,17],[216,18,216,19],[216,20,216,21],[216,22,216,23],[217,16,217,17],[217,18,217,19],[217,20,217,21],[217,22,217,23],[214,16,214,17],[214,18,214,19],[214,20,214,21],[214,22,214,23],[215,16,215,17],[215,18,215,19],[215,20,215,21],[215,22,215,23],[212,16,212,17],[212,18,212,19],[212,20,212,21],[212,22,212,23],[213,16,213,17],[213,18,213,19],[213,20,213,21],[213,22,213,23],[210,16,210,17],[210,18,210,19],[210,20,210,21],[210,22,210,23],[211,16,211,17],[211,18,211,19],[211,20,211,21],[211,22,211,23],[208,16,208,17],[208,18,208,19],[208,20,208,21],[208,22,208,23],[209,16,209,17],[209,18,209,19],[209,20,209,21],[209,22,209,23],[206,16,206,17],[206,18,206,19],[206,20,206,21],[206,22,206,23],[207,16,207,17],[207,18,207,19],[207,20,207,21],[207,22,207,23],[204,16,204,17],[204,18,204,19],[204,20,204,21],[204,22,204,23],[205,16,205,17],[205,18,205,19],[205,20,205,21],[205,22,205,23],[202,16,202,17],[202,18,202,19],[202,20,202,21],[202,22,202,23],[203,16,203,17],[203,18,203,19],[203,20,203,21],[203,22,203,23],[200,16,200,17],[200,18,200,19],[200,20,200,21],[200,22,200,23],[201,16,201,17],[201,18,201,19],[201,20,201,21],[201,22,201,23],[198,16,198,17],[198,18,198,19],[198,20,198,21],[198,22,198,23],[199,16,199,17],[199,18,199,19],[199,20,199,21],[199,22,199,23],[196,16,196,17],[196,18,196,19],[196,20,196,21],[196,22,196,23],[197,16,197,17],[197,18,197,19],[197,20,197,21],[197,22,197,23],[194,16,194,17],[194,18,194,19],[194,20,194,21],[194,22,194,23],[195,16,195,17],[195,18,195,19],[195,20,195,21],[195,22,195,23],[192,16,192,17],[192,18,192,19],[192,20,192,21],[192,22,192,23],[193,16,193,17],[193,18,193,19],[193,20,193,21],[193,22,193,23],[190,16,190,17],[190,18,190,19],[190,20,190,21],[190,22,190,23],[191,16,191,17],[191,18,191,19],[191,20,191,21],[191,22,191,23],[188,16,188,17],[188,18,188,19],[188,20,188,21],[188,22,188,23],[189,16,189,17],[189,18,189,19],[189,20,189,21],[189,22,189,23],[186,16,186,17],[186,18,186,19],[186,20,186,21],[186,22,186,23],[187,16,187,17],[187,18,187,19],[187,20,187,21],[187,22,187,23],[184,16,184,17],[184,18,184,19],[184,20,184,21],[184,22,184,23],[185,16,185,17],[185,18,185,19],[185,20,185,21],[185,22,185,23],[182,16,182,17],[182,18,182,19],[182,20,182,21],[182,22,182,23],[183,16,183,17],[183,18,183,19],[183,20,183,21],[183,22,183,23],[180,16,180,17],[180,18,180,19],[180,20,180,21],[180,22,180,23],[181,16,181,17],[181,18,181,19],[181,20,181,21],[181,22,181,23],[178,16,178,17],[178,18,178,19],[178,20,178,21],[178,22,178,23],[179,16,179,17],[179,18,179,19],[179,20,179,21],[179,22,179,23],[176,16,176,17],[176,18,176,19],[176,20,176,21],[176,22,176,23],[177,16,177,17],[177,18,177,19],[177,20,177,21],[177,22,177,23],[174,16,174,17],[174,18,174,19],[174,20,174,21],[174,22,174,23],[175,16,175,17],[175,18,175,19],[175,20,175,21],[175,22,175,23],[172,16,172,17],[172,18,172,19],[172,20,172,21],[172,22,172,23],[173,16,173,17],[173,18,173,19],[173,20,173,21],[173,22,173,23],[170,16,170,17],[170,18,170,19],[170,20,170,21],[170,22,170,23],[171,16,171,17],[171,18,171,19],[171,20,171,21],[171,22,171,23],[168,16,168,17],[168,18,168,19],[168,20,168,21],[168,22,168,23],[169,16,169,17],[169,18,169,19],[169,20,169,21],[169,22,169,23],[166,16,166,17],[166,18,166,19],[166,20,166,21],[166,22,166,23],[167,16,167,17],[167,18,167,19],[167,20,167,21],[167,22,167,23],[164,16,164,17],[164,18,164,19],[164,20,164,21],[164,22,164,23],[165,16,165,17],[165,18,165,19],[165,20,165,21],[165,22,165,23],[162,16,162,17],[162,18,162,19],[162,20,162,21],[162,22,162,23],[163,16,163,17],[163,18,163,19],[163,20,163,21],[163,22,163,23],[160,16,160,17],[160,18,160,19],[160,20,160,21],[160,22,160,23],[161,16,161,17],[161,18,161,19],[161,20,161,21],[161,22,161,23],[158,16,158,17],[158,18,158,19],[158,20,158,21],[158,22,158,23],[159,16,159,17],[159,18,159,19],[159,20,159,21],[159,22,159,23],[156,16,156,17],[156,18,156,19],[156,20,156,21],[156,22,156,23],[157,16,157,17],[157,18,157,19],[157,20,157,21],[157,22,157,23],[154,16,154,17],[154,18,154,19],[154,20,154,21],[154,22,154,23],[155,16,155,17],[155,18,155,19],[155,20,155,21],[155,22,155,23],[152,16,152,17],[152,18,152,19],[152,20,152,21],[152,22,152,23],[153,16,153,17],[153,18,153,19],[153,20,153,21],[153,22,153,23],[150,16,150,17],[150,18,150,19],[150,20,150,21],[150,22,150,23],[151,16,151,17],[151,18,151,19],[151,20,151,21],[151,22,151,23],[148,16,148,17],[148,18,148,19],[148,20,148,21],[148,22,148,23],[149,16,149,17],[149,18,149,19],[149,20,149,21],[149,22,149,23],[146,16,146,17],[146,18,146,19],[146,20,146,21],[146,22,146,23],[147,16,147,17],[147,18,147,19],[147,20,147,21],[147,22,147,23],[144,16,144,17],[144,18,144,19],[144,20,144,21],[144,22,144,23],[145,16,145,17],[145,18,145,19],[145,20,145,21],[145,22,145,23],[142,16,142,17],[142,18,142,19],[142,20,142,21],[142,22,142,23],[143,16,143,17],[143,18,143,19],[143,20,143,21],[143,22,143,23],[140,16,140,17],[140,18,140,19],[140,20,140,21],[140,22,140,23],[141,16,141,17],[141,18,141,19],[141,20,141,21],[141,22,141,23],[138,16,138,17],[138,18,138,19],[138,20,138,21],[138,22,138,23],[139,16,139,17],[139,18,139,19],[139,20,139,21],[139,22,139,23],[136,16,136,17],[136,18,136,19],[136,20,136,21],[136,22,136,23],[137,16,137,17],[137,18,137,19],[137,20,137,21],[137,22,137,23],[134,16,134,17],[134,18,134,19],[134,20,134,21],[134,22,134,23],[135,16,135,17],[135,18,135,19],[135,20,135,21],[135,22,135,23],[132,16,132,17],[132,18,132,19],[132,20,132,21],[132,22,132,23],[133,16,133,17],[133,18,133,19],[133,20,133,21],[133,22,133,23],[130,16,130,17],[130,18,130,19],[130,20,130,21],[130,22,130,23],[131,16,131,17],[131,18,131,19],[131,20,131,21],[131,22,131,23],[128,16,128,17],[128,18,128,19],[128,20,128,21],[128,22,128,23],[129,16,129,17],[129,18,129,19],[129,20,129,21],[129,22,129,23],[126,16,126,17],[126,18,126,19],[126,20,126,21],[126,22,126,23],[127,16,127,17],[127,18,127,19],[127,20,127,21],[127,22,127,23],[124,16,124,17],[124,18,124,19],[124,20,124,21],[124,22,124,23],[125,16,125,17],[125,18,125,19],[125,20,125,21],[125,22,125,23],[122,16,122,17],[122,18,122,19],[122,20,122,21],[122,22,122,23],[123,16,123,17],[123,18,123,19],[123,20,123,21],[123,22,123,23],[120,16,120,17],[120,18,120,19],[120,20,120,21],[120,22,120,23],[121,16,121,17],[121,18,121,19],[121,20,121,21],[121,22,121,23],[118,16,118,17],[118,18,118,19],[118,20,118,21],[118,22,118,23],[119,16,119,17],[119,18,119,19],[119,20,119,21],[119,22,119,23],[116,16,116,17],[116,18,116,19],[116,20,116,21],[116,22,116,23],[117,16,117,17],[117,18,117,19],[117,20,117,21],[117,22,117,23],[114,16,114,17],[114,18,114,19],[114,20,114,21],[114,22,114,23],[115,16,115,17],[115,18,115,19],[115,20,115,21],[115,22,115,23],[112,16,112,17],[112,18,112,19],[112,20,112,21],[112,22,112,23],[113,16,113,17],[113,18,113,19],[113,20,113,21],[113,22,113,23],[110,16,110,17],[110,18,110,19],[110,20,110,21],[110,22,110,23],[111,16,111,17],[111,18,111,19],[111,20,111,21],[111,22,111,23],[108,16,108,17],[108,18,108,19],[108,20,108,21],[108,22,108,23],[109,16,109,17],[109,18,109,19],[109,20,109,21],[109,22,109,23],[106,16,106,17],[106,18,106,19],[106,20,106,21],[106,22,106,23],[107,16,107,17],[107,18,107,19],[107,20,107,21],[107,22,107,23],[104,16,104,17],[104,18,104,19],[104,20,104,21],[104,22,104,23],[105,16,105,17],[105,18,105,19],[105,20,105,21],[105,22,105,23],[102,16,102,17],[102,18,102,19],[102,20,102,21],[102,22,102,23],[103,16,103,17],[103,18,103,19],[103,20,103,21],[103,22,103,23],[100,16,100,17],[100,18,100,19],[100,20,100,21],[100,22,100,23],[101,16,101,17],[101,18,101,19],[101,20,101,21],[101,22,101,23],[98,16,98,17],[98,18,98,19],[98,20,98,21],[98,22,98,23],[99,16,99,17],[99,18,99,19],[99,20,99,21],[99,22,99,23],[96,16,96,17],[96,18,96,19],[96,20,96,21],[96,22,96,23],[97,16,97,17],[97,18,97,19],[97,20,97,21],[97,22,97,23],[94,16,94,17],[94,18,94,19],[94,20,94,21],[94,22,94,23],[95,16,95,17],[95,18,95,19],[95,20,95,21],[95,22,95,23],[92,16,92,17],[92,18,92,19],[92,20,92,21],[92,22,92,23],[93,16,93,17],[93,18,93,19],[93,20,93,21],[93,22,93,23],[90,16,90,17],[90,18,90,19],[90,20,90,21],[90,22,90,23],[91,16,91,17],[91,18,91,19],[91,20,91,21],[91,22,91,23],[88,16,88,17],[88,18,88,19],[88,20,88,21],[88,22,88,23],[89,16,89,17],[89,18,89,19],[89,20,89,21],[89,22,89,23],[86,16,86,17],[86,18,86,19],[86,20,86,21],[86,22,86,23],[87,16,87,17],[87,18,87,19],[87,20,87,21],[87,22,87,23],[84,16,84,17],[84,18,84,19],[84,20,84,21],[84,22,84,23],[85,16,85,17],[85,18,85,19],[85,20,85,21],[85,22,85,23],[82,16,82,17],[82,18,82,19],[82,20,82,21],[82,22,82,23],[83,16,83,17],[83,18,83,19],[83,20,83,21],[83,22,83,23],[80,16,80,17],[80,18,80,19],[80,20,80,21],[80,22,80,23],[81,16,81,17],[81,18,81,19],[81,20,81,21],[81,22,81,23],[78,16,78,17],[78,18,78,19],[78,20,78,21],[78,22,78,23],[79,16,79,17],[79,18,79,19],[79,20,79,21],[79,22,79,23],[76,16,76,17],[76,18,76,19],[76,20,76,21],[76,22,76,23],[77,16,77,17],[77,18,77,19],[77,20,77,21],[77,22,77,23],[74,16,74,17],[74,18,74,19],[74,20,74,21],[74,22,74,23],[75,16,75,17],[75,18,75,19],[75,20,75,21],[75,22,75,23],[72,16,72,17],[72,18,72,19],[72,20,72,21],[72,22,72,23],[73,16,73,17],[73,18,73,19],[73,20,73,21],[73,22,73,23],[70,16,70,17],[70,18,70,19],[70,20,70,21],[70,22,70,23],[71,16,71,17],[71,18,71,19],[71,20,71,21],[71,22,71,23],[68,16,68,17],[68,18,68,19],[68,20,68,21],[68,22,68,23],[69,16,69,17],[69,18,69,19],[69,20,69,21],[69,22,69,23],[66,16,66,17],[66,18,66,19],[66,20,66,21],[66,22,66,23],[67,16,67,17],[67,18,67,19],[67,20,67,21],[67,22,67,23],[64,16,64,17],[64,18,64,19],[64,20,64,21],[64,22,64,23],[65,16,65,17],[65,18,65,19],[65,20,65,21],[65,22,65,23],[62,16,62,17],[62,18,62,19],[62,20,62,21],[62,22,62,23],[63,16,63,17],[63,18,63,19],[63,20,63,21],[63,22,63,23],[60,16,60,17],[60,18,60,19],[60,20,60,21],[60,22,60,23],[61,16,61,17],[61,18,61,19],[61,20,61,21],[61,22,61,23],[58,16,58,17],[58,18,58,19],[58,20,58,21],[58,22,58,23],[59,16,59,17],[59,18,59,19],[59,20,59,21],[59,22,59,23],[56,16,56,17],[56,18,56,19],[56,20,56,21],[56,22,56,23],[57,16,57,17],[57,18,57,19],[57,20,57,21],[57,22,57,23],[54,16,54,17],[54,18,54,19],[54,20,54,21],[54,22,54,23],[55,16,55,17],[55,18,55,19],[55,20,55,21],[55,22,55,23],[52,16,52,17],[52,18,52,19],[52,20,52,21],[52,22,52,23],[53,18,53,21],[53,22,53,23],[45,5,45,6],[45,8,47,10],[45,12,46,14],[50,22,50,23],[51,16,51,17],[51,18,51,19],[51,20,51,21],[51,22,51,23],[36,3,36,5],[41,5,41,6],[43,5,43,6],[44,8,44,10],[44,12,44,14],[44,16,44,17],[34,0,34,9],[34,13,34,15],[34,19,34,21],[35,0,35,15],[35,19,35,21],[31,0,31,9],[31,10,34,12],[31,13,31,15],[31,16,31,18],[32,0,32,9],[32,13,32,15],[33,0,33,9],[33,13,33,15],[30,1,30,9],[30,10,30,12],[30,16,30,18],[25,0,30,0],[28,19,28,21],[29,1,29,9],[29,10,29,12],[29,16,29,18],[33,19,33,21],[25,1,25,9],[25,10,25,12],[26,1,26,9],[26,10,26,12],[26,13,26,15],[27,1,27,9],[22,1,22,9],[22,13,22,15],[23,1,23,9],[23,13,23,15],[27,10,27,12],[27,13,29,15],[28,1,28,9],[28,10,28,12],[19,13,19,15],[20,1,20,9],[20,13,20,15],[19,1,19,9],[20,19,20,21],[21,0,21,9],[21,13,21,15],[21,19,21,21],[22,0,23,0],[24,0,24,9],[24,19,24,21],[23,19,23,21],[2,0,2,15],[3,0,3,9],[3,10,3,12],[3,13,3,15],[4,0,4,9],[4,10,6,12],[4,13,4,15],[11,0,11,9],[11,13,11,15],[12,0,20,0],[12,1,12,9],[12,13,12,15],[17,1,17,9],[17,13,17,15],[17,19,17,21],[18,1,18,9],[1,0,1,15],[4,16,4,18],[4,19,4,21],[5,0,5,9],[5,13,5,15],[6,0,6,9],[6,13,9,15],[7,0,10,1],[7,2,7,9],[7,10,7,12],[8,2,8,9],[8,10,8,12],[9,2,9,9],[10,2,10,9],[10,13,10,15],[18,13,18,15],[18,19,18,21],[15,1,15,9],[15,13,15,15],[15,19,15,21],[16,1,16,9],[16,13,16,15],[16,19,16,21],[12,19,12,21],[13,1,13,9],[13,13,13,15],[14,1,14,9],[14,13,14,15],[14,19,14,21]]}
[null,null,null,null,"School Division:",null,{"$f":"'Narrative & Detail Budget'!$A$15","v":"ALBEMARLE COUNTY PUBLIC SCHOOLS"},null,null,null,null,null,"Division Number:",null,null,{"$f":"'Narrative & Detail Budget'!$I$15","v":2}]
["Q.  REQUIRED AND ALLOWABLE SET-ASIDES FOR DIVISIONS OPERATING TITLE I, PART A, BASIC PROGRAMS"]
[]
["DIVISION LEVEL:  IMPROVEMENT ACTIVITIES \n(Optional for Divisions with Comprehensive Support and Improvement and Targeted Support and Improvement)",null,null,null,null,null,null,null,null,null,"A",null,null,"B"]
["Up to 5 percent may be set aside for divisions to provide financial incentives and rewards to teachers who serve in schools identified for comprehensive support and improvement or targeted support and improvement activities for the purposes of attracting and retaining qualified and effective teachers."]
["Five percent of the total allocation representing the maximum allowable set-aside for Comprehensive Support and Improvement and Targeted Support and Improvement",null,null,null,null,null,null,null,null,null,null,null,null,{"$f":"SUM(('Narrative & Detail Budget'!N47)*0.05)","v":74749.400000000009}]
["Indicate amount of set-aside for each category, if applicable:"]
[null,null,"Set-Aside for Teacher Incentives and Rewards Comprehensive",null,null,null,null,null,null,null,0]
[null,null,"Set-Aside for Teacher Incentives and Rewards Targeted",null,null,null,null,null,null,null,0]
[null,null,null,null,null,null,null,null,null,null,0]
[null,null,"Total Amount Set-Aside for Comprehensive Support and Improvement and Targeted Support and Improvement",null,null,null,null,null,null,null,null,null,null,{"$f":"SUM(K8:M9)","v":0}]
["DIVISION LEVEL: PROGRAM ADMINISTRATION"]
[null,"(1000)  Personal Services - Nonsalary Differential",null,null,null,null,null,null,null,null,null,null,null,81091]
[null,"(1000)  Personal Services - Salary Differential",null,null,null,null,null,null,null,null,null,null,null,0]
[null,"(2000)  Employee Benefits (Fixed Charges)",null,null,null,null,null,null,null,null,null,null,null,29938]
[null,"(3000)  Purchased/Contracted Services"]
[null,"(4000)  Internal Services",null,null,null,null,null,null,null,null,null,null,null,0]
[null,"(4000)  Other Charges",null,null,null,null,null,null,null,null,null,null,null,0]
[null,"(5000)  Other Charges",null,null,null,null,null,null,null,null,null,null,null,0]
[null,"(6000)  Materials and Supplies",null,null,null,null,null,null,null,null,null,null,null,500]
[null,"(8000)  Capital Outlay",null,null,null,null,null,null,null,null,null,null,null,0]
[" Initiatives "]
[null,"Title I Early Childhood Program",null,null,null,null,null,null,null,null,null,null,null,205503]
[null,"Private School Services (as necessary; not applicable for bypass divisions) These funds are in addition to school-level allocations for private school services.",null,null,null,null,null,null,null,null,null,null,null,{"$f":"ROUND(Z53*SUM(K26),2)","v":9216.94}]
["Parent and Family Engagement (Required if allocation is $500,000 or more)"]
[null,"Amount of school division allocation ESEA funds (from Page 2):",null,null,null,null,null,null,null,null,{"$f":"SUM('Narrative & Detail Budget'!N47)","v":1494988}]
[null,"1 percent of allocation (This amount is calculated if school division receives $500,000 or more from Title I, Part A.)",null,null,null,null,null,null,null,null,{"$f":"ROUND(IF(K26>499999.99,0.01*K26,0),2)","v":14949.88},null,null,{"$f":"K27","v":14949.88}]
[null,"90 percent of 1 percent must be used at the school level",null,null,null,null,null,null,null,null,{"$f":"ROUND(0.9*SUM(K27),2)","v":13454.89}]
[null,"10 percent of 1 percent  is set aside by the school division for parent and family engagement initiatives",null,null,null,null,null,null,null,null,{"$f":"ROUND(0.1*SUM($K$27),2)","v":1494.99}]
[null,"Additional Parent and Family Engagement Funds",null,null,null,null,null,null,null,null,0]
[null,"Has the required parent and family engagement set aside been met?",null,null,null,null,null,null,null,null,{"$f":"IF(SUM('Budget Summary'!G44:K44)+(Transferability!D58)+Transferability!E58>=SUM(K28),\"Yes\",\"No - please review your entries.\")","v":"Yes"}]
["Homeless (as necessary based on needs identified on homeless tab, question 2)",null,null,null,null,null,null,null,null,null,null,null,null,92297]
["Foster Care (as necessary)",null,null,null,null,null,null,null,null,null,null,null,null,0]
["Neglected/Delinquent (as necessary)",null,null,null,null,null,null,null,null,null,null,null,null,0]
["School Division Set-Asides TOTAL (Feeds Box A on Allocation to Eligible Schools Page)",null,null,null,null,null,null,null,null,null,null,null,null,{"$f":"K30+SUM(N11:P34)","v":433495.82}]
["Page 43"]
[null,null,null,"School Division:",null,null,{"$f":"'Narrative & Detail Budget'!$A$15","v":"ALBEMARLE COUNTY PUBLIC SCHOOLS"},null,null,null,null,null,"Division Number:",null,null,{"$f":"'Narrative & Detail Budget'!$I$15","v":2}]
["TITLE I, PART A, ALLOCATION TO ELIGIBLE SCHOOLS"]
[null,null,null,null,null,null,null,"Low-Income Factor"]
[null,null,null,null,null,null,null,"35 percent and Above"]
["A.",null,null,null,null,null,null,null,"B."]
["Division’s Title I Allocation :",null,null,null,null,{"$f":"SUM('Narrative & Detail Budget'!N47)","v":1494988}]
[null,null,null,null,null,null,null,null,"*PER PUPIL EXPENDITURE CALCULATION"]
["Minus Set-Asides (if applicable):",null,null,null,null,{"$f":"$N$35","v":433495.82},null,null,"Step 1:"]
[null,null,null,null,null,null,null,null,{"$f":"$F$46","v":1061492.18},null,null,"¸",{"$f":"SUM(O53)","v":1612},null,null,"=",{"$f":"IF(ISERROR(I45/M45),0,I45/M45)","v":658.49390818858558}]
["Amount for Distribution to Schools:",null,null,null,null,{"$f":"SUM(F42)-SUM(F44)","v":1061492.18},null,null,"Amount for Distribution to Schools",null,null,null,"Low-Income Pupils in Public Schools Served        ",null,null,null,"Per Pupil Expenditure (PPE)"]
[]
[]
["Divisionwide Average From Low-Income Families",null,null,null,null,null,{"$f":"'Program Requirements'!M280","v":0.32627385196057873}]
[]
["C.   (1)",null,null,"(2)","(3)","(4)","(5)","(6)","(7)","(8)","(9)","(10)","(11)","(12)","(13)","(14)",null,"(15)",null,"(16)",null,"(17)","(18)",null,"(19)"]
["List of  schools from highest poverty to lowest",null,null,"Is School Served?   Yes or No","Grade Span of School","Targeted Assistance School? Yes or No","Schoolwide Program School? Yes or No","Comprehensive Support and improvement?  Yes or No","Targeted Support and Improvement?  Yes or No","Number of Title I, Part A FTE Teachers funded with 2020-2021 funds","Number of Title I, Part A FTE Teachers funded with  Prior Year funds","Number of Title I, Part A FTE Para-professionals funded with 2020-2021 funds","Number of Title I, Part A FTE Para-professionals funded with  Prior Year funds","Low-Income Private School Membership","Low-Income Public School Membership","Percent Low-Income ","Minimum School Allocation ",null,{"$f":"\"Distribution Balance:  \"&+SUM(F46)&\" from Box A\"","v":"Distribution Balance:  1061492.18 from Box A"},null,"School Reallocation Amount ",null,"School Allocation Total (Cols. 12 and 13)",null,"Adjusted PPE "]
["                                     TOTALS FOR DIVISION",null,null,null,null,null,null,null,null,{"$f":"SUM(J55:J254)","v":13.5},1.5,0,0,10,1612,null,{"$f":"SUM(Q55:R254)","v":1061492.18},null,{"$f":"F46","v":1061492.18},null,{"$f":"SUM(U55:V254)","v":0},null,{"$f":"SUM(W55:X254)","v":1061492.18},null,null,{"$f":"SUM(N53)/(N53+O53)","v":6.1652281134401974E-3}]
[null,null,null,null,null,null,null,null,null,null,"Yes","No",null,null,null,null,null,null,"Balance to Reallocate",null,null,null,{"$f":"SUM(F46-W53)","v":0}]
[{"$f":"IF(ISBLANK('Program Requirements'!A78),\"\",('Program Requirements'!A78))","v":"Mary Carr Greer Elementary"},null,null,null,{"$f":"IF(ISBLANK('Program Requirements'!D78),\"\",'Program Requirements'!D78)","v":"PK - 05"},null,null,null,null,null,null,null,null,{"$f":"IF(D55=\"Yes\",('Program Requirements'!G78),\"\")","v":""},{"$f":"IF(D55=\"Yes\",('Program Requirements'!L78),\"\")","v":""},{"$f":"IF(ISBLANK('Program Requirements'!M78),\"\",'Program Requirements'!M78)","v":0.74656188605108054},{"$f":"IF(D55=\"Yes\",(O55)*$Q$45,0)","v":0},null,{"$f":"F46-Q55","v":1061492.18},null,null,null,{"$f":"IF(SUM(U55)=0,SUM(Q55),IF(SUM(Q55,U55)=U55,\"ERROR\",SUM(Q55,U55)))","v":0},null,{"$f":"IF(D55=\"Yes\",SUM(W55)/SUM(O55),\"\")","v":""}]
[{"$f":"IF(ISBLANK('Program Requirements'!A78),\"\",('Program Requirements'!A78))","v":"Mary Carr Greer Elementary"},null,null,"Yes",{"$f":"IF(ISBLANK('Program Requirements'!D78),\"\",'Program Requirements'!D78)","v":"PK - 05"},"Yes",null,"No","No",3,0.5,null,null,{"$f":"IF(D56=\"Yes\",('Program Requirements'!G78),\"\")","v":5},{"$f":"IF(D56=\"Yes\",('Program Requirements'!L78),\"\")","v":380},{"$f":"IF(ISBLANK('Program Requirements'!M78),\"\",'Program Requirements'!M78)","v":0.74656188605108054},{"$f":"IF(D56=\"Yes\",(O56)*$Q$45,0)","v":250227.68511166252},null,{"$f":"F46-Q56","v":811264.49488833745},null,null,null,250227.68511166252,null,658.49390818858558]
[{"$f":"IF(ISBLANK('Program Requirements'!A79),\"\",('Program Requirements'!A79))","v":"Woodbrook Elementary"},null,null,"Yes",{"$f":"IF(ISBLANK('Program Requirements'!D79),\"\",'Program Requirements'!D79)","v":"PK - 05"},"Yes",null,"No","No",3,0.5,null,null,{"$f":"IF(D57=\"Yes\",('Program Requirements'!G79),\"\")","v":2},{"$f":"IF(D57=\"Yes\",('Program Requirements'!L79),\"\")","v":391},{"$f":"IF(ISBLANK('Program Requirements'!M79),\"\",'Program Requirements'!M79)","v":0.66837606837606833},{"$f":"IF(D57=\"Yes\",(O57)*$Q$45,0)","v":257471.11810173697},null,{"$f":"S56-Q57","v":553793.37678660045},null,null,null,257471.11810173697,null,658.49390818858558]
[{"$f":"IF(ISBLANK('Program Requirements'!A80),\"\",('Program Requirements'!A80))","v":"Jack Jouett Middle"},null,null,null,{"$f":"IF(ISBLANK('Program Requirements'!D80),\"\",'Program Requirements'!D80)","v":"06 - 08"},null,null,null,null,null,null,null,null,{"$f":"IF(D58=\"Yes\",('Program Requirements'!G80),\"\")","v":""},{"$f":"IF(D58=\"Yes\",('Program Requirements'!L80),\"\")","v":""},{"$f":"IF(ISBLANK('Program Requirements'!M80),\"\",'Program Requirements'!M80)","v":0.57943925233644855},0,null,{"$f":"S57-Q58","v":553793.37678660045},null,null,null,0,null,""]
[{"$f":"IF(ISBLANK('Program Requirements'!A81),\"\",('Program Requirements'!A81))","v":"Agnor-Hurt Elementary"},null,null,"Yes",{"$f":"IF(ISBLANK('Program Requirements'!D81),\"\",'Program Requirements'!D81)","v":"PK - 05"},"Yes",null,"No","No",2.5,null,null,null,{"$f":"IF(D59=\"Yes\",('Program Requirements'!G81),\"\")","v":2},{"$f":"IF(D59=\"Yes\",('Program Requirements'!L81),\"\")","v":270},{"$f":"IF(ISBLANK('Program Requirements'!M81),\"\",'Program Requirements'!M81)","v":0.55900621118012417},177793.35521091812,null,{"$f":"S58-Q59","v":376000.02157568233},null,null,null,177793.35521091812,null,658.49390818858558]
[{"$f":"IF(ISBLANK('Program Requirements'!A82),\"\",('Program Requirements'!A82))","v":"Red Hill Elementary"},null,null,"Yes",{"$f":"IF(ISBLANK('Program Requirements'!D82),\"\",'Program Requirements'!D82)","v":"PK - 05"},"Yes",null,"No","No",0.75,0.25,null,null,{"$f":"IF(D60=\"Yes\",('Program Requirements'!G82),\"\")","v":0},{"$f":"IF(D60=\"Yes\",('Program Requirements'!L82),\"\")","v":111},{"$f":"IF(ISBLANK('Program Requirements'!M82),\"\",'Program Requirements'!M82)","v":0.53883495145631066},73092.823808932997,null,302907.1977667493,null,null,null,73092.823808932997,null,658.49390818858558]
[{"$f":"IF(ISBLANK('Program Requirements'!A83),\"\",('Program Requirements'!A83))","v":"Scottsville Elementary"},null,null,"Yes",{"$f":"IF(ISBLANK('Program Requirements'!D83),\"\",'Program Requirements'!D83)","v":"PK - 05"},"Yes",null,"No","No",0.75,0.25,null,null,{"$f":"IF(D61=\"Yes\",('Program Requirements'!G83),\"\")","v":0},{"$f":"IF(D61=\"Yes\",('Program Requirements'!L83),\"\")","v":107},{"$f":"IF(ISBLANK('Program Requirements'!M83),\"\",'Program Requirements'!M83)","v":0.4692982456140351},70458.848176178653,null,232448.34959057067,null,null,null,70458.848176178653,null,658.49390818858558]
[{"$f":"IF(ISBLANK('Program Requirements'!A84),\"\",('Program Requirements'!A84))","v":"Paul H. Cale Elementary"},null,null,"Yes",{"$f":"IF(ISBLANK('Program Requirements'!D84),\"\",'Program Requirements'!D84)","v":"PK - 05"},"Yes",null,"No","No",3.5,null,null,null,{"$f":"IF(D62=\"Yes\",('Program Requirements'!G84),\"\")","v":1},{"$f":"IF(D62=\"Yes\",('Program Requirements'!L84),\"\")","v":353},{"$f":"IF(ISBLANK('Program Requirements'!M84),\"\",'Program Requirements'!M84)","v":0.45314505776636715},232448.34959057069,null,0,null,null,null,232448.34959057069,null,658.49390818858558]
[{"$f":"IF(ISBLANK('Program Requirements'!A85),\"\",('Program Requirements'!A85))","v":"Jackson P. Burley Middle"},null,null,null,{"$f":"IF(ISBLANK('Program Requirements'!D85),\"\",'Program Requirements'!D85)","v":"06 - 08"},null,null,null,null,null,null,null,null,{"$f":"IF(D63=\"Yes\",('Program Requirements'!G85),\"\")","v":""},{"$f":"IF(D63=\"Yes\",('Program Requirements'!L85),\"\")","v":""},{"$f":"IF(ISBLANK('Program Requirements'!M85),\"\",'Program Requirements'!M85)","v":0.44102564102564101},0,null,0,null,null,null,0,null,""]
[{"$f":"IF(ISBLANK('Program Requirements'!A86),\"\",('Program Requirements'!A86))","v":"Leslie H. Walton Middle"},null,null,null,{"$f":"IF(ISBLANK('Program Requirements'!D86),\"\",'Program Requirements'!D86)","v":"06 - 08"},null,null,null,null,null,null,null,null,{"$f":"IF(D64=\"Yes\",('Program Requirements'!G86),\"\")","v":""},{"$f":"IF(D64=\"Yes\",('Program Requirements'!L86),\"\")","v":""},{"$f":"IF(ISBLANK('Program Requirements'!M86),\"\",'Program Requirements'!M86)","v":0.42772861356932151},0,null,0,null,null,null,0,null,""]
[{"$f":"IF(ISBLANK('Program Requirements'!A87),\"\",('Program Requirements'!A87))","v":"Monticello High"},null,null,null,{"$f":"IF(ISBLANK('Program Requirements'!D87),\"\",'Program Requirements'!D87)","v":"09 - 12"},null,null,null,null,null,null,null,null,{"$f":"IF(D65=\"Yes\",('Program Requirements'!G87),\"\")","v":""},{"$f":"IF(D65=\"Yes\",('Program Requirements'!L87),\"\")","v":""},{"$f":"IF(ISBLANK('Program Requirements'!M87),\"\",'Program Requirements'!M87)","v":0.33361204013377926},0,null,0,null,null,null,0,null,""]
[{"$f":"IF(ISBLANK('Program Requirements'!A88),\"\",('Program Requirements'!A88))","v":"Albemarle High"},null,null,null,{"$f":"IF(ISBLANK('Program Requirements'!D88),\"\",'Program Requirements'!D88)","v":"09 - 12"},null,null,null,null,null,null,null,null,{"$f":"IF(D66=\"Yes\",('Program Requirements'!G88),\"\")","v":""},{"$f":"IF(D66=\"Yes\",('Program Requirements'!L88),\"\")","v":""},{"$f":"IF(ISBLANK('Program Requirements'!M88),\"\",'Program Requirements'!M88)","v":0.32460732984293195},0,null,0,null,null,null,0,null,""]
[{"$f":"IF(ISBLANK('Program Requirements'!A89),\"\",('Program Requirements'!A89))","v":"Stony Point Elementary"},null,null,null,{"$f":"IF(ISBLANK('Program Requirements'!D89),\"\",'Program Requirements'!D89)","v":"KG - 05"},null,null,null,null,null,null,null,null,{"$f":"IF(D67=\"Yes\",('Program Requirements'!G89),\"\")","v":""},{"$f":"IF(D67=\"Yes\",('Program Requirements'!L89),\"\")","v":""},{"$f":"IF(ISBLANK('Program Requirements'!M89),\"\",'Program Requirements'!M89)","v":0.32142857142857145},0,null,0,null,null,null,0,null,""]
[{"$f":"IF(ISBLANK('Program Requirements'!A90),\"\",('Program Requirements'!A90))","v":"Crozet Elementary"},null,null,null,{"$f":"IF(ISBLANK('Program Requirements'!D90),\"\",'Program Requirements'!D90)","v":"KG - 05"},null,null,null,null,null,null,null,null,{"$f":"IF(D68=\"Yes\",('Program Requirements'!G90),\"\")","v":""},{"$f":"IF(D68=\"Yes\",('Program Requirements'!L90),\"\")","v":""},{"$f":"IF(ISBLANK('Program Requirements'!M90),\"\",'Program Requirements'!M90)","v":0.30612244897959184},0,null,0,null,null,null,0,null,""]
[{"$f":"IF(ISBLANK('Program Requirements'!A91),\"\",('Program Requirements'!A91))","v":"Stone Robinson Elementary"},null,null,null,{"$f":"IF(ISBLANK('Program Requirements'!D91),\"\",'Program Requirements'!D91)","v":"PK - 05"},null,null,null,null,null,null,null,null,{"$f":"IF(D69=\"Yes\",('Program Requirements'!G91),\"\")","v":""},{"$f":"IF(D69=\"Yes\",('Program Requirements'!L91),\"\")","v":""},{"$f":"IF(ISBLANK('Program Requirements'!M91),\"\",'Program Requirements'!M91)","v":0.29158512720156554},0,null,0,null,null,null,0,null,""]
[{"$f":"IF(ISBLANK('Program Requirements'!A92),\"\",('Program Requirements'!A92))","v":"Baker-Butler Elementary"},null,null,null,{"$f":"IF(ISBLANK('Program Requirements'!D92),\"\",'Program Requirements'!D92)","v":"PK - 05"},null,null,null,null,null,null,null,null,{"$f":"IF(D70=\"Yes\",('Program Requirements'!G92),\"\")","v":""},{"$f":"IF(D70=\"Yes\",('Program Requirements'!L92),\"\")","v":""},{"$f":"IF(ISBLANK('Program Requirements'!M92),\"\",'Program Requirements'!M92)","v":0.2673559822747415},0,null,0,null,null,null,0,null,""]
[{"$f":"IF(ISBLANK('Program Requirements'!A93),\"\",('Program Requirements'!A93))","v":"Murray High"},null,null,null,{"$f":"IF(ISBLANK('Program Requirements'!D93),\"\",'Program Requirements'!D93)","v":"09 - 12"},null,null,null,null,null,null,null,null,{"$f":"IF(D71=\"Yes\",('Program Requirements'!G93),\"\")","v":""},{"$f":"IF(D71=\"Yes\",('Program Requirements'!L93),\"\")","v":""},{"$f":"IF(ISBLANK('Program Requirements'!M93),\"\",'Program Requirements'!M93)","v":0.25925925925925924},0,null,0,null,null,null,0,null,""]
[{"$f":"IF(ISBLANK('Program Requirements'!A94),\"\",('Program Requirements'!A94))","v":"Albemarle County Community Public Charter School"},null,null,null,{"$f":"IF(ISBLANK('Program Requirements'!D94),\"\",'Program Requirements'!D94)","v":"06 - 08"},null,null,null,null,null,null,null,null,{"$f":"IF(D72=\"Yes\",('Program Requirements'!G94),\"\")","v":""},{"$f":"IF(D72=\"Yes\",('Program Requirements'!L94),\"\")","v":""},{"$f":"IF(ISBLANK('Program Requirements'!M94),\"\",'Program Requirements'!M94)","v":0.22413793103448276},0,null,0,null,null,null,0,null,""]
[{"$f":"IF(ISBLANK('Program Requirements'!A95),\"\",('Program Requirements'!A95))","v":"Mortimer Y. Sutherland Middle"},null,null,null,{"$f":"IF(ISBLANK('Program Requirements'!D95),\"\",'Program Requirements'!D95)","v":"06 - 08"},null,null,null,null,null,null,null,null,{"$f":"IF(D73=\"Yes\",('Program Requirements'!G95),\"\")","v":""},{"$f":"IF(D73=\"Yes\",('Program Requirements'!L95),\"\")","v":""},{"$f":"IF(ISBLANK('Program Requirements'!M95),\"\",'Program Requirements'!M95)","v":0.22016806722689075},0,null,0,null,null,null,0,null,""]
[{"$f":"IF(ISBLANK('Program Requirements'!A96),\"\",('Program Requirements'!A96))","v":"Broadus Wood Elementary"},null,null,null,{"$f":"IF(ISBLANK('Program Requirements'!D96),\"\",'Program Requirements'!D96)","v":"PK - 05"},null,null,null,null,null,null,null,null,{"$f":"IF(D74=\"Yes\",('Program Requirements'!G96),\"\")","v":""},{"$f":"IF(D74=\"Yes\",('Program Requirements'!L96),\"\")","v":""},{"$f":"IF(ISBLANK('Program Requirements'!M96),\"\",'Program Requirements'!M96)","v":0.19097222222222221},0,null,0,null,null,null,0,null,""]
[{"$f":"IF(ISBLANK('Program Requirements'!A97),\"\",('Program Requirements'!A97))","v":"Hollymead Elementary"},null,null,null,{"$f":"IF(ISBLANK('Program Requirements'!D97),\"\",'Program Requirements'!D97)","v":"PK - 05"},null,null,null,null,null,null,null,null,{"$f":"IF(D75=\"Yes\",('Program Requirements'!G97),\"\")","v":""},{"$f":"IF(D75=\"Yes\",('Program Requirements'!L97),\"\")","v":""},{"$f":"IF(ISBLANK('Program Requirements'!M97),\"\",'Program Requirements'!M97)","v":0.1744186046511628},0,null,0,null,null,null,0,null,""]
[{"$f":"IF(ISBLANK('Program Requirements'!A98),\"\",('Program Requirements'!A98))","v":"Joseph T. Henley Middle"},null,null,null,{"$f":"IF(ISBLANK('Program Requirements'!D98),\"\",'Program Requirements'!D98)","v":"06 - 08"},null,null,null,null,null,null,null,null,{"$f":"IF(D76=\"Yes\",('Program Requirements'!G98),\"\")","v":""},{"$f":"IF(D76=\"Yes\",('Program Requirements'!L98),\"\")","v":""},{"$f":"IF(ISBLANK('Program Requirements'!M98),\"\",'Program Requirements'!M98)","v":0.14895947426067907},0,null,0,null,null,null,0,null,""]
[{"$f":"IF(ISBLANK('Program Requirements'!A99),\"\",('Program Requirements'!A99))","v":"Western Albemarle High"},null,null,null,{"$f":"IF(ISBLANK('Program Requirements'!D99),\"\",'Program Requirements'!D99)","v":"09 - 12"},null,null,null,null,null,null,null,null,{"$f":"IF(D77=\"Yes\",('Program Requirements'!G99),\"\")","v":""},{"$f":"IF(D77=\"Yes\",('Program Requirements'!L99),\"\")","v":""},{"$f":"IF(ISBLANK('Program Requirements'!M99),\"\",'Program Requirements'!M99)","v":0.12687813021702837},0,null,0,null,null,null,0,null,""]
[{"$f":"IF(ISBLANK('Program Requirements'!A100),\"\",('Program Requirements'!A100))","v":"Brownsville Elementary"},null,null,null,{"$f":"IF(ISBLANK('Program Requirements'!D100),\"\",'Program Requirements'!D100)","v":"PK - 05"},null,null,null,null,null,null,null,null,{"$f":"IF(D78=\"Yes\",('Program Requirements'!G100),\"\")","v":""},{"$f":"IF(D78=\"Yes\",('Program Requirements'!L100),\"\")","v":""},{"$f":"IF(ISBLANK('Program Requirements'!M100),\"\",'Program Requirements'!M100)","v":0.12254335260115606},0,null,0,null,null,null,0,null,""]
[{"$f":"IF(ISBLANK('Program Requirements'!A101),\"\",('Program Requirements'!A101))","v":"Meriwether Lewis Elementary"},null,null,null,{"$f":"IF(ISBLANK('Program Requirements'!D101),\"\",'Program Requirements'!D101)","v":"KG - 05"},null,null,null,null,null,null,null,null,{"$f":"IF(D79=\"Yes\",('Program Requirements'!G101),\"\")","v":""},{"$f":"IF(D79=\"Yes\",('Program Requirements'!L101),\"\")","v":""},{"$f":"IF(ISBLANK('Program Requirements'!M101),\"\",'Program Requirements'!M101)","v":0.12},0,null,0,null,null,null,0,null,""]
[{"$f":"IF(ISBLANK('Program Requirements'!A102),\"\",('Program Requirements'!A102))","v":"Virginia L. Murray Elementary"},null,null,null,{"$f":"IF(ISBLANK('Program Requirements'!D102),\"\",'Program Requirements'!D102)","v":"PK - 05"},null,null,null,null,null,null,null,null,{"$f":"IF(D80=\"Yes\",('Program Requirements'!G102),\"\")","v":""},{"$f":"IF(D80=\"Yes\",('Program Requirements'!L102),\"\")","v":""},{"$f":"IF(ISBLANK('Program Requirements'!M102),\"\",'Program Requirements'!M102)","v":6.8702290076335881E-2},0,null,0,null,null,null,0,null,""]
[{"$f":"IF(ISBLANK('Program Requirements'!A103),\"\",('Program Requirements'!A103))","v":""},null,null,null,{"$f":"IF(ISBLANK('Program Requirements'!D103),\"\",'Program Requirements'!D103)","v":""},null,null,null,null,null,null,null,null,{"$f":"IF(D81=\"Yes\",('Program Requirements'!G103),\"\")","v":""},{"$f":"IF(D81=\"Yes\",('Program Requirements'!L103),\"\")","v":""},{"$f":"IF(ISBLANK('Program Requirements'!M103),\"\",'Program Requirements'!M103)","v":{"$error":"#DIV/0!"}},0,null,0,null,null,null,0,null,""]
[{"$f":"IF(ISBLANK('Program Requirements'!A104),\"\",('Program Requirements'!A104))","v":""},null,null,null,{"$f":"IF(ISBLANK('Program Requirements'!D104),\"\",'Program Requirements'!D104)","v":""},null,null,null,null,null,null,null,null,{"$f":"IF(D82=\"Yes\",('Program Requirements'!G104),\"\")","v":""},{"$f":"IF(D82=\"Yes\",('Program Requirements'!L104),\"\")","v":""},{"$f":"IF(ISBLANK('Program Requirements'!M104),\"\",'Program Requirements'!M104)","v":{"$error":"#DIV/0!"}},0,null,0,null,null,null,0,null,""]
[{"$f":"IF(ISBLANK('Program Requirements'!A105),\"\",('Program Requirements'!A105))","v":""},null,null,null,{"$f":"IF(ISBLANK('Program Requirements'!D105),\"\",'Program Requirements'!D105)","v":""},null,null,null,null,null,null,null,null,{"$f":"IF(D83=\"Yes\",('Program Requirements'!G105),\"\")","v":""},{"$f":"IF(D83=\"Yes\",('Program Requirements'!L105),\"\")","v":""},{"$f":"IF(ISBLANK('Program Requirements'!M105),\"\",'Program Requirements'!M105)","v":{"$error":"#DIV/0!"}},0,null,0,null,null,null,0,null,""]
[{"$f":"IF(ISBLANK('Program Requirements'!A106),\"\",('Program Requirements'!A106))","v":""},null,null,null,{"$f":"IF(ISBLANK('Program Requirements'!D106),\"\",'Program Requirements'!D106)","v":""},null,null,null,null,null,null,null,null,{"$f":"IF(D84=\"Yes\",('Program Requirements'!G106),\"\")","v":""},{"$f":"IF(D84=\"Yes\",('Program Requirements'!L106),\"\")","v":""},{"$f":"IF(ISBLANK('Program Requirements'!M106),\"\",'Program Requirements'!M106)","v":{"$error":"#DIV/0!"}},0,null,0,null,null,null,0,null,""]
[{"$f":"IF(ISBLANK('Program Requirements'!A107),\"\",('Program Requirements'!A107))","v":""},null,null,null,{"$f":"IF(ISBLANK('Program Requirements'!D107),\"\",'Program Requirements'!D107)","v":""},null,null,null,null,null,null,null,null,{"$f":"IF(D85=\"Yes\",('Program Requirements'!G107),\"\")","v":""},{"$f":"IF(D85=\"Yes\",('Program Requirements'!L107),\"\")","v":""},{"$f":"IF(ISBLANK('Program Requirements'!M107),\"\",'Program Requirements'!M107)","v":{"$error":"#DIV/0!"}},0,null,0,null,null,null,0,null,""]
[{"$f":"IF(ISBLANK('Program Requirements'!A108),\"\",('Program Requirements'!A108))","v":""},null,null,null,{"$f":"IF(ISBLANK('Program Requirements'!D108),\"\",'Program Requirements'!D108)","v":""},null,null,null,null,null,null,null,null,{"$f":"IF(D86=\"Yes\",('Program Requirements'!G108),\"\")","v":""},{"$f":"IF(D86=\"Yes\",('Program Requirements'!L108),\"\")","v":""},{"$f":"IF(ISBLANK('Program Requirements'!M108),\"\",'Program Requirements'!M108)","v":{"$error":"#DIV/0!"}},0,null,0,null,null,null,0,null,""]
[{"$f":"IF(ISBLANK('Program Requirements'!A109),\"\",('Program Requirements'!A109))","v":""},null,null,null,{"$f":"IF(ISBLANK('Program Requirements'!D109),\"\",'Program Requirements'!D109)","v":""},null,null,null,null,null,null,null,null,{"$f":"IF(D87=\"Yes\",('Program Requirements'!G109),\"\")","v":""},{"$f":"IF(D87=\"Yes\",('Program Requirements'!L109),\"\")","v":""},{"$f":"IF(ISBLANK('Program Requirements'!M109),\"\",'Program Requirements'!M109)","v":{"$error":"#DIV/0!"}},0,null,0,null,null,null,{"$f":"IF(SUM(U87)=0,SUM(Q87),IF(SUM(Q87,U87)=U87,\"ERROR\",SUM(Q87,U87)))","v":0},null,""]
[{"$f":"IF(ISBLANK('Program Requirements'!A110),\"\",('Program Requirements'!A110))","v":""},null,null,null,{"$f":"IF(ISBLANK('Program Requirements'!D110),\"\",'Program Requirements'!D110)","v":""},null,null,null,null,null,null,null,null,{"$f":"IF(D88=\"Yes\",('Program Requirements'!G110),\"\")","v":""},{"$f":"IF(D88=\"Yes\",('Program Requirements'!L110),\"\")","v":""},{"$f":"IF(ISBLANK('Program Requirements'!M110),\"\",'Program Requirements'!M110)","v":{"$error":"#DIV/0!"}},0,null,0,null,null,null,0,null,""]
[{"$f":"IF(ISBLANK('Program Requirements'!A111),\"\",('Program Requirements'!A111))","v":""},null,null,null,{"$f":"IF(ISBLANK('Program Requirements'!D111),\"\",'Program Requirements'!D111)","v":""},null,null,null,null,null,null,null,null,{"$f":"IF(D89=\"Yes\",('Program Requirements'!G111),\"\")","v":""},{"$f":"IF(D89=\"Yes\",('Program Requirements'!L111),\"\")","v":""},{"$f":"IF(ISBLANK('Program Requirements'!M111),\"\",'Program Requirements'!M111)","v":{"$error":"#DIV/0!"}},0,null,0,null,null,null,0,null,""]
[{"$f":"IF(ISBLANK('Program Requirements'!A112),\"\",('Program Requirements'!A112))","v":""},null,null,null,{"$f":"IF(ISBLANK('Program Requirements'!D112),\"\",'Program Requirements'!D112)","v":""},null,null,null,null,null,null,null,null,{"$f":"IF(D90=\"Yes\",('Program Requirements'!G112),\"\")","v":""},{"$f":"IF(D90=\"Yes\",('Program Requirements'!L112),\"\")","v":""},{"$f":"IF(ISBLANK('Program Requirements'!M112),\"\",'Program Requirements'!M112)","v":{"$error":"#DIV/0!"}},0,null,0,null,null,null,0,null,""]
[{"$f":"IF(ISBLANK('Program Requirements'!A113),\"\",('Program Requirements'!A113))","v":""},null,null,null,{"$f":"IF(ISBLANK('Program Requirements'!D113),\"\",'Program Requirements'!D113)","v":""},null,null,null,null,null,null,null,null,{"$f":"IF(D91=\"Yes\",('Program Requirements'!G113),\"\")","v":""},{"$f":"IF(D91=\"Yes\",('Program Requirements'!L113),\"\")","v":""},{"$f":"IF(ISBLANK('Program Requirements'!M113),\"\",'Program Requirements'!M113)","v":{"$error":"#DIV/0!"}},0,null,0,null,null,null,0,null,""]
[{"$f":"IF(ISBLANK('Program Requirements'!A114),\"\",('Program Requirements'!A114))","v":""},null,null,null,{"$f":"IF(ISBLANK('Program Requirements'!D114),\"\",'Program Requirements'!D114)","v":""},null,null,null,null,null,null,null,null,{"$f":"IF(D92=\"Yes\",('Program Requirements'!G114),\"\")","v":""},{"$f":"IF(D92=\"Yes\",('Program Requirements'!L114),\"\")","v":""},{"$f":"IF(ISBLANK('Program Requirements'!M114),\"\",'Program Requirements'!M114)","v":{"$error":"#DIV/0!"}},0,null,0,null,null,null,0,null,""]
[{"$f":"IF(ISBLANK('Program Requirements'!A115),\"\",('Program Requirements'!A115))","v":""},null,null,null,{"$f":"IF(ISBLANK('Program Requirements'!D115),\"\",'Program Requirements'!D115)","v":""},null,null,null,null,null,null,null,null,{"$f":"IF(D93=\"Yes\",('Program Requirements'!G115),\"\")","v":""},{"$f":"IF(D93=\"Yes\",('Program Requirements'!L115),\"\")","v":""},{"$f":"IF(ISBLANK('Program Requirements'!M115),\"\",'Program Requirements'!M115)","v":{"$error":"#DIV/0!"}},0,null,0,null,null,null,0,null,""]
[{"$f":"IF(ISBLANK('Program Requirements'!A116),\"\",('Program Requirements'!A116))","v":""},null,null,null,{"$f":"IF(ISBLANK('Program Requirements'!D116),\"\",'Program Requirements'!D116)","v":""},null,null,null,null,null,null,null,null,{"$f":"IF(D94=\"Yes\",('Program Requirements'!G116),\"\")","v":""},{"$f":"IF(D94=\"Yes\",('Program Requirements'!L116),\"\")","v":""},{"$f":"IF(ISBLANK('Program Requirements'!M116),\"\",'Program Requirements'!M116)","v":{"$error":"#DIV/0!"}},0,null,0,null,null,null,0,null,""]
[{"$f":"IF(ISBLANK('Program Requirements'!A117),\"\",('Program Requirements'!A117))","v":""},null,null,null,{"$f":"IF(ISBLANK('Program Requirements'!D117),\"\",'Program Requirements'!D117)","v":""},null,null,null,null,null,null,null,null,{"$f":"IF(D95=\"Yes\",('Program Requirements'!G117),\"\")","v":""},{"$f":"IF(D95=\"Yes\",('Program Requirements'!L117),\"\")","v":""},{"$f":"IF(ISBLANK('Program Requirements'!M117),\"\",'Program Requirements'!M117)","v":{"$error":"#DIV/0!"}},0,null,0,null,null,null,0,null,""]
[{"$f":"IF(ISBLANK('Program Requirements'!A118),\"\",('Program Requirements'!A118))","v":""},null,null,null,{"$f":"IF(ISBLANK('Program Requirements'!D118),\"\",'Program Requirements'!D118)","v":""},null,null,null,null,null,null,null,null,{"$f":"IF(D96=\"Yes\",('Program Requirements'!G118),\"\")","v":""},{"$f":"IF(D96=\"Yes\",('Program Requirements'!L118),\"\")","v":""},{"$f":"IF(ISBLANK('Program Requirements'!M118),\"\",'Program Requirements'!M118)","v":{"$error":"#DIV/0!"}},0,null,0,null,null,null,0,null,""]
[{"$f":"IF(ISBLANK('Program Requirements'!A119),\"\",('Program Requirements'!A119))","v":""},null,null,null,{"$f":"IF(ISBLANK('Program Requirements'!D119),\"\",'Program Requirements'!D119)","v":""},null,null,null,null,null,null,null,null,{"$f":"IF(D97=\"Yes\",('Program Requirements'!G119),\"\")","v":""},{"$f":"IF(D97=\"Yes\",('Program Requirements'!L119),\"\")","v":""},{"$f":"IF(ISBLANK('Program Requirements'!M119),\"\",'Program Requirements'!M119)","v":{"$error":"#DIV/0!"}},0,null,0,null,null,null,0,null,""]
[{"$f":"IF(ISBLANK('Program Requirements'!A120),\"\",('Program Requirements'!A120))","v":""},null,null,null,{"$f":"IF(ISBLANK('Program Requirements'!D120),\"\",'Program Requirements'!D120)","v":""},null,null,null,null,null,null,null,null,{"$f":"IF(D98=\"Yes\",('Program Requirements'!G120),\"\")","v":""},{"$f":"IF(D98=\"Yes\",('Program Requirements'!L120),\"\")","v":""},{"$f":"IF(ISBLANK('Program Requirements'!M120),\"\",'Program Requirements'!M120)","v":{"$error":"#DIV/0!"}},0,null,0,null,null,null,0,null,""]
[{"$f":"IF(ISBLANK('Program Requirements'!A121),\"\",('Program Requirements'!A121))","v":""},null,null,null,{"$f":"IF(ISBLANK('Program Requirements'!D121),\"\",'Program Requirements'!D121)","v":""},null,null,null,null,null,null,null,null,{"$f":"IF(D99=\"Yes\",('Program Requirements'!G121),\"\")","v":""},{"$f":"IF(D99=\"Yes\",('Program Requirements'!L121),\"\")","v":""},{"$f":"IF(ISBLANK('Program Requirements'!M121),\"\",'Program Requirements'!M121)","v":{"$error":"#DIV/0!"}},0,null,0,null,null,null,0,null,""]
[{"$f":"IF(ISBLANK('Program Requirements'!A122),\"\",('Program Requirements'!A122))","v":""},null,null,null,{"$f":"IF(ISBLANK('Program Requirements'!D122),\"\",'Program Requirements'!D122)","v":""},null,null,null,null,null,null,null,null,{"$f":"IF(D100=\"Yes\",('Program Requirements'!G122),\"\")","v":""},{"$f":"IF(D100=\"Yes\",('Program Requirements'!L122),\"\")","v":""},{"$f":"IF(ISBLANK('Program Requirements'!M122),\"\",'Program Requirements'!M122)","v":{"$error":"#DIV/0!"}},0,null,0,null,null,null,0,null,""]
[{"$f":"IF(ISBLANK('Program Requirements'!A123),\"\",('Program Requirements'!A123))","v":""},null,null,null,{"$f":"IF(ISBLANK('Program Requirements'!D123),\"\",'Program Requirements'!D123)","v":""},null,null,null,null,null,null,null,null,{"$f":"IF(D101=\"Yes\",('Program Requirements'!G123),\"\")","v":""},{"$f":"IF(D101=\"Yes\",('Program Requirements'!L123),\"\")","v":""},{"$f":"IF(ISBLANK('Program Requirements'!M123),\"\",'Program Requirements'!M123)","v":{"$error":"#DIV/0!"}},0,null,0,null,null,null,0,null,""]
[{"$f":"IF(ISBLANK('Program Requirements'!A124),\"\",('Program Requirements'!A124))","v":""},null,null,null,{"$f":"IF(ISBLANK('Program Requirements'!D124),\"\",'Program Requirements'!D124)","v":""},null,null,null,null,null,null,null,null,{"$f":"IF(D102=\"Yes\",('Program Requirements'!G124),\"\")","v":""},{"$f":"IF(D102=\"Yes\",('Program Requirements'!L124),\"\")","v":""},{"$f":"IF(ISBLANK('Program Requirements'!M124),\"\",'Program Requirements'!M124)","v":{"$error":"#DIV/0!"}},0,null,0,null,null,null,0,null,""]
[{"$f":"IF(ISBLANK('Program Requirements'!A125),\"\",('Program Requirements'!A125))","v":""},null,null,null,{"$f":"IF(ISBLANK('Program Requirements'!D125),\"\",'Program Requirements'!D125)","v":""},null,null,null,null,null,null,null,null,{"$f":"IF(D103=\"Yes\",('Program Requirements'!G125),\"\")","v":""},{"$f":"IF(D103=\"Yes\",('Program Requirements'!L125),\"\")","v":""},{"$f":"IF(ISBLANK('Program Requirements'!M125),\"\",'Program Requirements'!M125)","v":{"$error":"#DIV/0!"}},0,null,0,null,null,null,0,null,""]
[{"$f":"IF(ISBLANK('Program Requirements'!A126),\"\",('Program Requirements'!A126))","v":""},null,null,null,{"$f":"IF(ISBLANK('Program Requirements'!D126),\"\",'Program Requirements'!D126)","v":""},null,null,null,null,null,null,null,null,{"$f":"IF(D104=\"Yes\",('Program Requirements'!G126),\"\")","v":""},{"$f":"IF(D104=\"Yes\",('Program Requirements'!L126),\"\")","v":""},{"$f":"IF(ISBLANK('Program Requirements'!M126),\"\",'Program Requirements'!M126)","v":{"$error":"#DIV/0!"}},0,null,0,null,null,null,0,null,""]
[{"$f":"IF(ISBLANK('Program Requirements'!A127),\"\",('Program Requirements'!A127))","v":""},null,null,null,{"$f":"IF(ISBLANK('Program Requirements'!D127),\"\",'Program Requirements'!D127)","v":""},null,null,null,null,null,null,null,null,{"$f":"IF(D105=\"Yes\",('Program Requirements'!G127),\"\")","v":""},{"$f":"IF(D105=\"Yes\",('Program Requirements'!L127),\"\")","v":""},{"$f":"IF(ISBLANK('Program Requirements'!M127),\"\",'Program Requirements'!M127)","v":{"$error":"#DIV/0!"}},0,null,0,null,null,null,0,null,""]
[{"$f":"IF(ISBLANK('Program Requirements'!A128),\"\",('Program Requirements'!A128))","v":""},null,null,null,{"$f":"IF(ISBLANK('Program Requirements'!D128),\"\",'Program Requirements'!D128)","v":""},null,null,null,null,null,null,null,null,{"$f":"IF(D106=\"Yes\",('Program Requirements'!G128),\"\")","v":""},{"$f":"IF(D106=\"Yes\",('Program Requirements'!L128),\"\")","v":""},{"$f":"IF(ISBLANK('Program Requirements'!M128),\"\",'Program Requirements'!M128)","v":{"$error":"#DIV/0!"}},0,null,0,null,null,null,0,null,""]
[{"$f":"IF(ISBLANK('Program Requirements'!A129),\"\",('Program Requirements'!A129))","v":""},null,null,null,{"$f":"IF(ISBLANK('Program Requirements'!D129),\"\",'Program Requirements'!D129)","v":""},null,null,null,null,null,null,null,null,{"$f":"IF(D107=\"Yes\",('Program Requirements'!G129),\"\")","v":""},{"$f":"IF(D107=\"Yes\",('Program Requirements'!L129),\"\")","v":""},{"$f":"IF(ISBLANK('Program Requirements'!M129),\"\",'Program Requirements'!M129)","v":{"$error":"#DIV/0!"}},0,null,0,null,null,null,0,null,""]
[{"$f":"IF(ISBLANK('Program Requirements'!A130),\"\",('Program Requirements'!A130))","v":""},null,null,null,{"$f":"IF(ISBLANK('Program Requirements'!D130),\"\",'Program Requirements'!D130)","v":""},null,null,null,null,null,null,null,null,{"$f":"IF(D108=\"Yes\",('Program Requirements'!G130),\"\")","v":""},{"$f":"IF(D108=\"Yes\",('Program Requirements'!L130),\"\")","v":""},{"$f":"IF(ISBLANK('Program Requirements'!M130),\"\",'Program Requirements'!M130)","v":{"$error":"#DIV/0!"}},0,null,0,null,null,null,0,null,""]
[{"$f":"IF(ISBLANK('Program Requirements'!A131),\"\",('Program Requirements'!A131))","v":""},null,null,null,{"$f":"IF(ISBLANK('Program Requirements'!D131),\"\",'Program Requirements'!D131)","v":""},null,null,null,null,null,null,null,null,{"$f":"IF(D109=\"Yes\",('Program Requirements'!G131),\"\")","v":""},{"$f":"IF(D109=\"Yes\",('Program Requirements'!L131),\"\")","v":""},{"$f":"IF(ISBLANK('Program Requirements'!M131),\"\",'Program Requirements'!M131)","v":{"$error":"#DIV/0!"}},0,null,0,null,null,null,0,null,""]
[{"$f":"IF(ISBLANK('Program Requirements'!A132),\"\",('Program Requirements'!A132))","v":""},null,null,null,{"$f":"IF(ISBLANK('Program Requirements'!D132),\"\",'Program Requirements'!D132)","v":""},null,null,null,null,null,null,null,null,{"$f":"IF(D110=\"Yes\",('Program Requirements'!G132),\"\")","v":""},{"$f":"IF(D110=\"Yes\",('Program Requirements'!L132),\"\")","v":""},{"$f":"IF(ISBLANK('Program Requirements'!M132),\"\",'Program Requirements'!M132)","v":{"$error":"#DIV/0!"}},0,null,0,null,null,null,0,null,""]
[{"$f":"IF(ISBLANK('Program Requirements'!A133),\"\",('Program Requirements'!A133))","v":""},null,null,null,{"$f":"IF(ISBLANK('Program Requirements'!D133),\"\",'Program Requirements'!D133)","v":""},null,null,null,null,null,null,null,null,{"$f":"IF(D111=\"Yes\",('Program Requirements'!G133),\"\")","v":""},{"$f":"IF(D111=\"Yes\",('Program Requirements'!L133),\"\")","v":""},{"$f":"IF(ISBLANK('Program Requirements'!M133),\"\",'Program Requirements'!M133)","v":{"$error":"#DIV/0!"}},0,null,0,null,null,null,0,null,""]
[{"$f":"IF(ISBLANK('Program Requirements'!A134),\"\",('Program Requirements'!A134))","v":""},null,null,null,{"$f":"IF(ISBLANK('Program Requirements'!D134),\"\",'Program Requirements'!D134)","v":""},null,null,null,null,null,null,null,null,{"$f":"IF(D112=\"Yes\",('Program Requirements'!G134),\"\")","v":""},{"$f":"IF(D112=\"Yes\",('Program Requirements'!L134),\"\")","v":""},{"$f":"IF(ISBLANK('Program Requirements'!M134),\"\",'Program Requirements'!M134)","v":{"$error":"#DIV/0!"}},0,null,0,null,null,null,0,null,""]
[{"$f":"IF(ISBLANK('Program Requirements'!A135),\"\",('Program Requirements'!A135))","v":""},null,null,null,{"$f":"IF(ISBLANK('Program Requirements'!D135),\"\",'Program Requirements'!D135)","v":""},null,null,null,null,null,null,null,null,{"$f":"IF(D113=\"Yes\",('Program Requirements'!G135),\"\")","v":""},{"$f":"IF(D113=\"Yes\",('Program Requirements'!L135),\"\")","v":""},{"$f":"IF(ISBLANK('Program Requirements'!M135),\"\",'Program Requirements'!M135)","v":{"$error":"#DIV/0!"}},0,null,0,null,null,null,0,null,""]
[{"$f":"IF(ISBLANK('Program Requirements'!A136),\"\",('Program Requirements'!A136))","v":""},null,null,null,{"$f":"IF(ISBLANK('Program Requirements'!D136),\"\",'Program Requirements'!D136)","v":""},null,null,null,null,null,null,null,null,{"$f":"IF(D114=\"Yes\",('Program Requirements'!G136),\"\")","v":""},{"$f":"IF(D114=\"Yes\",('Program Requirements'!L136),\"\")","v":""},{"$f":"IF(ISBLANK('Program Requirements'!M136),\"\",'Program Requirements'!M136)","v":{"$error":"#DIV/0!"}},0,null,0,null,null,null,0,null,""]
[{"$f":"IF(ISBLANK('Program Requirements'!A137),\"\",('Program Requirements'!A137))","v":""},null,null,null,{"$f":"IF(ISBLANK('Program Requirements'!D137),\"\",'Program Requirements'!D137)","v":""},null,null,null,null,null,null,null,null,{"$f":"IF(D115=\"Yes\",('Program Requirements'!G137),\"\")","v":""},{"$f":"IF(D115=\"Yes\",('Program Requirements'!L137),\"\")","v":""},{"$f":"IF(ISBLANK('Program Requirements'!M137),\"\",'Program Requirements'!M137)","v":{"$error":"#DIV/0!"}},0,null,0,null,null,null,0,null,""]
[{"$f":"IF(ISBLANK('Program Requirements'!A138),\"\",('Program Requirements'!A138))","v":""},null,null,null,{"$f":"IF(ISBLANK('Program Requirements'!D138),\"\",'Program Requirements'!D138)","v":""},null,null,null,null,null,null,null,null,{"$f":"IF(D116=\"Yes\",('Program Requirements'!G138),\"\")","v":""},{"$f":"IF(D116=\"Yes\",('Program Requirements'!L138),\"\")","v":""},{"$f":"IF(ISBLANK('Program Requirements'!M138),\"\",'Program Requirements'!M138)","v":{"$error":"#DIV/0!"}},0,null,0,null,null,null,0,null,""]
[{"$f":"IF(ISBLANK('Program Requirements'!A139),\"\",('Program Requirements'!A139))","v":""},null,null,null,{"$f":"IF(ISBLANK('Program Requirements'!D139),\"\",'Program Requirements'!D139)","v":""},null,null,null,null,null,null,null,null,{"$f":"IF(D117=\"Yes\",('Program Requirements'!G139),\"\")","v":""},{"$f":"IF(D117=\"Yes\",('Program Requirements'!L139),\"\")","v":""},{"$f":"IF(ISBLANK('Program Requirements'!M139),\"\",'Program Requirements'!M139)","v":{"$error":"#DIV/0!"}},0,null,0,null,null,null,0,null,""]
[{"$f":"IF(ISBLANK('Program Requirements'!A140),\"\",('Program Requirements'!A140))","v":""},null,null,null,{"$f":"IF(ISBLANK('Program Requirements'!D140),\"\",'Program Requirements'!D140)","v":""},null,null,null,null,null,null,null,null,{"$f":"IF(D118=\"Yes\",('Program Requirements'!G140),\"\")","v":""},{"$f":"IF(D118=\"Yes\",('Program Requirements'!L140),\"\")","v":""},{"$f":"IF(ISBLANK('Program Requirements'!M140),\"\",'Program Requirements'!M140)","v":{"$error":"#DIV/0!"}},0,null,0,null,null,null,0,null,""]
[{"$f":"IF(ISBLANK('Program Requirements'!A141),\"\",('Program Requirements'!A141))","v":""},null,null,null,{"$f":"IF(ISBLANK('Program Requirements'!D141),\"\",'Program Requirements'!D141)","v":""},null,null,null,null,null,null,null,null,{"$f":"IF(D119=\"Yes\",('Program Requirements'!G141),\"\")","v":""},{"$f":"IF(D119=\"Yes\",('Program Requirements'!L141),\"\")","v":""},{"$f":"IF(ISBLANK('Program Requirements'!M141),\"\",'Program Requirements'!M141)","v":{"$error":"#DIV/0!"}},{"$f":"IF(D119=\"Yes\",(O119)*$Q$45,0)","v":0},null,0,null,null,null,0,null,{"$f":"IF(D119=\"Yes\",SUM(W119)/SUM(O119),\"\")","v":""}]
[{"$f":"IF(ISBLANK('Program Requirements'!A142),\"\",('Program Requirements'!A142))","v":""},null,null,null,{"$f":"IF(ISBLANK('Program Requirements'!D142),\"\",'Program Requirements'!D142)","v":""},null,null,null,null,null,null,null,null,{"$f":"IF(D120=\"Yes\",('Program Requirements'!G142),\"\")","v":""},{"$f":"IF(D120=\"Yes\",('Program Requirements'!L142),\"\")","v":""},{"$f":"IF(ISBLANK('Program Requirements'!M142),\"\",'Program Requirements'!M142)","v":{"$error":"#DIV/0!"}},0,null,0,null,null,null,0,null,""]
[{"$f":"IF(ISBLANK('Program Requirements'!A143),\"\",('Program Requirements'!A143))","v":""},null,null,null,{"$f":"IF(ISBLANK('Program Requirements'!D143),\"\",'Program Requirements'!D143)","v":""},null,null,null,null,null,null,null,null,{"$f":"IF(D121=\"Yes\",('Program Requirements'!G143),\"\")","v":""},{"$f":"IF(D121=\"Yes\",('Program Requirements'!L143),\"\")","v":""},{"$f":"IF(ISBLANK('Program Requirements'!M143),\"\",'Program Requirements'!M143)","v":{"$error":"#DIV/0!"}},0,null,0,null,null,null,0,null,""]
[{"$f":"IF(ISBLANK('Program Requirements'!A144),\"\",('Program Requirements'!A144))","v":""},null,null,null,{"$f":"IF(ISBLANK('Program Requirements'!D144),\"\",'Program Requirements'!D144)","v":""},null,null,null,null,null,null,null,null,{"$f":"IF(D122=\"Yes\",('Program Requirements'!G144),\"\")","v":""},{"$f":"IF(D122=\"Yes\",('Program Requirements'!L144),\"\")","v":""},{"$f":"IF(ISBLANK('Program Requirements'!M144),\"\",'Program Requirements'!M144)","v":{"$error":"#DIV/0!"}},0,null,{"$f":"S121-Q122","v":0},null,null,null,0,null,""]
[{"$f":"IF(ISBLANK('Program Requirements'!A145),\"\",('Program Requirements'!A145))","v":""},null,null,null,{"$f":"IF(ISBLANK('Program Requirements'!D145),\"\",'Program Requirements'!D145)","v":""},null,null,null,null,null,null,null,null,{"$f":"IF(D123=\"Yes\",('Program Requirements'!G145),\"\")","v":""},{"$f":"IF(D123=\"Yes\",('Program Requirements'!L145),\"\")","v":""},{"$f":"IF(ISBLANK('Program Requirements'!M145),\"\",'Program Requirements'!M145)","v":{"$error":"#DIV/0!"}},0,null,0,null,null,null,0,null,""]
[{"$f":"IF(ISBLANK('Program Requirements'!A146),\"\",('Program Requirements'!A146))","v":""},null,null,null,{"$f":"IF(ISBLANK('Program Requirements'!D146),\"\",'Program Requirements'!D146)","v":""},null,null,null,null,null,null,null,null,{"$f":"IF(D124=\"Yes\",('Program Requirements'!G146),\"\")","v":""},{"$f":"IF(D124=\"Yes\",('Program Requirements'!L146),\"\")","v":""},{"$f":"IF(ISBLANK('Program Requirements'!M146),\"\",'Program Requirements'!M146)","v":{"$error":"#DIV/0!"}},0,null,0,null,null,null,0,null,""]
[{"$f":"IF(ISBLANK('Program Requirements'!A147),\"\",('Program Requirements'!A147))","v":""},null,null,null,{"$f":"IF(ISBLANK('Program Requirements'!D147),\"\",'Program Requirements'!D147)","v":""},null,null,null,null,null,null,null,null,{"$f":"IF(D125=\"Yes\",('Program Requirements'!G147),\"\")","v":""},{"$f":"IF(D125=\"Yes\",('Program Requirements'!L147),\"\")","v":""},{"$f":"IF(ISBLANK('Program Requirements'!M147),\"\",'Program Requirements'!M147)","v":{"$error":"#DIV/0!"}},0,null,0,null,null,null,0,null,""]
[{"$f":"IF(ISBLANK('Program Requirements'!A148),\"\",('Program Requirements'!A148))","v":""},null,null,null,{"$f":"IF(ISBLANK('Program Requirements'!D148),\"\",'Program Requirements'!D148)","v":""},null,null,null,null,null,null,null,null,{"$f":"IF(D126=\"Yes\",('Program Requirements'!G148),\"\")","v":""},{"$f":"IF(D126=\"Yes\",('Program Requirements'!L148),\"\")","v":""},{"$f":"IF(ISBLANK('Program Requirements'!M148),\"\",'Program Requirements'!M148)","v":{"$error":"#DIV/0!"}},0,null,0,null,null,null,0,null,""]
[{"$f":"IF(ISBLANK('Program Requirements'!A149),\"\",('Program Requirements'!A149))","v":""},null,null,null,{"$f":"IF(ISBLANK('Program Requirements'!D149),\"\",'Program Requirements'!D149)","v":""},null,null,null,null,null,null,null,null,{"$f":"IF(D127=\"Yes\",('Program Requirements'!G149),\"\")","v":""},{"$f":"IF(D127=\"Yes\",('Program Requirements'!L149),\"\")","v":""},{"$f":"IF(ISBLANK('Program Requirements'!M149),\"\",'Program Requirements'!M149)","v":{"$error":"#DIV/0!"}},0,null,0,null,null,null,0,null,""]
[{"$f":"IF(ISBLANK('Program Requirements'!A150),\"\",('Program Requirements'!A150))","v":""},null,null,null,{"$f":"IF(ISBLANK('Program Requirements'!D150),\"\",'Program Requirements'!D150)","v":""},null,null,null,null,null,null,null,null,{"$f":"IF(D128=\"Yes\",('Program Requirements'!G150),\"\")","v":""},{"$f":"IF(D128=\"Yes\",('Program Requirements'!L150),\"\")","v":""},{"$f":"IF(ISBLANK('Program Requirements'!M150),\"\",'Program Requirements'!M150)","v":{"$error":"#DIV/0!"}},0,null,0,null,null,null,0,null,""]
[{"$f":"IF(ISBLANK('Program Requirements'!A151),\"\",('Program Requirements'!A151))","v":""},null,null,null,{"$f":"IF(ISBLANK('Program Requirements'!D151),\"\",'Program Requirements'!D151)","v":""},null,null,null,null,null,null,null,null,{"$f":"IF(D129=\"Yes\",('Program Requirements'!G151),\"\")","v":""},{"$f":"IF(D129=\"Yes\",('Program Requirements'!L151),\"\")","v":""},{"$f":"IF(ISBLANK('Program Requirements'!M151),\"\",'Program Requirements'!M151)","v":{"$error":"#DIV/0!"}},0,null,0,null,null,null,0,null,""]
[{"$f":"IF(ISBLANK('Program Requirements'!A152),\"\",('Program Requirements'!A152))","v":""},null,null,null,{"$f":"IF(ISBLANK('Program Requirements'!D152),\"\",'Program Requirements'!D152)","v":""},null,null,null,null,null,null,null,null,{"$f":"IF(D130=\"Yes\",('Program Requirements'!G152),\"\")","v":""},{"$f":"IF(D130=\"Yes\",('Program Requirements'!L152),\"\")","v":""},{"$f":"IF(ISBLANK('Program Requirements'!M152),\"\",'Program Requirements'!M152)","v":{"$error":"#DIV/0!"}},0,null,0,null,null,null,0,null,""]
[{"$f":"IF(ISBLANK('Program Requirements'!A153),\"\",('Program Requirements'!A153))","v":""},null,null,null,{"$f":"IF(ISBLANK('Program Requirements'!D153),\"\",'Program Requirements'!D153)","v":""},null,null,null,null,null,null,null,null,{"$f":"IF(D131=\"Yes\",('Program Requirements'!G153),\"\")","v":""},{"$f":"IF(D131=\"Yes\",('Program Requirements'!L153),\"\")","v":""},{"$f":"IF(ISBLANK('Program Requirements'!M153),\"\",'Program Requirements'!M153)","v":{"$error":"#DIV/0!"}},0,null,0,null,null,null,0,null,""]
[{"$f":"IF(ISBLANK('Program Requirements'!A154),\"\",('Program Requirements'!A154))","v":""},null,null,null,{"$f":"IF(ISBLANK('Program Requirements'!D154),\"\",'Program Requirements'!D154)","v":""},null,null,null,null,null,null,null,null,{"$f":"IF(D132=\"Yes\",('Program Requirements'!G154),\"\")","v":""},{"$f":"IF(D132=\"Yes\",('Program Requirements'!L154),\"\")","v":""},{"$f":"IF(ISBLANK('Program Requirements'!M154),\"\",'Program Requirements'!M154)","v":{"$error":"#DIV/0!"}},0,null,0,null,null,null,0,null,""]
[{"$f":"IF(ISBLANK('Program Requirements'!A155),\"\",('Program Requirements'!A155))","v":""},null,null,null,{"$f":"IF(ISBLANK('Program Requirements'!D155),\"\",'Program Requirements'!D155)","v":""},null,null,null,null,null,null,null,null,{"$f":"IF(D133=\"Yes\",('Program Requirements'!G155),\"\")","v":""},{"$f":"IF(D133=\"Yes\",('Program Requirements'!L155),\"\")","v":""},{"$f":"IF(ISBLANK('Program Requirements'!M155),\"\",'Program Requirements'!M155)","v":{"$error":"#DIV/0!"}},0,null,0,null,null,null,0,null,""]
[{"$f":"IF(ISBLANK('Program Requirements'!A156),\"\",('Program Requirements'!A156))","v":""},null,null,null,{"$f":"IF(ISBLANK('Program Requirements'!D156),\"\",'Program Requirements'!D156)","v":""},null,null,null,null,null,null,null,null,{"$f":"IF(D134=\"Yes\",('Program Requirements'!G156),\"\")","v":""},{"$f":"IF(D134=\"Yes\",('Program Requirements'!L156),\"\")","v":""},{"$f":"IF(ISBLANK('Program Requirements'!M156),\"\",'Program Requirements'!M156)","v":{"$error":"#DIV/0!"}},0,null,0,null,null,null,0,null,""]
[{"$f":"IF(ISBLANK('Program Requirements'!A157),\"\",('Program Requirements'!A157))","v":""},null,null,null,{"$f":"IF(ISBLANK('Program Requirements'!D157),\"\",'Program Requirements'!D157)","v":""},null,null,null,null,null,null,null,null,{"$f":"IF(D135=\"Yes\",('Program Requirements'!G157),\"\")","v":""},{"$f":"IF(D135=\"Yes\",('Program Requirements'!L157),\"\")","v":""},{"$f":"IF(ISBLANK('Program Requirements'!M157),\"\",'Program Requirements'!M157)","v":{"$error":"#DIV/0!"}},0,null,0,null,null,null,0,null,""]
[{"$f":"IF(ISBLANK('Program Requirements'!A158),\"\",('Program Requirements'!A158))","v":""},null,null,null,{"$f":"IF(ISBLANK('Program Requirements'!D158),\"\",'Program Requirements'!D158)","v":""},null,null,null,null,null,null,null,null,{"$f":"IF(D136=\"Yes\",('Program Requirements'!G158),\"\")","v":""},{"$f":"IF(D136=\"Yes\",('Program Requirements'!L158),\"\")","v":""},{"$f":"IF(ISBLANK('Program Requirements'!M158),\"\",'Program Requirements'!M158)","v":{"$error":"#DIV/0!"}},0,null,0,null,null,null,0,null,""]
[{"$f":"IF(ISBLANK('Program Requirements'!A159),\"\",('Program Requirements'!A159))","v":""},null,null,null,{"$f":"IF(ISBLANK('Program Requirements'!D159),\"\",'Program Requirements'!D159)","v":""},null,null,null,null,null,null,null,null,{"$f":"IF(D137=\"Yes\",('Program Requirements'!G159),\"\")","v":""},{"$f":"IF(D137=\"Yes\",('Program Requirements'!L159),\"\")","v":""},{"$f":"IF(ISBLANK('Program Requirements'!M159),\"\",'Program Requirements'!M159)","v":{"$error":"#DIV/0!"}},0,null,0,null,null,null,0,null,""]
[{"$f":"IF(ISBLANK('Program Requirements'!A160),\"\",('Program Requirements'!A160))","v":""},null,null,null,{"$f":"IF(ISBLANK('Program Requirements'!D160),\"\",'Program Requirements'!D160)","v":""},null,null,null,null,null,null,null,null,{"$f":"IF(D138=\"Yes\",('Program Requirements'!G160),\"\")","v":""},{"$f":"IF(D138=\"Yes\",('Program Requirements'!L160),\"\")","v":""},{"$f":"IF(ISBLANK('Program Requirements'!M160),\"\",'Program Requirements'!M160)","v":{"$error":"#DIV/0!"}},0,null,0,null,null,null,0,null,""]
[{"$f":"IF(ISBLANK('Program Requirements'!A161),\"\",('Program Requirements'!A161))","v":""},null,null,null,{"$f":"IF(ISBLANK('Program Requirements'!D161),\"\",'Program Requirements'!D161)","v":""},null,null,null,null,null,null,null,null,{"$f":"IF(D139=\"Yes\",('Program Requirements'!G161),\"\")","v":""},{"$f":"IF(D139=\"Yes\",('Program Requirements'!L161),\"\")","v":""},{"$f":"IF(ISBLANK('Program Requirements'!M161),\"\",'Program Requirements'!M161)","v":{"$error":"#DIV/0!"}},0,null,0,null,null,null,0,null,""]
[{"$f":"IF(ISBLANK('Program Requirements'!A162),\"\",('Program Requirements'!A162))","v":""},null,null,null,{"$f":"IF(ISBLANK('Program Requirements'!D162),\"\",'Program Requirements'!D162)","v":""},null,null,null,null,null,null,null,null,{"$f":"IF(D140=\"Yes\",('Program Requirements'!G162),\"\")","v":""},{"$f":"IF(D140=\"Yes\",('Program Requirements'!L162),\"\")","v":""},{"$f":"IF(ISBLANK('Program Requirements'!M162),\"\",'Program Requirements'!M162)","v":{"$error":"#DIV/0!"}},0,null,0,null,null,null,0,null,""]
[{"$f":"IF(ISBLANK('Program Requirements'!A163),\"\",('Program Requirements'!A163))","v":""},null,null,null,{"$f":"IF(ISBLANK('Program Requirements'!D163),\"\",'Program Requirements'!D163)","v":""},null,null,null,null,null,null,null,null,{"$f":"IF(D141=\"Yes\",('Program Requirements'!G163),\"\")","v":""},{"$f":"IF(D141=\"Yes\",('Program Requirements'!L163),\"\")","v":""},{"$f":"IF(ISBLANK('Program Requirements'!M163),\"\",'Program Requirements'!M163)","v":{"$error":"#DIV/0!"}},0,null,0,null,null,null,0,null,""]
[{"$f":"IF(ISBLANK('Program Requirements'!A164),\"\",('Program Requirements'!A164))","v":""},null,null,null,{"$f":"IF(ISBLANK('Program Requirements'!D164),\"\",'Program Requirements'!D164)","v":""},null,null,null,null,null,null,null,null,{"$f":"IF(D142=\"Yes\",('Program Requirements'!G164),\"\")","v":""},{"$f":"IF(D142=\"Yes\",('Program Requirements'!L164),\"\")","v":""},{"$f":"IF(ISBLANK('Program Requirements'!M164),\"\",'Program Requirements'!M164)","v":{"$error":"#DIV/0!"}},0,null,0,null,null,null,0,null,""]
[{"$f":"IF(ISBLANK('Program Requirements'!A165),\"\",('Program Requirements'!A165))","v":""},null,null,null,{"$f":"IF(ISBLANK('Program Requirements'!D165),\"\",'Program Requirements'!D165)","v":""},null,null,null,null,null,null,null,null,{"$f":"IF(D143=\"Yes\",('Program Requirements'!G165),\"\")","v":""},{"$f":"IF(D143=\"Yes\",('Program Requirements'!L165),\"\")","v":""},{"$f":"IF(ISBLANK('Program Requirements'!M165),\"\",'Program Requirements'!M165)","v":{"$error":"#DIV/0!"}},0,null,0,null,null,null,0,null,""]
[{"$f":"IF(ISBLANK('Program Requirements'!A166),\"\",('Program Requirements'!A166))","v":""},null,null,null,{"$f":"IF(ISBLANK('Program Requirements'!D166),\"\",'Program Requirements'!D166)","v":""},null,null,null,null,null,null,null,null,{"$f":"IF(D144=\"Yes\",('Program Requirements'!G166),\"\")","v":""},{"$f":"IF(D144=\"Yes\",('Program Requirements'!L166),\"\")","v":""},{"$f":"IF(ISBLANK('Program Requirements'!M166),\"\",'Program Requirements'!M166)","v":{"$error":"#DIV/0!"}},0,null,0,null,null,null,0,null,""]
[{"$f":"IF(ISBLANK('Program Requirements'!A167),\"\",('Program Requirements'!A167))","v":""},null,null,null,{"$f":"IF(ISBLANK('Program Requirements'!D167),\"\",'Program Requirements'!D167)","v":""},null,null,null,null,null,null,null,null,{"$f":"IF(D145=\"Yes\",('Program Requirements'!G167),\"\")","v":""},{"$f":"IF(D145=\"Yes\",('Program Requirements'!L167),\"\")","v":""},{"$f":"IF(ISBLANK('Program Requirements'!M167),\"\",'Program Requirements'!M167)","v":{"$error":"#DIV/0!"}},0,null,0,null,null,null,0,null,""]
[{"$f":"IF(ISBLANK('Program Requirements'!A168),\"\",('Program Requirements'!A168))","v":""},null,null,null,{"$f":"IF(ISBLANK('Program Requirements'!D168),\"\",'Program Requirements'!D168)","v":""},null,null,null,null,null,null,null,null,{"$f":"IF(D146=\"Yes\",('Program Requirements'!G168),\"\")","v":""},{"$f":"IF(D146=\"Yes\",('Program Requirements'!L168),\"\")","v":""},{"$f":"IF(ISBLANK('Program Requirements'!M168),\"\",'Program Requirements'!M168)","v":{"$error":"#DIV/0!"}},0,null,0,null,null,null,0,null,""]
[{"$f":"IF(ISBLANK('Program Requirements'!A169),\"\",('Program Requirements'!A169))","v":""},null,null,null,{"$f":"IF(ISBLANK('Program Requirements'!D169),\"\",'Program Requirements'!D169)","v":""},null,null,null,null,null,null,null,null,{"$f":"IF(D147=\"Yes\",('Program Requirements'!G169),\"\")","v":""},{"$f":"IF(D147=\"Yes\",('Program Requirements'!L169),\"\")","v":""},{"$f":"IF(ISBLANK('Program Requirements'!M169),\"\",'Program Requirements'!M169)","v":{"$error":"#DIV/0!"}},0,null,0,null,null,null,0,null,""]
[{"$f":"IF(ISBLANK('Program Requirements'!A170),\"\",('Program Requirements'!A170))","v":""},null,null,null,{"$f":"IF(ISBLANK('Program Requirements'!D170),\"\",'Program Requirements'!D170)","v":""},null,null,null,null,null,null,null,null,{"$f":"IF(D148=\"Yes\",('Program Requirements'!G170),\"\")","v":""},{"$f":"IF(D148=\"Yes\",('Program Requirements'!L170),\"\")","v":""},{"$f":"IF(ISBLANK('Program Requirements'!M170),\"\",'Program Requirements'!M170)","v":{"$error":"#DIV/0!"}},0,null,0,null,null,null,0,null,""]
[{"$f":"IF(ISBLANK('Program Requirements'!A171),\"\",('Program Requirements'!A171))","v":""},null,null,null,{"$f":"IF(ISBLANK('Program Requirements'!D171),\"\",'Program Requirements'!D171)","v":""},null,null,null,null,null,null,null,null,{"$f":"IF(D149=\"Yes\",('Program Requirements'!G171),\"\")","v":""},{"$f":"IF(D149=\"Yes\",('Program Requirements'!L171),\"\")","v":""},{"$f":"IF(ISBLANK('Program Requirements'!M171),\"\",'Program Requirements'!M171)","v":{"$error":"#DIV/0!"}},0,null,0,null,null,null,0,null,""]
[{"$f":"IF(ISBLANK('Program Requirements'!A172),\"\",('Program Requirements'!A172))","v":""},null,null,null,{"$f":"IF(ISBLANK('Program Requirements'!D172),\"\",'Program Requirements'!D172)","v":""},null,null,null,null,null,null,null,null,{"$f":"IF(D150=\"Yes\",('Program Requirements'!G172),\"\")","v":""},{"$f":"IF(D150=\"Yes\",('Program Requirements'!L172),\"\")","v":""},{"$f":"IF(ISBLANK('Program Requirements'!M172),\"\",'Program Requirements'!M172)","v":{"$error":"#DIV/0!"}},0,null,0,null,null,null,0,null,""]
[{"$f":"IF(ISBLANK('Program Requirements'!A173),\"\",('Program Requirements'!A173))","v":""},null,null,null,{"$f":"IF(ISBLANK('Program Requirements'!D173),\"\",'Program Requirements'!D173)","v":""},null,null,null,null,null,null,null,null,{"$f":"IF(D151=\"Yes\",('Program Requirements'!G173),\"\")","v":""},{"$f":"IF(D151=\"Yes\",('Program Requirements'!L173),\"\")","v":""},{"$f":"IF(ISBLANK('Program Requirements'!M173),\"\",'Program Requirements'!M173)","v":{"$error":"#DIV/0!"}},0,null,0,null,null,null,{"$f":"IF(SUM(U151)=0,SUM(Q151),IF(SUM(Q151,U151)=U151,\"ERROR\",SUM(Q151,U151)))","v":0},null,""]
[{"$f":"IF(ISBLANK('Program Requirements'!A174),\"\",('Program Requirements'!A174))","v":""},null,null,null,{"$f":"IF(ISBLANK('Program Requirements'!D174),\"\",'Program Requirements'!D174)","v":""},null,null,null,null,null,null,null,null,{"$f":"IF(D152=\"Yes\",('Program Requirements'!G174),\"\")","v":""},{"$f":"IF(D152=\"Yes\",('Program Requirements'!L174),\"\")","v":""},{"$f":"IF(ISBLANK('Program Requirements'!M174),\"\",'Program Requirements'!M174)","v":{"$error":"#DIV/0!"}},0,null,0,null,null,null,0,null,""]
[{"$f":"IF(ISBLANK('Program Requirements'!A175),\"\",('Program Requirements'!A175))","v":""},null,null,null,{"$f":"IF(ISBLANK('Program Requirements'!D175),\"\",'Program Requirements'!D175)","v":""},null,null,null,null,null,null,null,null,{"$f":"IF(D153=\"Yes\",('Program Requirements'!G175),\"\")","v":""},{"$f":"IF(D153=\"Yes\",('Program Requirements'!L175),\"\")","v":""},{"$f":"IF(ISBLANK('Program Requirements'!M175),\"\",'Program Requirements'!M175)","v":{"$error":"#DIV/0!"}},0,null,0,null,null,null,0,null,""]
[{"$f":"IF(ISBLANK('Program Requirements'!A176),\"\",('Program Requirements'!A176))","v":""},null,null,null,{"$f":"IF(ISBLANK('Program Requirements'!D176),\"\",'Program Requirements'!D176)","v":""},null,null,null,null,null,null,null,null,{"$f":"IF(D154=\"Yes\",('Program Requirements'!G176),\"\")","v":""},{"$f":"IF(D154=\"Yes\",('Program Requirements'!L176),\"\")","v":""},{"$f":"IF(ISBLANK('Program Requirements'!M176),\"\",'Program Requirements'!M176)","v":{"$error":"#DIV/0!"}},0,null,0,null,null,null,0,null,""]
[{"$f":"IF(ISBLANK('Program Requirements'!A177),\"\",('Program Requirements'!A177))","v":""},null,null,null,{"$f":"IF(ISBLANK('Program Requirements'!D177),\"\",'Program Requirements'!D177)","v":""},null,null,null,null,null,null,null,null,{"$f":"IF(D155=\"Yes\",('Program Requirements'!G177),\"\")","v":""},{"$f":"IF(D155=\"Yes\",('Program Requirements'!L177),\"\")","v":""},{"$f":"IF(ISBLANK('Program Requirements'!M177),\"\",'Program Requirements'!M177)","v":{"$error":"#DIV/0!"}},0,null,0,null,null,null,0,null,""]
[{"$f":"IF(ISBLANK('Program Requirements'!A178),\"\",('Program Requirements'!A178))","v":""},null,null,null,{"$f":"IF(ISBLANK('Program Requirements'!D178),\"\",'Program Requirements'!D178)","v":""},null,null,null,null,null,null,null,null,{"$f":"IF(D156=\"Yes\",('Program Requirements'!G178),\"\")","v":""},{"$f":"IF(D156=\"Yes\",('Program Requirements'!L178),\"\")","v":""},{"$f":"IF(ISBLANK('Program Requirements'!M178),\"\",'Program Requirements'!M178)","v":{"$error":"#DIV/0!"}},0,null,0,null,null,null,0,null,""]
[{"$f":"IF(ISBLANK('Program Requirements'!A179),\"\",('Program Requirements'!A179))","v":""},null,null,null,{"$f":"IF(ISBLANK('Program Requirements'!D179),\"\",'Program Requirements'!D179)","v":""},null,null,null,null,null,null,null,null,{"$f":"IF(D157=\"Yes\",('Program Requirements'!G179),\"\")","v":""},{"$f":"IF(D157=\"Yes\",('Program Requirements'!L179),\"\")","v":""},{"$f":"IF(ISBLANK('Program Requirements'!M179),\"\",'Program Requirements'!M179)","v":{"$error":"#DIV/0!"}},0,null,0,null,null,null,0,null,""]
[{"$f":"IF(ISBLANK('Program Requirements'!A180),\"\",('Program Requirements'!A180))","v":""},null,null,null,{"$f":"IF(ISBLANK('Program Requirements'!D180),\"\",'Program Requirements'!D180)","v":""},null,null,null,null,null,null,null,null,{"$f":"IF(D158=\"Yes\",('Program Requirements'!G180),\"\")","v":""},{"$f":"IF(D158=\"Yes\",('Program Requirements'!L180),\"\")","v":""},{"$f":"IF(ISBLANK('Program Requirements'!M180),\"\",'Program Requirements'!M180)","v":{"$error":"#DIV/0!"}},0,null,0,null,null,null,0,null,""]
[{"$f":"IF(ISBLANK('Program Requirements'!A181),\"\",('Program Requirements'!A181))","v":""},null,null,null,{"$f":"IF(ISBLANK('Program Requirements'!D181),\"\",'Program Requirements'!D181)","v":""},null,null,null,null,null,null,null,null,{"$f":"IF(D159=\"Yes\",('Program Requirements'!G181),\"\")","v":""},{"$f":"IF(D159=\"Yes\",('Program Requirements'!L181),\"\")","v":""},{"$f":"IF(ISBLANK('Program Requirements'!M181),\"\",'Program Requirements'!M181)","v":{"$error":"#DIV/0!"}},0,null,0,null,null,null,0,null,""]
[{"$f":"IF(ISBLANK('Program Requirements'!A182),\"\",('Program Requirements'!A182))","v":""},null,null,null,{"$f":"IF(ISBLANK('Program Requirements'!D182),\"\",'Program Requirements'!D182)","v":""},null,null,null,null,null,null,null,null,{"$f":"IF(D160=\"Yes\",('Program Requirements'!G182),\"\")","v":""},{"$f":"IF(D160=\"Yes\",('Program Requirements'!L182),\"\")","v":""},{"$f":"IF(ISBLANK('Program Requirements'!M182),\"\",'Program Requirements'!M182)","v":{"$error":"#DIV/0!"}},0,null,0,null,null,null,0,null,""]
[{"$f":"IF(ISBLANK('Program Requirements'!A183),\"\",('Program Requirements'!A183))","v":""},null,null,null,{"$f":"IF(ISBLANK('Program Requirements'!D183),\"\",'Program Requirements'!D183)","v":""},null,null,null,null,null,null,null,null,{"$f":"IF(D161=\"Yes\",('Program Requirements'!G183),\"\")","v":""},{"$f":"IF(D161=\"Yes\",('Program Requirements'!L183),\"\")","v":""},{"$f":"IF(ISBLANK('Program Requirements'!M183),\"\",'Program Requirements'!M183)","v":{"$error":"#DIV/0!"}},0,null,0,null,null,null,0,null,""]
[{"$f":"IF(ISBLANK('Program Requirements'!A184),\"\",('Program Requirements'!A184))","v":""},null,null,null,{"$f":"IF(ISBLANK('Program Requirements'!D184),\"\",'Program Requirements'!D184)","v":""},null,null,null,null,null,null,null,null,{"$f":"IF(D162=\"Yes\",('Program Requirements'!G184),\"\")","v":""},{"$f":"IF(D162=\"Yes\",('Program Requirements'!L184),\"\")","v":""},{"$f":"IF(ISBLANK('Program Requirements'!M184),\"\",'Program Requirements'!M184)","v":{"$error":"#DIV/0!"}},0,null,0,null,null,null,0,null,""]
[{"$f":"IF(ISBLANK('Program Requirements'!A185),\"\",('Program Requirements'!A185))","v":""},null,null,null,{"$f":"IF(ISBLANK('Program Requirements'!D185),\"\",'Program Requirements'!D185)","v":""},null,null,null,null,null,null,null,null,{"$f":"IF(D163=\"Yes\",('Program Requirements'!G185),\"\")","v":""},{"$f":"IF(D163=\"Yes\",('Program Requirements'!L185),\"\")","v":""},{"$f":"IF(ISBLANK('Program Requirements'!M185),\"\",'Program Requirements'!M185)","v":{"$error":"#DIV/0!"}},0,null,0,null,null,null,0,null,""]
[{"$f":"IF(ISBLANK('Program Requirements'!A186),\"\",('Program Requirements'!A186))","v":""},null,null,null,{"$f":"IF(ISBLANK('Program Requirements'!D186),\"\",'Program Requirements'!D186)","v":""},null,null,null,null,null,null,null,null,{"$f":"IF(D164=\"Yes\",('Program Requirements'!G186),\"\")","v":""},{"$f":"IF(D164=\"Yes\",('Program Requirements'!L186),\"\")","v":""},{"$f":"IF(ISBLANK('Program Requirements'!M186),\"\",'Program Requirements'!M186)","v":{"$error":"#DIV/0!"}},0,null,0,null,null,null,0,null,""]
[{"$f":"IF(ISBLANK('Program Requirements'!A187),\"\",('Program Requirements'!A187))","v":""},null,null,null,{"$f":"IF(ISBLANK('Program Requirements'!D187),\"\",'Program Requirements'!D187)","v":""},null,null,null,null,null,null,null,null,{"$f":"IF(D165=\"Yes\",('Program Requirements'!G187),\"\")","v":""},{"$f":"IF(D165=\"Yes\",('Program Requirements'!L187),\"\")","v":""},{"$f":"IF(ISBLANK('Program Requirements'!M187),\"\",'Program Requirements'!M187)","v":{"$error":"#DIV/0!"}},0,null,0,null,null,null,0,null,""]
[{"$f":"IF(ISBLANK('Program Requirements'!A188),\"\",('Program Requirements'!A188))","v":""},null,null,null,{"$f":"IF(ISBLANK('Program Requirements'!D188),\"\",'Program Requirements'!D188)","v":""},null,null,null,null,null,null,null,null,{"$f":"IF(D166=\"Yes\",('Program Requirements'!G188),\"\")","v":""},{"$f":"IF(D166=\"Yes\",('Program Requirements'!L188),\"\")","v":""},{"$f":"IF(ISBLANK('Program Requirements'!M188),\"\",'Program Requirements'!M188)","v":{"$error":"#DIV/0!"}},0,null,0,null,null,null,0,null,""]
[{"$f":"IF(ISBLANK('Program Requirements'!A189),\"\",('Program Requirements'!A189))","v":""},null,null,null,{"$f":"IF(ISBLANK('Program Requirements'!D189),\"\",'Program Requirements'!D189)","v":""},null,null,null,null,null,null,null,null,{"$f":"IF(D167=\"Yes\",('Program Requirements'!G189),\"\")","v":""},{"$f":"IF(D167=\"Yes\",('Program Requirements'!L189),\"\")","v":""},{"$f":"IF(ISBLANK('Program Requirements'!M189),\"\",'Program Requirements'!M189)","v":{"$error":"#DIV/0!"}},0,null,0,null,null,null,0,null,""]
[{"$f":"IF(ISBLANK('Program Requirements'!A190),\"\",('Program Requirements'!A190))","v":""},null,null,null,{"$f":"IF(ISBLANK('Program Requirements'!D190),\"\",'Program Requirements'!D190)","v":""},null,null,null,null,null,null,null,null,{"$f":"IF(D168=\"Yes\",('Program Requirements'!G190),\"\")","v":""},{"$f":"IF(D168=\"Yes\",('Program Requirements'!L190),\"\")","v":""},{"$f":"IF(ISBLANK('Program Requirements'!M190),\"\",'Program Requirements'!M190)","v":{"$error":"#DIV/0!"}},0,null,0,null,null,null,0,null,""]
[{"$f":"IF(ISBLANK('Program Requirements'!A191),\"\",('Program Requirements'!A191))","v":""},null,null,null,{"$f":"IF(ISBLANK('Program Requirements'!D191),\"\",'Program Requirements'!D191)","v":""},null,null,null,null,null,null,null,null,{"$f":"IF(D169=\"Yes\",('Program Requirements'!G191),\"\")","v":""},{"$f":"IF(D169=\"Yes\",('Program Requirements'!L191),\"\")","v":""},{"$f":"IF(ISBLANK('Program Requirements'!M191),\"\",'Program Requirements'!M191)","v":{"$error":"#DIV/0!"}},0,null,0,null,null,null,0,null,""]
[{"$f":"IF(ISBLANK('Program Requirements'!A192),\"\",('Program Requirements'!A192))","v":""},null,null,null,{"$f":"IF(ISBLANK('Program Requirements'!D192),\"\",'Program Requirements'!D192)","v":""},null,null,null,null,null,null,null,null,{"$f":"IF(D170=\"Yes\",('Program Requirements'!G192),\"\")","v":""},{"$f":"IF(D170=\"Yes\",('Program Requirements'!L192),\"\")","v":""},{"$f":"IF(ISBLANK('Program Requirements'!M192),\"\",'Program Requirements'!M192)","v":{"$error":"#DIV/0!"}},0,null,0,null,null,null,0,null,""]
[{"$f":"IF(ISBLANK('Program Requirements'!A193),\"\",('Program Requirements'!A193))","v":""},null,null,null,{"$f":"IF(ISBLANK('Program Requirements'!D193),\"\",'Program Requirements'!D193)","v":""},null,null,null,null,null,null,null,null,{"$f":"IF(D171=\"Yes\",('Program Requirements'!G193),\"\")","v":""},{"$f":"IF(D171=\"Yes\",('Program Requirements'!L193),\"\")","v":""},{"$f":"IF(ISBLANK('Program Requirements'!M193),\"\",'Program Requirements'!M193)","v":{"$error":"#DIV/0!"}},0,null,0,null,null,null,0,null,""]
[{"$f":"IF(ISBLANK('Program Requirements'!A194),\"\",('Program Requirements'!A194))","v":""},null,null,null,{"$f":"IF(ISBLANK('Program Requirements'!D194),\"\",'Program Requirements'!D194)","v":""},null,null,null,null,null,null,null,null,{"$f":"IF(D172=\"Yes\",('Program Requirements'!G194),\"\")","v":""},{"$f":"IF(D172=\"Yes\",('Program Requirements'!L194),\"\")","v":""},{"$f":"IF(ISBLANK('Program Requirements'!M194),\"\",'Program Requirements'!M194)","v":{"$error":"#DIV/0!"}},0,null,0,null,null,null,0,null,""]
[{"$f":"IF(ISBLANK('Program Requirements'!A195),\"\",('Program Requirements'!A195))","v":""},null,null,null,{"$f":"IF(ISBLANK('Program Requirements'!D195),\"\",'Program Requirements'!D195)","v":""},null,null,null,null,null,null,null,null,{"$f":"IF(D173=\"Yes\",('Program Requirements'!G195),\"\")","v":""},{"$f":"IF(D173=\"Yes\",('Program Requirements'!L195),\"\")","v":""},{"$f":"IF(ISBLANK('Program Requirements'!M195),\"\",'Program Requirements'!M195)","v":{"$error":"#DIV/0!"}},0,null,0,null,null,null,0,null,""]
[{"$f":"IF(ISBLANK('Program Requirements'!A196),\"\",('Program Requirements'!A196))","v":""},null,null,null,{"$f":"IF(ISBLANK('Program Requirements'!D196),\"\",'Program Requirements'!D196)","v":""},null,null,null,null,null,null,null,null,{"$f":"IF(D174=\"Yes\",('Program Requirements'!G196),\"\")","v":""},{"$f":"IF(D174=\"Yes\",('Program Requirements'!L196),\"\")","v":""},{"$f":"IF(ISBLANK('Program Requirements'!M196),\"\",'Program Requirements'!M196)","v":{"$error":"#DIV/0!"}},0,null,0,null,null,null,0,null,""]
[{"$f":"IF(ISBLANK('Program Requirements'!A197),\"\",('Program Requirements'!A197))","v":""},null,null,null,{"$f":"IF(ISBLANK('Program Requirements'!D197),\"\",'Program Requirements'!D197)","v":""},null,null,null,null,null,null,null,null,{"$f":"IF(D175=\"Yes\",('Program Requirements'!G197),\"\")","v":""},{"$f":"IF(D175=\"Yes\",('Program Requirements'!L197),\"\")","v":""},{"$f":"IF(ISBLANK('Program Requirements'!M197),\"\",'Program Requirements'!M197)","v":{"$error":"#DIV/0!"}},0,null,0,null,null,null,0,null,""]
[{"$f":"IF(ISBLANK('Program Requirements'!A198),\"\",('Program Requirements'!A198))","v":""},null,null,null,{"$f":"IF(ISBLANK('Program Requirements'!D198),\"\",'Program Requirements'!D198)","v":""},null,null,null,null,null,null,null,null,{"$f":"IF(D176=\"Yes\",('Program Requirements'!G198),\"\")","v":""},{"$f":"IF(D176=\"Yes\",('Program Requirements'!L198),\"\")","v":""},{"$f":"IF(ISBLANK('Program Requirements'!M198),\"\",'Program Requirements'!M198)","v":{"$error":"#DIV/0!"}},0,null,0,null,null,null,0,null,""]
[{"$f":"IF(ISBLANK('Program Requirements'!A199),\"\",('Program Requirements'!A199))","v":""},null,null,null,{"$f":"IF(ISBLANK('Program Requirements'!D199),\"\",'Program Requirements'!D199)","v":""},null,null,null,null,null,null,null,null,{"$f":"IF(D177=\"Yes\",('Program Requirements'!G199),\"\")","v":""},{"$f":"IF(D177=\"Yes\",('Program Requirements'!L199),\"\")","v":""},{"$f":"IF(ISBLANK('Program Requirements'!M199),\"\",'Program Requirements'!M199)","v":{"$error":"#DIV/0!"}},0,null,0,null,null,null,0,null,""]
[{"$f":"IF(ISBLANK('Program Requirements'!A200),\"\",('Program Requirements'!A200))","v":""},null,null,null,{"$f":"IF(ISBLANK('Program Requirements'!D200),\"\",'Program Requirements'!D200)","v":""},null,null,null,null,null,null,null,null,{"$f":"IF(D178=\"Yes\",('Program Requirements'!G200),\"\")","v":""},{"$f":"IF(D178=\"Yes\",('Program Requirements'!L200),\"\")","v":""},{"$f":"IF(ISBLANK('Program Requirements'!M200),\"\",'Program Requirements'!M200)","v":{"$error":"#DIV/0!"}},0,null,0,null,null,null,0,null,""]
[{"$f":"IF(ISBLANK('Program Requirements'!A201),\"\",('Program Requirements'!A201))","v":""},null,null,null,{"$f":"IF(ISBLANK('Program Requirements'!D201),\"\",'Program Requirements'!D201)","v":""},null,null,null,null,null,null,null,null,{"$f":"IF(D179=\"Yes\",('Program Requirements'!G201),\"\")","v":""},{"$f":"IF(D179=\"Yes\",('Program Requirements'!L201),\"\")","v":""},{"$f":"IF(ISBLANK('Program Requirements'!M201),\"\",'Program Requirements'!M201)","v":{"$error":"#DIV/0!"}},0,null,0,null,null,null,0,null,""]
[{"$f":"IF(ISBLANK('Program Requirements'!A202),\"\",('Program Requirements'!A202))","v":""},null,null,null,{"$f":"IF(ISBLANK('Program Requirements'!D202),\"\",'Program Requirements'!D202)","v":""},null,null,null,null,null,null,null,null,{"$f":"IF(D180=\"Yes\",('Program Requirements'!G202),\"\")","v":""},{"$f":"IF(D180=\"Yes\",('Program Requirements'!L202),\"\")","v":""},{"$f":"IF(ISBLANK('Program Requirements'!M202),\"\",'Program Requirements'!M202)","v":{"$error":"#DIV/0!"}},0,null,0,null,null,null,0,null,""]
[{"$f":"IF(ISBLANK('Program Requirements'!A203),\"\",('Program Requirements'!A203))","v":""},null,null,null,{"$f":"IF(ISBLANK('Program Requirements'!D203),\"\",'Program Requirements'!D203)","v":""},null,null,null,null,null,null,null,null,{"$f":"IF(D181=\"Yes\",('Program Requirements'!G203),\"\")","v":""},{"$f":"IF(D181=\"Yes\",('Program Requirements'!L203),\"\")","v":""},{"$f":"IF(ISBLANK('Program Requirements'!M203),\"\",'Program Requirements'!M203)","v":{"$error":"#DIV/0!"}},0,null,0,null,null,null,0,null,""]
[{"$f":"IF(ISBLANK('Program Requirements'!A204),\"\",('Program Requirements'!A204))","v":""},null,null,null,{"$f":"IF(ISBLANK('Program Requirements'!D204),\"\",'Program Requirements'!D204)","v":""},null,null,null,null,null,null,null,null,{"$f":"IF(D182=\"Yes\",('Program Requirements'!G204),\"\")","v":""},{"$f":"IF(D182=\"Yes\",('Program Requirements'!L204),\"\")","v":""},{"$f":"IF(ISBLANK('Program Requirements'!M204),\"\",'Program Requirements'!M204)","v":{"$error":"#DIV/0!"}},0,null,0,null,null,null,0,null,""]
[{"$f":"IF(ISBLANK('Program Requirements'!A205),\"\",('Program Requirements'!A205))","v":""},null,null,null,{"$f":"IF(ISBLANK('Program Requirements'!D205),\"\",'Program Requirements'!D205)","v":""},null,null,null,null,null,null,null,null,{"$f":"IF(D183=\"Yes\",('Program Requirements'!G205),\"\")","v":""},{"$f":"IF(D183=\"Yes\",('Program Requirements'!L205),\"\")","v":""},{"$f":"IF(ISBLANK('Program Requirements'!M205),\"\",'Program Requirements'!M205)","v":{"$error":"#DIV/0!"}},{"$f":"IF(D183=\"Yes\",(O183)*$Q$45,0)","v":0},null,0,null,null,null,0,null,{"$f":"IF(D183=\"Yes\",SUM(W183)/SUM(O183),\"\")","v":""}]
[{"$f":"IF(ISBLANK('Program Requirements'!A206),\"\",('Program Requirements'!A206))","v":""},null,null,null,{"$f":"IF(ISBLANK('Program Requirements'!D206),\"\",'Program Requirements'!D206)","v":""},null,null,null,null,null,null,null,null,{"$f":"IF(D184=\"Yes\",('Program Requirements'!G206),\"\")","v":""},{"$f":"IF(D184=\"Yes\",('Program Requirements'!L206),\"\")","v":""},{"$f":"IF(ISBLANK('Program Requirements'!M206),\"\",'Program Requirements'!M206)","v":{"$error":"#DIV/0!"}},0,null,0,null,null,null,0,null,""]
[{"$f":"IF(ISBLANK('Program Requirements'!A207),\"\",('Program Requirements'!A207))","v":""},null,null,null,{"$f":"IF(ISBLANK('Program Requirements'!D207),\"\",'Program Requirements'!D207)","v":""},null,null,null,null,null,null,null,null,{"$f":"IF(D185=\"Yes\",('Program Requirements'!G207),\"\")","v":""},{"$f":"IF(D185=\"Yes\",('Program Requirements'!L207),\"\")","v":""},{"$f":"IF(ISBLANK('Program Requirements'!M207),\"\",'Program Requirements'!M207)","v":{"$error":"#DIV/0!"}},0,null,0,null,null,null,0,null,""]
[{"$f":"IF(ISBLANK('Program Requirements'!A208),\"\",('Program Requirements'!A208))","v":""},null,null,null,{"$f":"IF(ISBLANK('Program Requirements'!D208),\"\",'Program Requirements'!D208)","v":""},null,null,null,null,null,null,null,null,{"$f":"IF(D186=\"Yes\",('Program Requirements'!G208),\"\")","v":""},{"$f":"IF(D186=\"Yes\",('Program Requirements'!L208),\"\")","v":""},{"$f":"IF(ISBLANK('Program Requirements'!M208),\"\",'Program Requirements'!M208)","v":{"$error":"#DIV/0!"}},0,null,{"$f":"S185-Q186","v":0},null,null,null,0,null,""]
[{"$f":"IF(ISBLANK('Program Requirements'!A209),\"\",('Program Requirements'!A209))","v":""},null,null,null,{"$f":"IF(ISBLANK('Program Requirements'!D209),\"\",'Program Requirements'!D209)","v":""},null,null,null,null,null,null,null,null,{"$f":"IF(D187=\"Yes\",('Program Requirements'!G209),\"\")","v":""},{"$f":"IF(D187=\"Yes\",('Program Requirements'!L209),\"\")","v":""},{"$f":"IF(ISBLANK('Program Requirements'!M209),\"\",'Program Requirements'!M209)","v":{"$error":"#DIV/0!"}},0,null,0,null,null,null,0,null,""]
[{"$f":"IF(ISBLANK('Program Requirements'!A210),\"\",('Program Requirements'!A210))","v":""},null,null,null,{"$f":"IF(ISBLANK('Program Requirements'!D210),\"\",'Program Requirements'!D210)","v":""},null,null,null,null,null,null,null,null,{"$f":"IF(D188=\"Yes\",('Program Requirements'!G210),\"\")","v":""},{"$f":"IF(D188=\"Yes\",('Program Requirements'!L210),\"\")","v":""},{"$f":"IF(ISBLANK('Program Requirements'!M210),\"\",'Program Requirements'!M210)","v":{"$error":"#DIV/0!"}},0,null,0,null,null,null,0,null,""]
[{"$f":"IF(ISBLANK('Program Requirements'!A211),\"\",('Program Requirements'!A211))","v":""},null,null,null,{"$f":"IF(ISBLANK('Program Requirements'!D211),\"\",'Program Requirements'!D211)","v":""},null,null,null,null,null,null,null,null,{"$f":"IF(D189=\"Yes\",('Program Requirements'!G211),\"\")","v":""},{"$f":"IF(D189=\"Yes\",('Program Requirements'!L211),\"\")","v":""},{"$f":"IF(ISBLANK('Program Requirements'!M211),\"\",'Program Requirements'!M211)","v":{"$error":"#DIV/0!"}},0,null,0,null,null,null,0,null,""]
[{"$f":"IF(ISBLANK('Program Requirements'!A212),\"\",('Program Requirements'!A212))","v":""},null,null,null,{"$f":"IF(ISBLANK('Program Requirements'!D212),\"\",'Program Requirements'!D212)","v":""},null,null,null,null,null,null,null,null,{"$f":"IF(D190=\"Yes\",('Program Requirements'!G212),\"\")","v":""},{"$f":"IF(D190=\"Yes\",('Program Requirements'!L212),\"\")","v":""},{"$f":"IF(ISBLANK('Program Requirements'!M212),\"\",'Program Requirements'!M212)","v":{"$error":"#DIV/0!"}},0,null,0,null,null,null,0,null,""]
[{"$f":"IF(ISBLANK('Program Requirements'!A213),\"\",('Program Requirements'!A213))","v":""},null,null,null,{"$f":"IF(ISBLANK('Program Requirements'!D213),\"\",'Program Requirements'!D213)","v":""},null,null,null,null,null,null,null,null,{"$f":"IF(D191=\"Yes\",('Program Requirements'!G213),\"\")","v":""},{"$f":"IF(D191=\"Yes\",('Program Requirements'!L213),\"\")","v":""},{"$f":"IF(ISBLANK('Program Requirements'!M213),\"\",'Program Requirements'!M213)","v":{"$error":"#DIV/0!"}},0,null,0,null,null,null,0,null,""]
[{"$f":"IF(ISBLANK('Program Requirements'!A214),\"\",('Program Requirements'!A214))","v":""},null,null,null,{"$f":"IF(ISBLANK('Program Requirements'!D214),\"\",'Program Requirements'!D214)","v":""},null,null,null,null,null,null,null,null,{"$f":"IF(D192=\"Yes\",('Program Requirements'!G214),\"\")","v":""},{"$f":"IF(D192=\"Yes\",('Program Requirements'!L214),\"\")","v":""},{"$f":"IF(ISBLANK('Program Requirements'!M214),\"\",'Program Requirements'!M214)","v":{"$error":"#DIV/0!"}},0,null,0,null,null,null,0,null,""]
[{"$f":"IF(ISBLANK('Program Requirements'!A215),\"\",('Program Requirements'!A215))","v":""},null,null,null,{"$f":"IF(ISBLANK('Program Requirements'!D215),\"\",'Program Requirements'!D215)","v":""},null,null,null,null,null,null,null,null,{"$f":"IF(D193=\"Yes\",('Program Requirements'!G215),\"\")","v":""},{"$f":"IF(D193=\"Yes\",('Program Requirements'!L215),\"\")","v":""},{"$f":"IF(ISBLANK('Program Requirements'!M215),\"\",'Program Requirements'!M215)","v":{"$error":"#DIV/0!"}},0,null,0,null,null,null,0,null,""]
[{"$f":"IF(ISBLANK('Program Requirements'!A216),\"\",('Program Requirements'!A216))","v":""},null,null,null,{"$f":"IF(ISBLANK('Program Requirements'!D216),\"\",'Program Requirements'!D216)","v":""},null,null,null,null,null,null,null,null,{"$f":"IF(D194=\"Yes\",('Program Requirements'!G216),\"\")","v":""},{"$f":"IF(D194=\"Yes\",('Program Requirements'!L216),\"\")","v":""},{"$f":"IF(ISBLANK('Program Requirements'!M216),\"\",'Program Requirements'!M216)","v":{"$error":"#DIV/0!"}},0,null,0,null,null,null,0,null,""]
[{"$f":"IF(ISBLANK('Program Requirements'!A217),\"\",('Program Requirements'!A217))","v":""},null,null,null,{"$f":"IF(ISBLANK('Program Requirements'!D217),\"\",'Program Requirements'!D217)","v":""},null,null,null,null,null,null,null,null,{"$f":"IF(D195=\"Yes\",('Program Requirements'!G217),\"\")","v":""},{"$f":"IF(D195=\"Yes\",('Program Requirements'!L217),\"\")","v":""},{"$f":"IF(ISBLANK('Program Requirements'!M217),\"\",'Program Requirements'!M217)","v":{"$error":"#DIV/0!"}},0,null,0,null,null,null,0,null,""]
[{"$f":"IF(ISBLANK('Program Requirements'!A218),\"\",('Program Requirements'!A218))","v":""},null,null,null,{"$f":"IF(ISBLANK('Program Requirements'!D218),\"\",'Program Requirements'!D218)","v":""},null,null,null,null,null,null,null,null,{"$f":"IF(D196=\"Yes\",('Program Requirements'!G218),\"\")","v":""},{"$f":"IF(D196=\"Yes\",('Program Requirements'!L218),\"\")","v":""},{"$f":"IF(ISBLANK('Program Requirements'!M218),\"\",'Program Requirements'!M218)","v":{"$error":"#DIV/0!"}},0,null,0,null,null,null,0,null,""]
[{"$f":"IF(ISBLANK('Program Requirements'!A219),\"\",('Program Requirements'!A219))","v":""},null,null,null,{"$f":"IF(ISBLANK('Program Requirements'!D219),\"\",'Program Requirements'!D219)","v":""},null,null,null,null,null,null,null,null,{"$f":"IF(D197=\"Yes\",('Program Requirements'!G219),\"\")","v":""},{"$f":"IF(D197=\"Yes\",('Program Requirements'!L219),\"\")","v":""},{"$f":"IF(ISBLANK('Program Requirements'!M219),\"\",'Program Requirements'!M219)","v":{"$error":"#DIV/0!"}},0,null,0,null,null,null,0,null,""]
[{"$f":"IF(ISBLANK('Program Requirements'!A220),\"\",('Program Requirements'!A220))","v":""},null,null,null,{"$f":"IF(ISBLANK('Program Requirements'!D220),\"\",'Program Requirements'!D220)","v":""},null,null,null,null,null,null,null,null,{"$f":"IF(D198=\"Yes\",('Program Requirements'!G220),\"\")","v":""},{"$f":"IF(D198=\"Yes\",('Program Requirements'!L220),\"\")","v":""},{"$f":"IF(ISBLANK('Program Requirements'!M220),\"\",'Program Requirements'!M220)","v":{"$error":"#DIV/0!"}},0,null,0,null,null,null,0,null,""]
[{"$f":"IF(ISBLANK('Program Requirements'!A221),\"\",('Program Requirements'!A221))","v":""},null,null,null,{"$f":"IF(ISBLANK('Program Requirements'!D221),\"\",'Program Requirements'!D221)","v":""},null,null,null,null,null,null,null,null,{"$f":"IF(D199=\"Yes\",('Program Requirements'!G221),\"\")","v":""},{"$f":"IF(D199=\"Yes\",('Program Requirements'!L221),\"\")","v":""},{"$f":"IF(ISBLANK('Program Requirements'!M221),\"\",'Program Requirements'!M221)","v":{"$error":"#DIV/0!"}},0,null,0,null,null,null,0,null,""]
[{"$f":"IF(ISBLANK('Program Requirements'!A222),\"\",('Program Requirements'!A222))","v":""},null,null,null,{"$f":"IF(ISBLANK('Program Requirements'!D222),\"\",'Program Requirements'!D222)","v":""},null,null,null,null,null,null,null,null,{"$f":"IF(D200=\"Yes\",('Program Requirements'!G222),\"\")","v":""},{"$f":"IF(D200=\"Yes\",('Program Requirements'!L222),\"\")","v":""},{"$f":"IF(ISBLANK('Program Requirements'!M222),\"\",'Program Requirements'!M222)","v":{"$error":"#DIV/0!"}},0,null,0,null,null,null,0,null,""]
[{"$f":"IF(ISBLANK('Program Requirements'!A223),\"\",('Program Requirements'!A223))","v":""},null,null,null,{"$f":"IF(ISBLANK('Program Requirements'!D223),\"\",'Program Requirements'!D223)","v":""},null,null,null,null,null,null,null,null,{"$f":"IF(D201=\"Yes\",('Program Requirements'!G223),\"\")","v":""},{"$f":"IF(D201=\"Yes\",('Program Requirements'!L223),\"\")","v":""},{"$f":"IF(ISBLANK('Program Requirements'!M223),\"\",'Program Requirements'!M223)","v":{"$error":"#DIV/0!"}},0,null,0,null,null,null,0,null,""]
[{"$f":"IF(ISBLANK('Program Requirements'!A224),\"\",('Program Requirements'!A224))","v":""},null,null,null,{"$f":"IF(ISBLANK('Program Requirements'!D224),\"\",'Program Requirements'!D224)","v":""},null,null,null,null,null,null,null,null,{"$f":"IF(D202=\"Yes\",('Program Requirements'!G224),\"\")","v":""},{"$f":"IF(D202=\"Yes\",('Program Requirements'!L224),\"\")","v":""},{"$f":"IF(ISBLANK('Program Requirements'!M224),\"\",'Program Requirements'!M224)","v":{"$error":"#DIV/0!"}},0,null,0,null,null,null,0,null,""]
[{"$f":"IF(ISBLANK('Program Requirements'!A225),\"\",('Program Requirements'!A225))","v":""},null,null,null,{"$f":"IF(ISBLANK('Program Requirements'!D225),\"\",'Program Requirements'!D225)","v":""},null,null,null,null,null,null,null,null,{"$f":"IF(D203=\"Yes\",('Program Requirements'!G225),\"\")","v":""},{"$f":"IF(D203=\"Yes\",('Program Requirements'!L225),\"\")","v":""},{"$f":"IF(ISBLANK('Program Requirements'!M225),\"\",'Program Requirements'!M225)","v":{"$error":"#DIV/0!"}},0,null,0,null,null,null,0,null,""]
[{"$f":"IF(ISBLANK('Program Requirements'!A226),\"\",('Program Requirements'!A226))","v":""},null,null,null,{"$f":"IF(ISBLANK('Program Requirements'!D226),\"\",'Program Requirements'!D226)","v":""},null,null,null,null,null,null,null,null,{"$f":"IF(D204=\"Yes\",('Program Requirements'!G226),\"\")","v":""},{"$f":"IF(D204=\"Yes\",('Program Requirements'!L226),\"\")","v":""},{"$f":"IF(ISBLANK('Program Requirements'!M226),\"\",'Program Requirements'!M226)","v":{"$error":"#DIV/0!"}},0,null,0,null,null,null,0,null,""]
[{"$f":"IF(ISBLANK('Program Requirements'!A227),\"\",('Program Requirements'!A227))","v":""},null,null,null,{"$f":"IF(ISBLANK('Program Requirements'!D227),\"\",'Program Requirements'!D227)","v":""},null,null,null,null,null,null,null,null,{"$f":"IF(D205=\"Yes\",('Program Requirements'!G227),\"\")","v":""},{"$f":"IF(D205=\"Yes\",('Program Requirements'!L227),\"\")","v":""},{"$f":"IF(ISBLANK('Program Requirements'!M227),\"\",'Program Requirements'!M227)","v":{"$error":"#DIV/0!"}},0,null,0,null,null,null,0,null,""]
[{"$f":"IF(ISBLANK('Program Requirements'!A228),\"\",('Program Requirements'!A228))","v":""},null,null,null,{"$f":"IF(ISBLANK('Program Requirements'!D228),\"\",'Program Requirements'!D228)","v":""},null,null,null,null,null,null,null,null,{"$f":"IF(D206=\"Yes\",('Program Requirements'!G228),\"\")","v":""},{"$f":"IF(D206=\"Yes\",('Program Requirements'!L228),\"\")","v":""},{"$f":"IF(ISBLANK('Program Requirements'!M228),\"\",'Program Requirements'!M228)","v":{"$error":"#DIV/0!"}},0,null,0,null,null,null,0,null,""]
[{"$f":"IF(ISBLANK('Program Requirements'!A229),\"\",('Program Requirements'!A229))","v":""},null,null,null,{"$f":"IF(ISBLANK('Program Requirements'!D229),\"\",'Program Requirements'!D229)","v":""},null,null,null,null,null,null,null,null,{"$f":"IF(D207=\"Yes\",('Program Requirements'!G229),\"\")","v":""},{"$f":"IF(D207=\"Yes\",('Program Requirements'!L229),\"\")","v":""},{"$f":"IF(ISBLANK('Program Requirements'!M229),\"\",'Program Requirements'!M229)","v":{"$error":"#DIV/0!"}},0,null,0,null,null,null,0,null,""]
[{"$f":"IF(ISBLANK('Program Requirements'!A230),\"\",('Program Requirements'!A230))","v":""},null,null,null,{"$f":"IF(ISBLANK('Program Requirements'!D230),\"\",'Program Requirements'!D230)","v":""},null,null,null,null,null,null,null,null,{"$f":"IF(D208=\"Yes\",('Program Requirements'!G230),\"\")","v":""},{"$f":"IF(D208=\"Yes\",('Program Requirements'!L230),\"\")","v":""},{"$f":"IF(ISBLANK('Program Requirements'!M230),\"\",'Program Requirements'!M230)","v":{"$error":"#DIV/0!"}},0,null,0,null,null,null,0,null,""]
[{"$f":"IF(ISBLANK('Program Requirements'!A231),\"\",('Program Requirements'!A231))","v":""},null,null,null,{"$f":"IF(ISBLANK('Program Requirements'!D231),\"\",'Program Requirements'!D231)","v":""},null,null,null,null,null,null,null,null,{"$f":"IF(D209=\"Yes\",('Program Requirements'!G231),\"\")","v":""},{"$f":"IF(D209=\"Yes\",('Program Requirements'!L231),\"\")","v":""},{"$f":"IF(ISBLANK('Program Requirements'!M231),\"\",'Program Requirements'!M231)","v":{"$error":"#DIV/0!"}},0,null,0,null,null,null,0,null,""]
[{"$f":"IF(ISBLANK('Program Requirements'!A232),\"\",('Program Requirements'!A232))","v":""},null,null,null,{"$f":"IF(ISBLANK('Program Requirements'!D232),\"\",'Program Requirements'!D232)","v":""},null,null,null,null,null,null,null,null,{"$f":"IF(D210=\"Yes\",('Program Requirements'!G232),\"\")","v":""},{"$f":"IF(D210=\"Yes\",('Program Requirements'!L232),\"\")","v":""},{"$f":"IF(ISBLANK('Program Requirements'!M232),\"\",'Program Requirements'!M232)","v":{"$error":"#DIV/0!"}},0,null,0,null,null,null,0,null,""]
[{"$f":"IF(ISBLANK('Program Requirements'!A233),\"\",('Program Requirements'!A233))","v":""},null,null,null,{"$f":"IF(ISBLANK('Program Requirements'!D233),\"\",'Program Requirements'!D233)","v":""},null,null,null,null,null,null,null,null,{"$f":"IF(D211=\"Yes\",('Program Requirements'!G233),\"\")","v":""},{"$f":"IF(D211=\"Yes\",('Program Requirements'!L233),\"\")","v":""},{"$f":"IF(ISBLANK('Program Requirements'!M233),\"\",'Program Requirements'!M233)","v":{"$error":"#DIV/0!"}},0,null,0,null,null,null,0,null,""]
[{"$f":"IF(ISBLANK('Program Requirements'!A234),\"\",('Program Requirements'!A234))","v":""},null,null,null,{"$f":"IF(ISBLANK('Program Requirements'!D234),\"\",'Program Requirements'!D234)","v":""},null,null,null,null,null,null,null,null,{"$f":"IF(D212=\"Yes\",('Program Requirements'!G234),\"\")","v":""},{"$f":"IF(D212=\"Yes\",('Program Requirements'!L234),\"\")","v":""},{"$f":"IF(ISBLANK('Program Requirements'!M234),\"\",'Program Requirements'!M234)","v":{"$error":"#DIV/0!"}},0,null,0,null,null,null,0,null,""]
[{"$f":"IF(ISBLANK('Program Requirements'!A235),\"\",('Program Requirements'!A235))","v":""},null,null,null,{"$f":"IF(ISBLANK('Program Requirements'!D235),\"\",'Program Requirements'!D235)","v":""},null,null,null,null,null,null,null,null,{"$f":"IF(D213=\"Yes\",('Program Requirements'!G235),\"\")","v":""},{"$f":"IF(D213=\"Yes\",('Program Requirements'!L235),\"\")","v":""},{"$f":"IF(ISBLANK('Program Requirements'!M235),\"\",'Program Requirements'!M235)","v":{"$error":"#DIV/0!"}},0,null,0,null,null,null,0,null,""]
[{"$f":"IF(ISBLANK('Program Requirements'!A236),\"\",('Program Requirements'!A236))","v":""},null,null,null,{"$f":"IF(ISBLANK('Program Requirements'!D236),\"\",'Program Requirements'!D236)","v":""},null,null,null,null,null,null,null,null,{"$f":"IF(D214=\"Yes\",('Program Requirements'!G236),\"\")","v":""},{"$f":"IF(D214=\"Yes\",('Program Requirements'!L236),\"\")","v":""},{"$f":"IF(ISBLANK('Program Requirements'!M236),\"\",'Program Requirements'!M236)","v":{"$error":"#DIV/0!"}},0,null,0,null,null,null,0,null,""]
[{"$f":"IF(ISBLANK('Program Requirements'!A237),\"\",('Program Requirements'!A237))","v":""},null,null,null,{"$f":"IF(ISBLANK('Program Requirements'!D237),\"\",'Program Requirements'!D237)","v":""},null,null,null,null,null,null,null,null,{"$f":"IF(D215=\"Yes\",('Program Requirements'!G237),\"\")","v":""},{"$f":"IF(D215=\"Yes\",('Program Requirements'!L237),\"\")","v":""},{"$f":"IF(ISBLANK('Program Requirements'!M237),\"\",'Program Requirements'!M237)","v":{"$error":"#DIV/0!"}},0,null,0,null,null,null,{"$f":"IF(SUM(U215)=0,SUM(Q215),IF(SUM(Q215,U215)=U215,\"ERROR\",SUM(Q215,U215)))","v":0},null,""]
[{"$f":"IF(ISBLANK('Program Requirements'!A238),\"\",('Program Requirements'!A238))","v":""},null,null,null,{"$f":"IF(ISBLANK('Program Requirements'!D238),\"\",'Program Requirements'!D238)","v":""},null,null,null,null,null,null,null,null,{"$f":"IF(D216=\"Yes\",('Program Requirements'!G238),\"\")","v":""},{"$f":"IF(D216=\"Yes\",('Program Requirements'!L238),\"\")","v":""},{"$f":"IF(ISBLANK('Program Requirements'!M238),\"\",'Program Requirements'!M238)","v":{"$error":"#DIV/0!"}},0,null,0,null,null,null,0,null,""]
[{"$f":"IF(ISBLANK('Program Requirements'!A239),\"\",('Program Requirements'!A239))","v":""},null,null,null,{"$f":"IF(ISBLANK('Program Requirements'!D239),\"\",'Program Requirements'!D239)","v":""},null,null,null,null,null,null,null,null,{"$f":"IF(D217=\"Yes\",('Program Requirements'!G239),\"\")","v":""},{"$f":"IF(D217=\"Yes\",('Program Requirements'!L239),\"\")","v":""},{"$f":"IF(ISBLANK('Program Requirements'!M239),\"\",'Program Requirements'!M239)","v":{"$error":"#DIV/0!"}},0,null,0,null,null,null,0,null,""]
[{"$f":"IF(ISBLANK('Program Requirements'!A240),\"\",('Program Requirements'!A240))","v":""},null,null,null,{"$f":"IF(ISBLANK('Program Requirements'!D240),\"\",'Program Requirements'!D240)","v":""},null,null,null,null,null,null,null,null,{"$f":"IF(D218=\"Yes\",('Program Requirements'!G240),\"\")","v":""},{"$f":"IF(D218=\"Yes\",('Program Requirements'!L240),\"\")","v":""},{"$f":"IF(ISBLANK('Program Requirements'!M240),\"\",'Program Requirements'!M240)","v":{"$error":"#DIV/0!"}},0,null,0,null,null,null,0,null,""]
[{"$f":"IF(ISBLANK('Program Requirements'!A241),\"\",('Program Requirements'!A241))","v":""},null,null,null,{"$f":"IF(ISBLANK('Program Requirements'!D241),\"\",'Program Requirements'!D241)","v":""},null,null,null,null,null,null,null,null,{"$f":"IF(D219=\"Yes\",('Program Requirements'!G241),\"\")","v":""},{"$f":"IF(D219=\"Yes\",('Program Requirements'!L241),\"\")","v":""},{"$f":"IF(ISBLANK('Program Requirements'!M241),\"\",'Program Requirements'!M241)","v":{"$error":"#DIV/0!"}},0,null,0,null,null,null,0,null,""]
[{"$f":"IF(ISBLANK('Program Requirements'!A242),\"\",('Program Requirements'!A242))","v":""},null,null,null,{"$f":"IF(ISBLANK('Program Requirements'!D242),\"\",'Program Requirements'!D242)","v":""},null,null,null,null,null,null,null,null,{"$f":"IF(D220=\"Yes\",('Program Requirements'!G242),\"\")","v":""},{"$f":"IF(D220=\"Yes\",('Program Requirements'!L242),\"\")","v":""},{"$f":"IF(ISBLANK('Program Requirements'!M242),\"\",'Program Requirements'!M242)","v":{"$error":"#DIV/0!"}},0,null,0,null,null,null,0,null,""]
[{"$f":"IF(ISBLANK('Program Requirements'!A243),\"\",('Program Requirements'!A243))","v":""},null,null,null,{"$f":"IF(ISBLANK('Program Requirements'!D243),\"\",'Program Requirements'!D243)","v":""},null,null,null,null,null,null,null,null,{"$f":"IF(D221=\"Yes\",('Program Requirements'!G243),\"\")","v":""},{"$f":"IF(D221=\"Yes\",('Program Requirements'!L243),\"\")","v":""},{"$f":"IF(ISBLANK('Program Requirements'!M243),\"\",'Program Requirements'!M243)","v":{"$error":"#DIV/0!"}},0,null,0,null,null,null,0,null,""]
[{"$f":"IF(ISBLANK('Program Requirements'!A244),\"\",('Program Requirements'!A244))","v":""},null,null,null,{"$f":"IF(ISBLANK('Program Requirements'!D244),\"\",'Program Requirements'!D244)","v":""},null,null,null,null,null,null,null,null,{"$f":"IF(D222=\"Yes\",('Program Requirements'!G244),\"\")","v":""},{"$f":"IF(D222=\"Yes\",('Program Requirements'!L244),\"\")","v":""},{"$f":"IF(ISBLANK('Program Requirements'!M244),\"\",'Program Requirements'!M244)","v":{"$error":"#DIV/0!"}},0,null,0,null,null,null,0,null,""]
[{"$f":"IF(ISBLANK('Program Requirements'!A245),\"\",('Program Requirements'!A245))","v":""},null,null,null,{"$f":"IF(ISBLANK('Program Requirements'!D245),\"\",'Program Requirements'!D245)","v":""},null,null,null,null,null,null,null,null,{"$f":"IF(D223=\"Yes\",('Program Requirements'!G245),\"\")","v":""},{"$f":"IF(D223=\"Yes\",('Program Requirements'!L245),\"\")","v":""},{"$f":"IF(ISBLANK('Program Requirements'!M245),\"\",'Program Requirements'!M245)","v":{"$error":"#DIV/0!"}},0,null,0,null,null,null,0,null,""]
[{"$f":"IF(ISBLANK('Program Requirements'!A246),\"\",('Program Requirements'!A246))","v":""},null,null,null,{"$f":"IF(ISBLANK('Program Requirements'!D246),\"\",'Program Requirements'!D246)","v":""},null,null,null,null,null,null,null,null,{"$f":"IF(D224=\"Yes\",('Program Requirements'!G246),\"\")","v":""},{"$f":"IF(D224=\"Yes\",('Program Requirements'!L246),\"\")","v":""},{"$f":"IF(ISBLANK('Program Requirements'!M246),\"\",'Program Requirements'!M246)","v":{"$error":"#DIV/0!"}},0,null,0,null,null,null,0,null,""]
[{"$f":"IF(ISBLANK('Program Requirements'!A247),\"\",('Program Requirements'!A247))","v":""},null,null,null,{"$f":"IF(ISBLANK('Program Requirements'!D247),\"\",'Program Requirements'!D247)","v":""},null,null,null,null,null,null,null,null,{"$f":"IF(D225=\"Yes\",('Program Requirements'!G247),\"\")","v":""},{"$f":"IF(D225=\"Yes\",('Program Requirements'!L247),\"\")","v":""},{"$f":"IF(ISBLANK('Program Requirements'!M247),\"\",'Program Requirements'!M247)","v":{"$error":"#DIV/0!"}},0,null,0,null,null,null,0,null,""]
[{"$f":"IF(ISBLANK('Program Requirements'!A248),\"\",('Program Requirements'!A248))","v":""},null,null,null,{"$f":"IF(ISBLANK('Program Requirements'!D248),\"\",'Program Requirements'!D248)","v":""},null,null,null,null,null,null,null,null,{"$f":"IF(D226=\"Yes\",('Program Requirements'!G248),\"\")","v":""},{"$f":"IF(D226=\"Yes\",('Program Requirements'!L248),\"\")","v":""},{"$f":"IF(ISBLANK('Program Requirements'!M248),\"\",'Program Requirements'!M248)","v":{"$error":"#DIV/0!"}},0,null,0,null,null,null,0,null,""]
[{"$f":"IF(ISBLANK('Program Requirements'!A249),\"\",('Program Requirements'!A249))","v":""},null,null,null,{"$f":"IF(ISBLANK('Program Requirements'!D249),\"\",'Program Requirements'!D249)","v":""},null,null,null,null,null,null,null,null,{"$f":"IF(D227=\"Yes\",('Program Requirements'!G249),\"\")","v":""},{"$f":"IF(D227=\"Yes\",('Program Requirements'!L249),\"\")","v":""},{"$f":"IF(ISBLANK('Program Requirements'!M249),\"\",'Program Requirements'!M249)","v":{"$error":"#DIV/0!"}},0,null,0,null,null,null,0,null,""]
[{"$f":"IF(ISBLANK('Program Requirements'!A250),\"\",('Program Requirements'!A250))","v":""},null,null,null,{"$f":"IF(ISBLANK('Program Requirements'!D250),\"\",'Program Requirements'!D250)","v":""},null,null,null,null,null,null,null,null,{"$f":"IF(D228=\"Yes\",('Program Requirements'!G250),\"\")","v":""},{"$f":"IF(D228=\"Yes\",('Program Requirements'!L250),\"\")","v":""},{"$f":"IF(ISBLANK('Program Requirements'!M250),\"\",'Program Requirements'!M250)","v":{"$error":"#DIV/0!"}},0,null,0,null,null,null,0,null,""]
[{"$f":"IF(ISBLANK('Program Requirements'!A251),\"\",('Program Requirements'!A251))","v":""},null,null,null,{"$f":"IF(ISBLANK('Program Requirements'!D251),\"\",'Program Requirements'!D251)","v":""},null,null,null,null,null,null,null,null,{"$f":"IF(D229=\"Yes\",('Program Requirements'!G251),\"\")","v":""},{"$f":"IF(D229=\"Yes\",('Program Requirements'!L251),\"\")","v":""},{"$f":"IF(ISBLANK('Program Requirements'!M251),\"\",'Program Requirements'!M251)","v":{"$error":"#DIV/0!"}},0,null,0,null,null,null,0,null,""]
[{"$f":"IF(ISBLANK('Program Requirements'!A252),\"\",('Program Requirements'!A252))","v":""},null,null,null,{"$f":"IF(ISBLANK('Program Requirements'!D252),\"\",'Program Requirements'!D252)","v":""},null,null,null,null,null,null,null,null,{"$f":"IF(D230=\"Yes\",('Program Requirements'!G252),\"\")","v":""},{"$f":"IF(D230=\"Yes\",('Program Requirements'!L252),\"\")","v":""},{"$f":"IF(ISBLANK('Program Requirements'!M252),\"\",'Program Requirements'!M252)","v":{"$error":"#DIV/0!"}},0,null,0,null,null,null,0,null,""]
[{"$f":"IF(ISBLANK('Program Requirements'!A253),\"\",('Program Requirements'!A253))","v":""},null,null,null,{"$f":"IF(ISBLANK('Program Requirements'!D253),\"\",'Program Requirements'!D253)","v":""},null,null,null,null,null,null,null,null,{"$f":"IF(D231=\"Yes\",('Program Requirements'!G253),\"\")","v":""},{"$f":"IF(D231=\"Yes\",('Program Requirements'!L253),\"\")","v":""},{"$f":"IF(ISBLANK('Program Requirements'!M253),\"\",'Program Requirements'!M253)","v":{"$error":"#DIV/0!"}},0,null,0,null,null,null,0,null,""]
[{"$f":"IF(ISBLANK('Program Requirements'!A254),\"\",('Program Requirements'!A254))","v":""},null,null,null,{"$f":"IF(ISBLANK('Program Requirements'!D254),\"\",'Program Requirements'!D254)","v":""},null,null,null,null,null,null,null,null,{"$f":"IF(D232=\"Yes\",('Program Requirements'!G254),\"\")","v":""},{"$f":"IF(D232=\"Yes\",('Program Requirements'!L254),\"\")","v":""},{"$f":"IF(ISBLANK('Program Requirements'!M254),\"\",'Program Requirements'!M254)","v":{"$error":"#DIV/0!"}},0,null,0,null,null,null,0,null,""]
[{"$f":"IF(ISBLANK('Program Requirements'!A255),\"\",('Program Requirements'!A255))","v":""},null,null,null,{"$f":"IF(ISBLANK('Program Requirements'!D255),\"\",'Program Requirements'!D255)","v":""},null,null,null,null,null,null,null,null,{"$f":"IF(D233=\"Yes\",('Program Requirements'!G255),\"\")","v":""},{"$f":"IF(D233=\"Yes\",('Program Requirements'!L255),\"\")","v":""},{"$f":"IF(ISBLANK('Program Requirements'!M255),\"\",'Program Requirements'!M255)","v":{"$error":"#DIV/0!"}},0,null,0,null,null,null,0,null,""]
[{"$f":"IF(ISBLANK('Program Requirements'!A256),\"\",('Program Requirements'!A256))","v":""},null,null,null,{"$f":"IF(ISBLANK('Program Requirements'!D256),\"\",'Program Requirements'!D256)","v":""},null,null,null,null,null,null,null,null,{"$f":"IF(D234=\"Yes\",('Program Requirements'!G256),\"\")","v":""},{"$f":"IF(D234=\"Yes\",('Program Requirements'!L256),\"\")","v":""},{"$f":"IF(ISBLANK('Program Requirements'!M256),\"\",'Program Requirements'!M256)","v":{"$error":"#DIV/0!"}},0,null,0,null,null,null,0,null,""]
[{"$f":"IF(ISBLANK('Program Requirements'!A257),\"\",('Program Requirements'!A257))","v":""},null,null,null,{"$f":"IF(ISBLANK('Program Requirements'!D257),\"\",'Program Requirements'!D257)","v":""},null,null,null,null,null,null,null,null,{"$f":"IF(D235=\"Yes\",('Program Requirements'!G257),\"\")","v":""},{"$f":"IF(D235=\"Yes\",('Program Requirements'!L257),\"\")","v":""},{"$f":"IF(ISBLANK('Program Requirements'!M257),\"\",'Program Requirements'!M257)","v":{"$error":"#DIV/0!"}},0,null,0,null,null,null,0,null,""]
[{"$f":"IF(ISBLANK('Program Requirements'!A258),\"\",('Program Requirements'!A258))","v":""},null,null,null,{"$f":"IF(ISBLANK('Program Requirements'!D258),\"\",'Program Requirements'!D258)","v":""},null,null,null,null,null,null,null,null,{"$f":"IF(D236=\"Yes\",('Program Requirements'!G258),\"\")","v":""},{"$f":"IF(D236=\"Yes\",('Program Requirements'!L258),\"\")","v":""},{"$f":"IF(ISBLANK('Program Requirements'!M258),\"\",'Program Requirements'!M258)","v":{"$error":"#DIV/0!"}},0,null,0,null,null,null,0,null,""]
[{"$f":"IF(ISBLANK('Program Requirements'!A259),\"\",('Program Requirements'!A259))","v":""},null,null,null,{"$f":"IF(ISBLANK('Program Requirements'!D259),\"\",'Program Requirements'!D259)","v":""},null,null,null,null,null,null,null,null,{"$f":"IF(D237=\"Yes\",('Program Requirements'!G259),\"\")","v":""},{"$f":"IF(D237=\"Yes\",('Program Requirements'!L259),\"\")","v":""},{"$f":"IF(ISBLANK('Program Requirements'!M259),\"\",'Program Requirements'!M259)","v":{"$error":"#DIV/0!"}},0,null,0,null,null,null,0,null,""]
[{"$f":"IF(ISBLANK('Program Requirements'!A260),\"\",('Program Requirements'!A260))","v":""},null,null,null,{"$f":"IF(ISBLANK('Program Requirements'!D260),\"\",'Program Requirements'!D260)","v":""},null,null,null,null,null,null,null,null,{"$f":"IF(D238=\"Yes\",('Program Requirements'!G260),\"\")","v":""},{"$f":"IF(D238=\"Yes\",('Program Requirements'!L260),\"\")","v":""},{"$f":"IF(ISBLANK('Program Requirements'!M260),\"\",'Program Requirements'!M260)","v":{"$error":"#DIV/0!"}},0,null,0,null,null,null,0,null,""]
[{"$f":"IF(ISBLANK('Program Requirements'!A261),\"\",('Program Requirements'!A261))","v":""},null,null,null,{"$f":"IF(ISBLANK('Program Requirements'!D261),\"\",'Program Requirements'!D261)","v":""},null,null,null,null,null,null,null,null,{"$f":"IF(D239=\"Yes\",('Program Requirements'!G261),\"\")","v":""},{"$f":"IF(D239=\"Yes\",('Program Requirements'!L261),\"\")","v":""},{"$f":"IF(ISBLANK('Program Requirements'!M261),\"\",'Program Requirements'!M261)","v":{"$error":"#DIV/0!"}},0,null,0,null,null,null,0,null,""]
[{"$f":"IF(ISBLANK('Program Requirements'!A262),\"\",('Program Requirements'!A262))","v":""},null,null,null,{"$f":"IF(ISBLANK('Program Requirements'!D262),\"\",'Program Requirements'!D262)","v":""},null,null,null,null,null,null,null,null,{"$f":"IF(D240=\"Yes\",('Program Requirements'!G262),\"\")","v":""},{"$f":"IF(D240=\"Yes\",('Program Requirements'!L262),\"\")","v":""},{"$f":"IF(ISBLANK('Program Requirements'!M262),\"\",'Program Requirements'!M262)","v":{"$error":"#DIV/0!"}},0,null,0,null,null,null,0,null,""]
[{"$f":"IF(ISBLANK('Program Requirements'!A263),\"\",('Program Requirements'!A263))","v":""},null,null,null,{"$f":"IF(ISBLANK('Program Requirements'!D263),\"\",'Program Requirements'!D263)","v":""},null,null,null,null,null,null,null,null,{"$f":"IF(D241=\"Yes\",('Program Requirements'!G263),\"\")","v":""},{"$f":"IF(D241=\"Yes\",('Program Requirements'!L263),\"\")","v":""},{"$f":"IF(ISBLANK('Program Requirements'!M263),\"\",'Program Requirements'!M263)","v":{"$error":"#DIV/0!"}},0,null,0,null,null,null,0,null,""]
[{"$f":"IF(ISBLANK('Program Requirements'!A264),\"\",('Program Requirements'!A264))","v":""},null,null,null,{"$f":"IF(ISBLANK('Program Requirements'!D264),\"\",'Program Requirements'!D264)","v":""},null,null,null,null,null,null,null,null,{"$f":"IF(D242=\"Yes\",('Program Requirements'!G264),\"\")","v":""},{"$f":"IF(D242=\"Yes\",('Program Requirements'!L264),\"\")","v":""},{"$f":"IF(ISBLANK('Program Requirements'!M264),\"\",'Program Requirements'!M264)","v":{"$error":"#DIV/0!"}},0,null,0,null,null,null,0,null,""]
[{"$f":"IF(ISBLANK('Program Requirements'!A265),\"\",('Program Requirements'!A265))","v":""},null,null,null,{"$f":"IF(ISBLANK('Program Requirements'!D265),\"\",'Program Requirements'!D265)","v":""},null,null,null,null,null,null,null,null,{"$f":"IF(D243=\"Yes\",('Program Requirements'!G265),\"\")","v":""},{"$f":"IF(D243=\"Yes\",('Program Requirements'!L265),\"\")","v":""},{"$f":"IF(ISBLANK('Program Requirements'!M265),\"\",'Program Requirements'!M265)","v":{"$error":"#DIV/0!"}},0,null,0,null,null,null,0,null,""]
[{"$f":"IF(ISBLANK('Program Requirements'!A266),\"\",('Program Requirements'!A266))","v":""},null,null,null,{"$f":"IF(ISBLANK('Program Requirements'!D266),\"\",'Program Requirements'!D266)","v":""},null,null,null,null,null,null,null,null,{"$f":"IF(D244=\"Yes\",('Program Requirements'!G266),\"\")","v":""},{"$f":"IF(D244=\"Yes\",('Program Requirements'!L266),\"\")","v":""},{"$f":"IF(ISBLANK('Program Requirements'!M266),\"\",'Program Requirements'!M266)","v":{"$error":"#DIV/0!"}},0,null,0,null,null,null,0,null,""]
[{"$f":"IF(ISBLANK('Program Requirements'!A267),\"\",('Program Requirements'!A267))","v":""},null,null,null,{"$f":"IF(ISBLANK('Program Requirements'!D267),\"\",'Program Requirements'!D267)","v":""},null,null,null,null,null,null,null,null,{"$f":"IF(D245=\"Yes\",('Program Requirements'!G267),\"\")","v":""},{"$f":"IF(D245=\"Yes\",('Program Requirements'!L267),\"\")","v":""},{"$f":"IF(ISBLANK('Program Requirements'!M267),\"\",'Program Requirements'!M267)","v":{"$error":"#DIV/0!"}},0,null,0,null,null,null,0,null,""]
[{"$f":"IF(ISBLANK('Program Requirements'!A268),\"\",('Program Requirements'!A268))","v":""},null,null,null,{"$f":"IF(ISBLANK('Program Requirements'!D268),\"\",'Program Requirements'!D268)","v":""},null,null,null,null,null,null,null,null,{"$f":"IF(D246=\"Yes\",('Program Requirements'!G268),\"\")","v":""},{"$f":"IF(D246=\"Yes\",('Program Requirements'!L268),\"\")","v":""},{"$f":"IF(ISBLANK('Program Requirements'!M268),\"\",'Program Requirements'!M268)","v":{"$error":"#DIV/0!"}},0,null,0,null,null,null,0,null,""]
[{"$f":"IF(ISBLANK('Program Requirements'!A269),\"\",('Program Requirements'!A269))","v":""},null,null,null,{"$f":"IF(ISBLANK('Program Requirements'!D269),\"\",'Program Requirements'!D269)","v":""},null,null,null,null,null,null,null,null,{"$f":"IF(D247=\"Yes\",('Program Requirements'!G269),\"\")","v":""},{"$f":"IF(D247=\"Yes\",('Program Requirements'!L269),\"\")","v":""},{"$f":"IF(ISBLANK('Program Requirements'!M269),\"\",'Program Requirements'!M269)","v":{"$error":"#DIV/0!"}},{"$f":"IF(D247=\"Yes\",(O247)*$Q$45,0)","v":0},null,0,null,null,null,0,null,{"$f":"IF(D247=\"Yes\",SUM(W247)/SUM(O247),\"\")","v":""}]
[{"$f":"IF(ISBLANK('Program Requirements'!A270),\"\",('Program Requirements'!A270))","v":""},null,null,null,{"$f":"IF(ISBLANK('Program Requirements'!D270),\"\",'Program Requirements'!D270)","v":""},null,null,null,null,null,null,null,null,{"$f":"IF(D248=\"Yes\",('Program Requirements'!G270),\"\")","v":""},{"$f":"IF(D248=\"Yes\",('Program Requirements'!L270),\"\")","v":""},{"$f":"IF(ISBLANK('Program Requirements'!M270),\"\",'Program Requirements'!M270)","v":{"$error":"#DIV/0!"}},0,null,0,null,null,null,0,null,""]
[{"$f":"IF(ISBLANK('Program Requirements'!A271),\"\",('Program Requirements'!A271))","v":""},null,null,null,{"$f":"IF(ISBLANK('Program Requirements'!D271),\"\",'Program Requirements'!D271)","v":""},null,null,null,null,null,null,null,null,{"$f":"IF(D249=\"Yes\",('Program Requirements'!G271),\"\")","v":""},{"$f":"IF(D249=\"Yes\",('Program Requirements'!L271),\"\")","v":""},{"$f":"IF(ISBLANK('Program Requirements'!M271),\"\",'Program Requirements'!M271)","v":{"$error":"#DIV/0!"}},0,null,0,null,null,null,0,null,""]
[{"$f":"IF(ISBLANK('Program Requirements'!A272),\"\",('Program Requirements'!A272))","v":""},null,null,null,{"$f":"IF(ISBLANK('Program Requirements'!D272),\"\",'Program Requirements'!D272)","v":""},null,null,null,null,null,null,null,null,{"$f":"IF(D250=\"Yes\",('Program Requirements'!G272),\"\")","v":""},{"$f":"IF(D250=\"Yes\",('Program Requirements'!L272),\"\")","v":""},{"$f":"IF(ISBLANK('Program Requirements'!M272),\"\",'Program Requirements'!M272)","v":{"$error":"#DIV/0!"}},0,null,{"$f":"S249-Q250","v":0},null,null,null,0,null,""]
[{"$f":"IF(ISBLANK('Program Requirements'!A273),\"\",('Program Requirements'!A273))","v":""},null,null,null,{"$f":"IF(ISBLANK('Program Requirements'!D273),\"\",'Program Requirements'!D273)","v":""},null,null,null,null,null,null,null,null,{"$f":"IF(D251=\"Yes\",('Program Requirements'!G273),\"\")","v":""},{"$f":"IF(D251=\"Yes\",('Program Requirements'!L273),\"\")","v":""},{"$f":"IF(ISBLANK('Program Requirements'!M273),\"\",'Program Requirements'!M273)","v":{"$error":"#DIV/0!"}},0,null,{"$f":"S250-Q251","v":0},null,null,null,0,null,""]
[{"$f":"IF(ISBLANK('Program Requirements'!A274),\"\",('Program Requirements'!A274))","v":""},null,null,null,{"$f":"IF(ISBLANK('Program Requirements'!D274),\"\",'Program Requirements'!D274)","v":""},null,null,null,null,null,null,null,null,{"$f":"IF(D252=\"Yes\",('Program Requirements'!G274),\"\")","v":""},{"$f":"IF(D252=\"Yes\",('Program Requirements'!L274),\"\")","v":""},{"$f":"IF(ISBLANK('Program Requirements'!M274),\"\",'Program Requirements'!M274)","v":{"$error":"#DIV/0!"}},0,null,{"$f":"S251-Q252","v":0},null,null,null,0,null,""]
[{"$f":"IF(ISBLANK('Program Requirements'!A275),\"\",('Program Requirements'!A275))","v":""},null,null,null,{"$f":"IF(ISBLANK('Program Requirements'!D275),\"\",'Program Requirements'!D275)","v":""},null,null,null,null,null,null,null,null,{"$f":"IF(D253=\"Yes\",('Program Requirements'!G275),\"\")","v":""},{"$f":"IF(D253=\"Yes\",('Program Requirements'!L275),\"\")","v":""},{"$f":"IF(ISBLANK('Program Requirements'!M275),\"\",'Program Requirements'!M275)","v":{"$error":"#DIV/0!"}},0,null,{"$f":"S252-Q253","v":0},null,null,null,0,null,""]
[{"$f":"IF(ISBLANK('Program Requirements'!A276),\"\",('Program Requirements'!A276))","v":""},null,null,null,{"$f":"IF(ISBLANK('Program Requirements'!D276),\"\",'Program Requirements'!D276)","v":""},null,null,null,null,null,null,null,null,{"$f":"IF(D254=\"Yes\",('Program Requirements'!G276),\"\")","v":""},{"$f":"IF(D254=\"Yes\",('Program Requirements'!L276),\"\")","v":""},{"$f":"IF(ISBLANK('Program Requirements'!M276),\"\",'Program Requirements'!M276)","v":{"$error":"#DIV/0!"}},{"$f":"IF(D254=\"Yes\",(O254)*$Q$45,0)","v":0},null,{"$f":"S253-Q254","v":0},null,null,null,0,null,""]
["Page 48"]

{"sheet":"Below 35% Low-Income","index":6,"n_rows":255,"n_cols":26,"rows_kept":255,"cut":false,"hidden":true,"merged":[[252,16,252,17],[252,18,252,19],[252,20,252,21],[252,22,252,23],[253,16,253,17],[253,18,253,19],[253,20,253,21],[253,22,253,23],[250,16,250,17],[250,18,250,19],[250,20,250,21],[250,22,250,23],[251,16,251,17],[251,18,251,19],[251,20,251,21],[251,22,251,23],[248,16,248,17],[248,18,248,19],[248,20,248,21],[248,22,248,23],[249,16,249,17],[249,18,249,19],[249,20,249,21],[249,22,249,23],[246,16,246,17],[246,18,246,19],[246,20,246,21],[246,22,246,23],[247,16,247,17],[247,18,247,19],[247,20,247,21],[247,22,247,23],[244,16,244,17],[244,18,244,19],[244,20,244,21],[244,22,244,23],[245,16,245,17],[245,18,245,19],[245,20,245,21],[245,22,245,23],[242,16,242,17],[242,18,242,19],[242,20,242,21],[242,22,242,23],[243,16,243,17],[243,18,243,19],[243,20,243,21],[243,22,243,23],[240,16,240,17],[240,18,240,19],[240,20,240,21],[240,22,240,23],[241,16,241,17],[241,18,241,19],[241,20,241,21],[241,22,241,23],[238,16,238,17],[238,18,238,19],[238,20,238,21],[238,22,238,23],[239,16,239,17],[239,18,239,19],[239,20,239,21],[239,22,239,23],[236,16,236,17],[236,18,236,19],[236,20,236,21],[236,22,236,23],[237,16,237,17],[237,18,237,19],[237,20,237,21],[237,22,237,23],[234,16,234,17],[234,18,234,19],[234,20,234,21],[234,22,234,23],[235,16,235,17],[235,18,235,19],[235,20,235,21],[235,22,235,23],[232,16,232,17],[232,18,232,19],[232,20,232,21],[232,22,232,23],[233,16,233,17],[233,18,233,19],[233,20,233,21],[233,22,233,23],[230,16,230,17],[230,18,230,19],[230,20,230,21],[230,22,230,23],[231,16,231,17],[231,18,231,19],[231,20,231,21],[231,22,231,23],[228,16,228,17],[228,18,228,19],[228,20,228,21],[228,22,228,23],[229,16,229,17],[229,18,229,19],[229,20,229,21],[229,22,229,23],[226,16,226,17],[226,18,226,19],[226,20,226,21],[226,22,226,23],[227,16,227,17],[227,18,227,19],[227,20,227,21],[227,22,227,23],[224,16,224,17],[224,18,224,19],[224,20,224,21],[224,22,224,23],[225,16,225,17],[225,18,225,19],[225,20,225,21],[225,22,225,23],[222,16,222,17],[222,18,222,19],[222,20,222,21],[222,22,222,23],[223,16,223,17],[223,18,223,19],[223,20,223,21],[223,22,223,23],[220,16,220,17],[220,18,220,19],[220,20,220,21],[220,22,220,23],[221,16,221,17],[221,18,221,19],[221,20,221,21],[221,22,221,23],[218,16,218,17],[218,18,218,19],[218,20,218,21],[218,22,218,23],[219,16,219,17],[219,18,219,19],[219,20,219,21],[219,22,219,23],[216,16,216,17],[216,18,216,19],[216,20,216,21],[216,22,216,23],[217,16,217,17],[217,18,217,19],[217,20,217,21],[217,22,217,23],[214,16,214,17],[214,18,214,19],[214,20,214,21],[214,22,214,23],[215,16,215,17],[215,18,215,19],[215,20,215,21],[215,22,215,23],[212,16,212,17],[212,18,212,19],[212,20,212,21],[212,22,212,23],[213,16,213,17],[213,18,213,19],[213,20,213,21],[213,22,213,23],[210,16,210,17],[210,18,210,19],[210,20,210,21],[210,22,210,23],[211,16,211,17],[211,18,211,19],[211,20,211,21],[211,22,211,23],[208,16,208,17],[208,18,208,19],[208,20,208,21],[208,22,208,23],[209,16,209,17],[209,18,209,19],[209,20,209,21],[209,22,209,23],[206,16,206,17],[206,18,206,19],[206,20,206,21],[206,22,206,23],[207,16,207,17],[207,18,207,19],[207,20,207,21],[207,22,207,23],[204,16,204,17],[204,18,204,19],[204,20,204,21],[204,22,204,23],[205,16,205,17],[205,18,205,19],[205,20,205,21],[205,22,205,23],[202,16,202,17],[202,18,202,19],[202,20,202,21],[202,22,202,23],[203,16,203,17],[203,18,203,19],[203,20,203,21],[203,22,203,23],[200,16,200,17],[200,18,200,19],[200,20,200,21],[200,22,200,23],[201,16,201,17],[201,18,201,19],[201,20,201,21],[201,22,201,23],[198,16,198,17],[198,18,198,19],[198,20,198,21],[198,22,198,23],[199,16,199,17],[199,18,199,19],[199,20,199,21],[199,22,199,23],[196,16,196,17],[196,18,196,19],[196,20,196,21],[196,22,196,23],[197,16,197,17],[197,18,197,19],[197,20,197,21],[197,22,197,23],[194,16,194,17],[194,18,194,19],[194,20,194,21],[194,22,194,23],[195,16,195,17],[195,18,195,19],[195,20,195,21],[195,22,195,23],[192,16,192,17],[192,18,192,19],[192,20,192,21],[192,22,192,23],[193,16,193,17],[193,18,193,19],[193,20,193,21],[193,22,193,23],[190,16,190,17],[190,18,190,19],[190,20,190,21],[190,22,190,23],[191,16,191,17],[191,18,191,19],[191,20,191,21],[191,22,191,23],[188,16,188,17],[188,18,188,19],[188,20,188,21],[188,22,188,23],[189,16,189,17],[189,18,189,19],[189,20,189,21],[189,22,189,23],[186,16,186,17],[186,18,186,19],[186,20,186,21],[186,22,186,23],[187,16,187,17],[187,18,187,19],[187,20,187,21],[187,22,187,23],[184,16,184,17],[184,18,184,19],[184,20,184,21],[184,22,184,23],[185,16,185,17],[185,18,185,19],[185,20,185,21],[185,22,185,23],[182,16,182,17],[182,18,182,19],[182,20,182,21],[182,22,182,23],[183,16,183,17],[183,18,183,19],[183,20,183,21],[183,22,183,23],[180,16,180,17],[180,18,180,19],[180,20,180,21],[180,22,180,23],[181,16,181,17],[181,18,181,19],[181,20,181,21],[181,22,181,23],[178,16,178,17],[178,18,178,19],[178,20,178,21],[178,22,178,23],[179,16,179,17],[179,18,179,19],[179,20,179,21],[179,22,179,23],[176,16,176,17],[176,18,176,19],[176,20,176,21],[176,22,176,23],[177,16,177,17],[177,18,177,19],[177,20,177,21],[177,22,177,23],[174,16,174,17],[174,18,174,19],[174,20,174,21],[174,22,174,23],[175,16,175,17],[175,18,175,19],[175,20,175,21],[175,22,175,23],[172,16,172,17],[172,18,172,19],[172,20,172,21],[172,22,172,23],[173,16,173,17],[173,18,173,19],[173,20,173,21],[173,22,173,23],[170,16,170,17],[170,18,170,19],[170,20,170,21],[170,22,170,23],[171,16,171,17],[171,18,171,19],[171,20,171,21],[171,22,171,23],[168,16,168,17],[168,18,168,19],[168,20,168,21],[168,22,168,23],[169,16,169,17],[169,18,169,19],[169,20,169,21],[169,22,169,23],[166,16,166,17],[166,18,166,19],[166,20,166,21],[166,22,166,23],[167,16,167,17],[167,18,167,19],[167,20,167,21],[167,22,167,23],[164,16,164,17],[164,18,164,19],[164,20,164,21],[164,22,164,23],[165,16,165,17],[165,18,165,19],[165,20,165,21],[165,22,165,23],[162,16,162,17],[162,18,162,19],[162,20,162,21],[162,22,162,23],[163,16,163,17],[163,18,163,19],[163,20,163,21],[163,22,163,23],[160,16,160,17],[160,18,160,19],[160,20,160,21],[160,22,160,23],[161,16,161,17],[161,18,161,19],[161,20,161,21],[161,22,161,23],[158,16,158,17],[158,18,158,19],[158,20,158,21],[158,22,158,23],[159,16,159,17],[159,18,159,19],[159,20,159,21],[159,22,159,23],[156,16,156,17],[156,18,156,19],[156,20,156,21],[156,22,156,23],[157,16,157,17],[157,18,157,19],[157,20,157,21],[157,22,157,23],[154,16,154,17],[154,18,154,19],[154,20,154,21],[154,22,154,23],[155,16,155,17],[155,18,155,19],[155,20,155,21],[155,22,155,23],[152,16,152,17],[152,18,152,19],[152,20,152,21],[152,22,152,23],[153,16,153,17],[153,18,153,19],[153,20,153,21],[153,22,153,23],[150,16,150,17],[150,18,150,19],[150,20,150,21],[150,22,150,23],[151,16,151,17],[151,18,151,19],[151,20,151,21],[151,22,151,23],[148,16,148,17],[148,18,148,19],[148,20,148,21],[148,22,148,23],[149,16,149,17],[149,18,149,19],[149,20,149,21],[149,22,149,23],[146,16,146,17],[146,18,146,19],[146,20,146,21],[146,22,146,23],[147,16,147,17],[147,18,147,19],[147,20,147,21],[147,22,147,23],[144,16,144,17],[144,18,144,19],[144,20,144,21],[144,22,144,23],[145,16,145,17],[145,18,145,19],[145,20,145,21],[145,22,145,23],[142,16,142,17],[142,18,142,19],[142,20,142,21],[142,22,142,23],[143,16,143,17],[143,18,143,19],[143,20,143,21],[143,22,143,23],[140,16,140,17],[140,18,140,19],[140,20,140,21],[140,22,140,23],[141,16,141,17],[141,18,141,19],[141,20,141,21],[141,22,141,23],[138,16,138,17],[138,18,138,19],[138,20,138,21],[138,22,138,23],[139,16,139,17],[139,18,139,19],[139,20,139,21],[139,22,139,23],[136,16,136,17],[136,18,136,19],[136,20,136,21],[136,22,136,23],[137,16,137,17],[137,18,137,19],[137,20,137,21],[137,22,137,23],[134,16,134,17],[134,18,134,19],[134,20,134,21],[134,22,134,23],[135,16,135,17],[135,18,135,19],[135,20,135,21],[135,22,135,23],[132,16,132,17],[132,18,132,19],[132,20,132,21],[132,22,132,23],[133,16,133,17],[133,18,133,19],[133,20,133,21],[133,22,133,23],[130,16,130,17],[130,18,130,19],[130,20,130,21],[130,22,130,23],[131,16,131,17],[131,18,131,19],[131,20,131,21],[131,22,131,23],[128,16,128,17],[128,18,128,19],[128,20,128,21],[128,22,128,23],[129,16,129,17],[129,18,129,19],[129,20,129,21],[129,22,129,23],[126,16,126,17],[126,18,126,19],[126,20,126,21],[126,22,126,23],[127,16,127,17],[127,18,127,19],[127,20,127,21],[127,22,127,23],[124,16,124,17],[124,18,124,19],[124,20,124,21],[124,22,124,23],[125,16,125,17],[125,18,125,19],[125,20,125,21],[125,22,125,23],[122,16,122,17],[122,18,122,19],[122,20,122,21],[122,22,122,23],[123,16,123,17],[123,18,123,19],[123,20,123,21],[123,22,123,23],[120,16,120,17],[120,18,120,19],[120,20,120,21],[120,22,120,23],[121,16,121,17],[121,18,121,19],[121,20,121,21],[121,22,121,23],[118,16,118,17],[118,18,118,19],[118,20,118,21],[118,22,118,23],[119,16,119,17],[119,18,119,19],[119,20,119,21],[119,22,119,23],[116,16,116,17],[116,18,116,19],[116,20,116,21],[116,22,116,23],[117,16,117,17],[117,18,117,19],[117,20,117,21],[117,22,117,23],[114,16,114,17],[114,18,114,19],[114,20,114,21],[114,22,114,23],[115,16,115,17],[115,18,115,19],[115,20,115,21],[115,22,115,23],[112,16,112,17],[112,18,112,19],[112,20,112,21],[112,22,112,23],[113,16,113,17],[113,18,113,19],[113,20,113,21],[113,22,113,23],[110,16,110,17],[110,18,110,19],[110,20,110,21],[110,22,110,23],[111,16,111,17],[111,18,111,19],[111,20,111,21],[111,22,111,23],[108,16,108,17],[108,18,108,19],[108,20,108,21],[108,22,108,23],[109,16,109,17],[109,18,109,19],[109,20,109,21],[109,22,109,23],[106,16,106,17],[106,18,106,19],[106,20,106,21],[106,22,106,23],[107,16,107,17],[107,18,107,19],[107,20,107,21],[107,22,107,23],[104,16,104,17],[104,18,104,19],[104,20,104,21],[104,22,104,23],[105,16,105,17],[105,18,105,19],[105,20,105,21],[105,22,105,23],[102,16,102,17],[102,18,102,19],[102,20,102,21],[102,22,102,23],[103,16,103,17],[103,18,103,19],[103,20,103,21],[103,22,103,23],[100,16,100,17],[100,18,100,19],[100,20,100,21],[100,22,100,23],[101,16,101,17],[101,18,101,19],[101,20,101,21],[101,22,101,23],[98,16,98,17],[98,18,98,19],[98,20,98,21],[98,22,98,23],[99,16,99,17],[99,18,99,19],[99,20,99,21],[99,22,99,23],[96,16,96,17],[96,18,96,19],[96,20,96,21],[96,22,96,23],[97,16,97,17],[97,18,97,19],[97,20,97,21],[97,22,97,23],[94,16,94,17],[94,18,94,19],[94,20,94,21],[94,22,94,23],[95,16,95,17],[95,18,95,19],[95,20,95,21],[95,22,95,23],[92,16,92,17],[92,18,92,19],[92,20,92,21],[92,22,92,23],[93,16,93,17],[93,18,93,19],[93,20,93,21],[93,22,93,23],[90,16,90,17],[90,18,90,19],[90,20,90,21],[90,22,90,23],[91,16,91,17],[91,18,91,19],[91,20,91,21],[91,22,91,23],[88,16,88,17],[88,18,88,19],[88,20,88,21],[88,22,88,23],[89,16,89,17],[89,18,89,19],[89,20,89,21],[89,22,89,23],[86,16,86,17],[86,18,86,19],[86,20,86,21],[86,22,86,23],[87,16,87,17],[87,18,87,19],[87,20,87,21],[87,22,87,23],[84,16,84,17],[84,18,84,19],[84,20,84,21],[84,22,84,23],[85,16,85,17],[85,18,85,19],[85,20,85,21],[85,22,85,23],[82,16,82,17],[82,18,82,19],[82,20,82,21],[82,22,82,23],[83,16,83,17],[83,18,83,19],[83,20,83,21],[83,22,83,23],[80,16,80,17],[80,18,80,19],[80,20,80,21],[80,22,80,23],[81,16,81,17],[81,18,81,19],[81,20,81,21],[81,22,81,23],[78,16,78,17],[78,18,78,19],[78,20,78,21],[78,22,78,23],[79,16,79,17],[79,18,79,19],[79,20,79,21],[79,22,79,23],[76,16,76,17],[76,18,76,19],[76,20,76,21],[76,22,76,23],[77,16,77,17],[77,18,77,19],[77,20,77,21],[77,22,77,23],[74,16,74,17],[74,18,74,19],[74,20,74,21],[74,22,74,23],[75,16,75,17],[75,18,75,19],[75,20,75,21],[75,22,75,23],[72,16,72,17],[72,18,72,19],[72,20,72,21],[72,22,72,23],[73,16,73,17],[73,18,73,19],[73,20,73,21],[73,22,73,23],[70,16,70,17],[70,18,70,19],[70,20,70,21],[70,22,70,23],[71,16,71,17],[71,18,71,19],[71,20,71,21],[71,22,71,23],[68,16,68,17],[68,18,68,19],[68,20,68,21],[68,22,68,23],[69,16,69,17],[69,18,69,19],[69,20,69,21],[69,22,69,23],[66,16,66,17],[66,18,66,19],[66,20,66,21],[66,22,66,23],[67,16,67,17],[67,18,67,19],[67,20,67,21],[67,22,67,23],[64,16,64,17],[64,18,64,19],[64,20,64,21],[64,22,64,23],[65,16,65,17],[65,18,65,19],[65,20,65,21],[65,22,65,23],[62,16,62,17],[62,18,62,19],[62,20,62,21],[62,22,62,23],[63,16,63,17],[63,18,63,19],[63,20,63,21],[63,22,63,23],[60,16,60,17],[60,18,60,19],[60,20,60,21],[60,22,60,23],[61,16,61,17],[61,18,61,19],[61,20,61,21],[61,22,61,23],[58,16,58,17],[58,18,58,19],[58,20,58,21],[58,22,58,23],[59,16,59,17],[59,18,59,19],[59,20,59,21],[59,22,59,23],[56,16,56,17],[56,18,56,19],[56,20,56,21],[56,22,56,23],[57,16,57,17],[57,18,57,19],[57,20,57,21],[57,22,57,23],[54,16,54,17],[54,18,54,19],[54,20,54,21],[54,22,54,23],[55,16,55,17],[55,18,55,19],[55,20,55,21],[55,22,55,23],[51,22,51,23],[52,16,52,17],[52,18,52,19],[52,20,52,21],[52,22,52,23],[53,15,53,17],[53,18,53,19],[44,12,44,16],[45,5,45,6],[46,9,46,10],[46,13,46,15],[46,19,46,20],[51,16,51,17],[51,18,51,19],[51,20,51,21],[36,3,36,5],[41,5,41,6],[43,5,43,6],[43,8,43,10],[43,13,43,15],[43,19,43,20],[33,19,33,21],[34,0,34,9],[34,13,34,15],[34,19,34,21],[35,0,35,15],[35,19,35,21],[23,13,23,15],[31,0,31,9],[31,10,34,12],[31,13,31,15],[31,16,31,18],[32,0,32,9],[32,13,32,15],[33,0,33,9],[33,13,33,15],[28,1,28,9],[28,10,28,12],[29,1,29,9],[29,10,29,12],[25,0,30,0],[25,1,25,9],[25,10,25,12],[26,13,26,15],[27,13,30,15],[24,13,25,15],[20,19,20,21],[17,1,17,9],[29,19,29,21],[30,1,30,9],[30,10,30,12],[30,16,30,18],[24,19,24,21],[25,19,25,21],[26,1,26,9],[26,10,26,12],[27,1,27,9],[27,10,27,12],[24,0,24,9],[9,10,24,12],[17,13,17,15],[17,19,17,21],[18,1,18,9],[18,13,18,15],[18,19,18,21],[21,0,21,9],[21,19,21,21],[22,1,22,9],[22,19,22,21],[23,1,23,9],[254,0,254,24],[22,13,22,15],[11,0,11,9],[11,13,11,15],[12,0,20,0],[12,1,12,9],[12,13,12,15],[15,1,15,9],[15,13,15,15],[15,19,15,21],[16,1,16,9],[16,13,16,15],[16,19,16,21],[12,19,12,21],[13,1,13,9],[13,13,13,15],[14,1,14,9],[14,13,14,15],[14,19,14,21],[19,1,19,9],[19,13,19,15],[19,19,19,21],[20,1,20,9],[20,13,20,15],[1,0,1,15],[4,16,4,18],[4,19,4,21],[5,0,5,9],[5,13,5,15],[6,0,6,9],[6,13,9,15],[7,0,10,1],[7,2,7,9],[7,10,7,12],[8,2,8,9],[8,10,8,12],[9,2,9,9],[10,2,10,9],[10,13,10,15],[2,0,2,15],[3,0,3,9],[3,10,3,12],[3,13,3,15],[4,0,4,9],[4,10,6,12],[4,13,4,15]]}
[null,null,null,null,"School Division:",null,{"$f":"'Narrative & Detail Budget'!$A$15","v":"ALBEMARLE COUNTY PUBLIC SCHOOLS"},null,null,null,null,null,"Division Number:",null,null,{"$f":"'Narrative & Detail Budget'!$I$15","v":2}]
["Q.  REQUIRED AND ALLOWABLE SET-ASIDES FOR DIVISIONS OPERATING TITLE I, PART A, BASIC PROGRAMS"]
[]
["DIVISION LEVEL:  IMPROVEMENT ACTIVITIES \n(Optional for Divisions with Comprehensive Support and Improvement and Targeted Support and Improvement)",null,null,null,null,null,null,null,null,null,"A",null,null,"B"]
["Up to 5 percent may be set aside for divisions to provide financial incentives and rewards to teachers who serve in schools identified for comprehensive support and improvement or targeted support and improvement activities for the purposes of attracting and retaining qualified and effective teachers."]
["Five percent of the total allocation representing the maximum allowable set-aside for Comprehensive Support and Improvement and Targeted Support and Improvement",null,null,null,null,null,null,null,null,null,null,null,null,{"$f":"SUM(('Narrative & Detail Budget'!N47)*0.05)","v":74749.400000000009}]
["Indicate amount of set-aside for each category, if applicable:"]
[null,null,"Set-Aside for Teacher Incentives and Rewards Comprehensive",null,null,null,null,null,null,null,0]
[null,null,"Set-Aside for Teacher Incentives and Rewards Targeted",null,null,null,null,null,null,null,0]
[null,null,null,null,null,null,null,null,null,null,0]
[null,null,"Total Amount Set-Aside for Comprehensive Support and Improvement and Targeted Support and Improvement",null,null,null,null,null,null,null,null,null,null,{"$f":"SUM(K8:M9)","v":0}]
["DIVISION LEVEL: PROGRAM ADMINISTRATION"]
[null,"(1000)  Personal Services - Nonsalary Differential",null,null,null,null,null,null,null,null,null,null,null,0]
[null,"(1000)  Personal Services - Salary Differential",null,null,null,null,null,null,null,null,null,null,null,0]
[null,"(2000)  Employee Benefits (Fixed Charges)",null,null,null,null,null,null,null,null,null,null,null,0]
[null,"(3000)  Purchased/Contracted Services",null,null,null,null,null,null,null,null,null,null,null,0]
[null,"(4000)  Internal Services",null,null,null,null,null,null,null,null,null,null,null,0]
[null,"(4000)  Other Charges",null,null,null,null,null,null,null,null,null,null,null,0]
[null,"(5000)  Other Charges",null,null,null,null,null,null,null,null,null,null,null,0]
[null,"(6000)  Materials and Supplies",null,null,null,null,null,null,null,null,null,null,null,0]
[null,"(8000)  Capital Outlay",null,null,null,null,null,null,null,null,null,null,null,0]
["Initiatives "]
[null,"Title I Early Childhood Program",null,null,null,null,null,null,null,null,null,null,null,0]
[null,"Private School Services (as necessary; not applicable for bypass divisions) These funds are in addition to school-level allocations for private school services.",null,null,null,null,null,null,null,null,null,null,null,{"$f":"ROUND(Z53*SUM(K26),2)","v":{"$error":"#DIV/0!"}}]
["Parent and Family Engagement (Required if allocation is $500,000 or more)"]
[null,"Amount of school division allocation ESEA funds (from Page 2):",null,null,null,null,null,null,null,null,{"$f":"SUM('Narrative & Detail Budget'!N47)","v":1494988}]
[null,"1 percent of allocation (This amount is calculated if school division receives $500,000 or more from Title I, Part A.)",null,null,null,null,null,null,null,null,{"$f":"ROUND(IF(K26>499999.99,0.01*K26,0),2)","v":14949.88},null,null,{"$f":"K27","v":14949.88}]
[null,"90 percent of 1 percent must be used at the school level",null,null,null,null,null,null,null,null,{"$f":"ROUND(0.9*SUM(K27),2)","v":13454.89}]
[null,"10 percent of 1 percent  is set aside by the school division for parent and family engagement initiatives",null,null,null,null,null,null,null,null,{"$f":"ROUND(0.1*SUM($K$27),2)","v":1494.99}]
[null,"Additional Parent and Family Engagement Funds",null,null,null,null,null,null,null,null,0]
[null,"Has the required parent and family engagement set aside been met?",null,null,null,null,null,null,null,null,{"$f":"IF(SUM('Budget Summary'!G44:K44)+(Transferability!D58+Transferability!E58)>=SUM(K28),\"Yes\",\"No - please review your entries.\")","v":"Yes"}]
["Homeless (as necessary based on needs identified on homeless tab, question 2)",null,null,null,null,null,null,null,null,null,null,null,null,0]
["Foster Care (as necessary)",null,null,null,null,null,null,null,null,null,null,null,null,0]
["Neglected/Delinquent (as necessary)",null,null,null,null,null,null,null,null,null,null,null,null,0]
["School Division Set-Asides TOTAL (Feeds Box A on Allocation to Eligible Schools Page)",null,null,null,null,null,null,null,null,null,null,null,null,{"$f":"K30+SUM(N11:P34)","v":{"$error":"#DIV/0!"}}]
["Page 43"]
[null,null,null,"School Division:",null,null,{"$f":"'Narrative & Detail Budget'!$A$15","v":"ALBEMARLE COUNTY PUBLIC SCHOOLS"},null,null,null,null,null,"Division Number:",null,null,{"$f":"'Narrative & Detail Budget'!$I$15","v":2}]
["TITLE I, PART A, ALLOCATION TO ELIGIBLE SCHOOLS"]
[null,null,null,null,null,null,null,"Low-Income Factor BELOW 35 percent"]
[null,null,null,null,null,null,null,"PPE   X   at least 125 percent"]
["A.",null,null,null,null,null,null,null,"B."]
["Division’s Title I ESEA Allocation :",null,null,null,null,{"$f":"'Narrative & Detail Budget'!N47","v":1494988},null,null,"*PER PUPIL EXPENDITURE CALCULATION"]
[null,null,null,null,null,null,null,null,"Step 1:"]
["Minus ESEA Set-Asides (if applicable):",null,null,null,null,{"$f":"$N$35","v":{"$error":"#DIV/0!"}},null,null,{"$f":"SUM(F42)","v":1494988},null,null,"¸",null,{"$f":"'Program Requirements'!H278","v":4668},null,null,null,"=",null,{"$f":"IF(ISERROR(SUM(I44)/SUM(N44)),0,SUM(I44)/SUM(N44))","v":320.26306769494431}]
[null,null,null,null," ",null,null,null,"Division Total Allocation",null,null,null,"Number of Low-Income Pupils in Entire School Division",null,null,null,null,null,"Per Pupil Expenditure (PPE)"]
["Amount for Distribution to Schools:",null,null,null,null,{"$f":"SUM(F42-F44)","v":{"$error":"#DIV/0!"}},null,null,"Step 2:"]
[null,null,null,null,null,null,null,null,null,{"$f":"SUM(T44)","v":320.26306769494431},null,"´",null,125,null,null,null,"=",null,{"$f":"ROUND((SUM(J47)*SUM(N47))/100,2)","v":400.33}]
[null,null,null,null,null,null,null,null,"PPE",null,null,null,"At least 125 percent (enter whole number)",null,null,null,null,null,"Adjusted PPE"]
["Divisionwide Average From Low-Income Families",null,null,null,null,null,{"$f":"'Program Requirements'!M280","v":0.32627385196057873},null,null,null,null,null,{"$f":"IF(N47<125,\"Amount must be 125 or higher\",\"\")","v":""}]
[]
["C.   (1)",null,null,"(2)","(3)","(4)","(5)","(6)","(7)","(8)","(9)","(10)","(11)","(12)","(13)","(14)",null,"(15)",null,"(16)",null,"(17)",null,"(18)","(19)"]
["List of  schools from highest poverty to lowest",null,null,"Eligible School?   Yes or No","Grade Span of School","Targeted Assistance School? Yes or No","Schoolwide Program School? Yes or No","Comprehensive Support and improvement?  Yes or No","Targeted Support and Improvement?  Yes or No","Number of Title I, Part A FTE Teachers funded with 2020-2021 funds","Number of Title I, Part A FTE Teachers funded with  Prior Year funds","Number of Title I, Part A FTE Para-professionals funded with  2020-2021 funds","Number of Title I, Part A FTE Para-professionals funded with  Prior Year funds","Low-Income Private School Membership","Low-Income Public School Membership","Percent Low-Income ","Minimum School Allocation ",null,{"$f":"\"Distribution Balance:  \"&+SUM(F46)&\" from Box A\"","v":{"$error":"#DIV/0!"}},null,"School Reallocation Amount**",null,"School Allocation Total (Cols. 12 and 13)",null,"Adjusted PPE"]
["                                     TOTALS FOR DIVISION",null,null,null,null,null,null,null,null,{"$f":"SUM(J55:J254)","v":0},0,0,0,0,0,null,{"$f":"SUM(Q55:R254)","v":{"$error":"#DIV/0!"}},null,{"$f":"SUM(F46)","v":{"$error":"#DIV/0!"}},null,{"$f":"SUM(U55:V254)","v":0},null,{"$f":"SUM(V55:W254)","v":{"$error":"#DIV/0!"}},null,null,{"$f":"SUM(N53)/(N53+O53)","v":{"$error":"#DIV/0!"}}]
[null,null,null,null,null,null,null,null,null,null,"Yes","No",null,null,null,"Balance to Reallocate",null,null,{"$f":"SUM(F46-W53)","v":{"$error":"#DIV/0!"}}]
[{"$f":"IF(ISBLANK('Program Requirements'!A78),\"\",('Program Requirements'!A78))","v":"Mary Carr Greer Elementary"},null,null,null,{"$f":"IF(ISBLANK('[13]Title I, Part A'!D110),\"\",'[13]Title I, Part A'!D110)","v":"07 - 12"},null,null,null,null,null,null,null,null,{"$f":"IF(D55=\"Yes\",('Program Requirements'!G78),\"\")","v":""},{"$f":"IF(D55=\"Yes\",('Program Requirements'!L78),\"\")","v":""},{"$f":"IF(ISBLANK('Program Requirements'!M78),\"\",'Program Requirements'!M78)","v":0.74656188605108054},{"$f":"IF(IF(D55=\"Yes\",IF(ISBLANK(O55),\"\",SUM(O55)*$T$47),0)>$F$46,SUM($F$46),IF(D55=\"Yes\",IF(ISBLANK(O55),\"\",SUM(O55)*$T$47),\"\"))","v":{"$error":"#DIV/0!"}},null,{"$f":"SUM(S53)-SUM(Q55)-SUM(U55)","v":{"$error":"#DIV/0!"}},null,null,null,{"$f":"IF(SUM(U55)=0,SUM(Q55),IF(SUM(Q55,U55)=U55,\"ERROR\",SUM(Q55,U55)))","v":{"$error":"#DIV/0!"}},null,{"$f":"IF(D55=\"Yes\",SUM(W55)/SUM(O55),\"\")","v":""}]
[{"$f":"IF(ISBLANK('Program Requirements'!A78),\"\",('Program Requirements'!A78))","v":"Mary Carr Greer Elementary"},null,null,null,{"$f":"IF(ISBLANK('Program Requirements'!D78),\"\",'Program Requirements'!D78)","v":"PK - 05"},null,null,null,null,null,null,null,null,{"$f":"IF(D56=\"Yes\",('Program Requirements'!G78),\"\")","v":""},{"$f":"IF(D56=\"Yes\",('Program Requirements'!L78),\"\")","v":""},{"$f":"IF(ISBLANK('Program Requirements'!M78),\"\",'Program Requirements'!M78)","v":0.74656188605108054},{"$error":"#DIV/0!"},null,{"$f":"SUM(S55)-SUM(Q56)-SUM(U56)","v":{"$error":"#DIV/0!"}},null,null,null,{"$error":"#DIV/0!"},null,""]
[{"$f":"IF(ISBLANK('Program Requirements'!A79),\"\",('Program Requirements'!A79))","v":"Woodbrook Elementary"},null,null,null,{"$f":"IF(ISBLANK('Program Requirements'!D79),\"\",'Program Requirements'!D79)","v":"PK - 05"},null,null,null,null,null,null,null,null,{"$f":"IF(D57=\"Yes\",('Program Requirements'!G79),\"\")","v":""},{"$f":"IF(D57=\"Yes\",('Program Requirements'!L79),\"\")","v":""},{"$f":"IF(ISBLANK('Program Requirements'!M79),\"\",'Program Requirements'!M79)","v":0.66837606837606833},{"$error":"#DIV/0!"},null,{"$error":"#DIV/0!"},null,null,null,{"$error":"#DIV/0!"},null,""]
[{"$f":"IF(ISBLANK('Program Requirements'!A80),\"\",('Program Requirements'!A80))","v":"Jack Jouett Middle"},null,null,null,{"$f":"IF(ISBLANK('Program Requirements'!D80),\"\",'Program Requirements'!D80)","v":"06 - 08"},null,null,null,null,null,null,null,null,{"$f":"IF(D58=\"Yes\",('Program Requirements'!G80),\"\")","v":""},{"$f":"IF(D58=\"Yes\",('Program Requirements'!L80),\"\")","v":""},{"$f":"IF(ISBLANK('Program Requirements'!M80),\"\",'Program Requirements'!M80)","v":0.57943925233644855},{"$error":"#DIV/0!"},null,{"$error":"#DIV/0!"},null,null,null,{"$error":"#DIV/0!"},null,""]
[{"$f":"IF(ISBLANK('Program Requirements'!A81),\"\",('Program Requirements'!A81))","v":"Agnor-Hurt Elementary"},null,null,null,{"$f":"IF(ISBLANK('Program Requirements'!D81),\"\",'Program Requirements'!D81)","v":"PK - 05"},null,null,null,null,null,null,null,null,{"$f":"IF(D59=\"Yes\",('Program Requirements'!G81),\"\")","v":""},{"$f":"IF(D59=\"Yes\",('Program Requirements'!L81),\"\")","v":""},{"$f":"IF(ISBLANK('Program Requirements'!M81),\"\",'Program Requirements'!M81)","v":0.55900621118012417},{"$error":"#DIV/0!"},null,{"$error":"#DIV/0!"},null,null,null,{"$error":"#DIV/0!"},null,""]
[{"$f":"IF(ISBLANK('Program Requirements'!A82),\"\",('Program Requirements'!A82))","v":"Red Hill Elementary"},null,null,null,{"$f":"IF(ISBLANK('Program Requirements'!D82),\"\",'Program Requirements'!D82)","v":"PK - 05"},null,null,null,null,null,null,null,null,{"$f":"IF(D60=\"Yes\",('Program Requirements'!G82),\"\")","v":""},{"$f":"IF(D60=\"Yes\",('Program Requirements'!L82),\"\")","v":""},{"$f":"IF(ISBLANK('Program Requirements'!M82),\"\",'Program Requirements'!M82)","v":0.53883495145631066},{"$error":"#DIV/0!"},null,{"$error":"#DIV/0!"},null,null,null,{"$error":"#DIV/0!"},null,""]
[{"$f":"IF(ISBLANK('Program Requirements'!A83),\"\",('Program Requirements'!A83))","v":"Scottsville Elementary"},null,null,null,{"$f":"IF(ISBLANK('Program Requirements'!D83),\"\",'Program Requirements'!D83)","v":"PK - 05"},null,null,null,null,null,null,null,null,{"$f":"IF(D61=\"Yes\",('Program Requirements'!G83),\"\")","v":""},{"$f":"IF(D61=\"Yes\",('Program Requirements'!L83),\"\")","v":""},{"$f":"IF(ISBLANK('Program Requirements'!M83),\"\",'Program Requirements'!M83)","v":0.4692982456140351},{"$error":"#DIV/0!"},null,{"$error":"#DIV/0!"},null,null,null,{"$error":"#DIV/0!"},null,""]
[{"$f":"IF(ISBLANK('Program Requirements'!A84),\"\",('Program Requirements'!A84))","v":"Paul H. Cale Elementary"},null,null,null,{"$f":"IF(ISBLANK('Program Requirements'!D84),\"\",'Program Requirements'!D84)","v":"PK - 05"},null,null,null,null,null,null,null,null,{"$f":"IF(D62=\"Yes\",('Program Requirements'!G84),\"\")","v":""},{"$f":"IF(D62=\"Yes\",('Program Requirements'!L84),\"\")","v":""},{"$f":"IF(ISBLANK('Program Requirements'!M84),\"\",'Program Requirements'!M84)","v":0.45314505776636715},{"$error":"#DIV/0!"},null,{"$error":"#DIV/0!"},null,null,null,{"$error":"#DIV/0!"},null,""]
[{"$f":"IF(ISBLANK('Program Requirements'!A85),\"\",('Program Requirements'!A85))","v":"Jackson P. Burley Middle"},null,null,null,{"$f":"IF(ISBLANK('Program Requirements'!D85),\"\",'Program Requirements'!D85)","v":"06 - 08"},null,null,null,null,null,null,null,null,{"$f":"IF(D63=\"Yes\",('Program Requirements'!G85),\"\")","v":""},{"$f":"IF(D63=\"Yes\",('Program Requirements'!L85),\"\")","v":""},{"$f":"IF(ISBLANK('Program Requirements'!M85),\"\",'Program Requirements'!M85)","v":0.44102564102564101},{"$error":"#DIV/0!"},null,{"$error":"#DIV/0!"},null,null,null,{"$error":"#DIV/0!"},null,""]
[{"$f":"IF(ISBLANK('Program Requirements'!A86),\"\",('Program Requirements'!A86))","v":"Leslie H. Walton Middle"},null,null,null,{"$f":"IF(ISBLANK('Program Requirements'!D86),\"\",'Program Requirements'!D86)","v":"06 - 08"},null,null,null,null,null,null,null,null,{"$f":"IF(D64=\"Yes\",('Program Requirements'!G86),\"\")","v":""},{"$f":"IF(D64=\"Yes\",('Program Requirements'!L86),\"\")","v":""},{"$f":"IF(ISBLANK('Program Requirements'!M86),\"\",'Program Requirements'!M86)","v":0.42772861356932151},{"$error":"#DIV/0!"},null,{"$error":"#DIV/0!"},null,null,null,{"$error":"#DIV/0!"},null,""]
[{"$f":"IF(ISBLANK('Program Requirements'!A87),\"\",('Program Requirements'!A87))","v":"Monticello High"},null,null,null,{"$f":"IF(ISBLANK('Program Requirements'!D87),\"\",'Program Requirements'!D87)","v":"09 - 12"},null,null,null,null,null,null,null,null,{"$f":"IF(D65=\"Yes\",('Program Requirements'!G87),\"\")","v":""},{"$f":"IF(D65=\"Yes\",('Program Requirements'!L87),\"\")","v":""},{"$f":"IF(ISBLANK('Program Requirements'!M87),\"\",'Program Requirements'!M87)","v":0.33361204013377926},{"$error":"#DIV/0!"},null,{"$error":"#DIV/0!"},null,null,null,{"$error":"#DIV/0!"},null,""]
[{"$f":"IF(ISBLANK('Program Requirements'!A88),\"\",('Program Requirements'!A88))","v":"Albemarle High"},null,null,null,{"$f":"IF(ISBLANK('Program Requirements'!D88),\"\",'Program Requirements'!D88)","v":"09 - 12"},null,null,null,null,null,null,null,null,{"$f":"IF(D66=\"Yes\",('Program Requirements'!G88),\"\")","v":""},{"$f":"IF(D66=\"Yes\",('Program Requirements'!L88),\"\")","v":""},{"$f":"IF(ISBLANK('Program Requirements'!M88),\"\",'Program Requirements'!M88)","v":0.32460732984293195},{"$error":"#DIV/0!"},null,{"$error":"#DIV/0!"},null,null,null,{"$error":"#DIV/0!"},null,""]
[{"$f":"IF(ISBLANK('Program Requirements'!A89),\"\",('Program Requirements'!A89))","v":"Stony Point Elementary"},null,null,null,{"$f":"IF(ISBLANK('Program Requirements'!D89),\"\",'Program Requirements'!D89)","v":"KG - 05"},null,null,null,null,null,null,null,null,{"$f":"IF(D67=\"Yes\",('Program Requirements'!G89),\"\")","v":""},{"$f":"IF(D67=\"Yes\",('Program Requirements'!L89),\"\")","v":""},{"$f":"IF(ISBLANK('Program Requirements'!M89),\"\",'Program Requirements'!M89)","v":0.32142857142857145},{"$error":"#DIV/0!"},null,{"$error":"#DIV/0!"},null,null,null,{"$error":"#DIV/0!"},null,""]
[{"$f":"IF(ISBLANK('Program Requirements'!A90),\"\",('Program Requirements'!A90))","v":"Crozet Elementary"},null,null,null,{"$f":"IF(ISBLANK('Program Requirements'!D90),\"\",'Program Requirements'!D90)","v":"KG - 05"},null,null,null,null,null,null,null,null,{"$f":"IF(D68=\"Yes\",('Program Requirements'!G90),\"\")","v":""},{"$f":"IF(D68=\"Yes\",('Program Requirements'!L90),\"\")","v":""},{"$f":"IF(ISBLANK('Program Requirements'!M90),\"\",'Program Requirements'!M90)","v":0.30612244897959184},{"$error":"#DIV/0!"},null,{"$error":"#DIV/0!"},null,null,null,{"$error":"#DIV/0!"},null,""]
[{"$f":"IF(ISBLANK('Program Requirements'!A91),\"\",('Program Requirements'!A91))","v":"Stone Robinson Elementary"},null,null,null,{"$f":"IF(ISBLANK('Program Requirements'!D91),\"\",'Program Requirements'!D91)","v":"PK - 05"},null,null,null,null,null,null,null,null,{"$f":"IF(D69=\"Yes\",('Program Requirements'!G91),\"\")","v":""},{"$f":"IF(D69=\"Yes\",('Program Requirements'!L91),\"\")","v":""},{"$f":"IF(ISBLANK('Program Requirements'!M91),\"\",'Program Requirements'!M91)","v":0.29158512720156554},{"$error":"#DIV/0!"},null,{"$error":"#DIV/0!"},null,null,null,{"$error":"#DIV/0!"},null,""]
[{"$f":"IF(ISBLANK('Program Requirements'!A92),\"\",('Program Requirements'!A92))","v":"Baker-Butler Elementary"},null,null,null,{"$f":"IF(ISBLANK('Program Requirements'!D92),\"\",'Program Requirements'!D92)","v":"PK - 05"},null,null,null,null,null,null,null,null,{"$f":"IF(D70=\"Yes\",('Program Requirements'!G92),\"\")","v":""},{"$f":"IF(D70=\"Yes\",('Program Requirements'!L92),\"\")","v":""},{"$f":"IF(ISBLANK('Program Requirements'!M92),\"\",'Program Requirements'!M92)","v":0.2673559822747415},{"$error":"#DIV/0!"},null,{"$error":"#DIV/0!"},null,null,null,{"$error":"#DIV/0!"},null,""]
[{"$f":"IF(ISBLANK('Program Requirements'!A93),\"\",('Program Requirements'!A93))","v":"Murray High"},null,null,null,{"$f":"IF(ISBLANK('Program Requirements'!D93),\"\",'Program Requirements'!D93)","v":"09 - 12"},null,null,null,null,null,null,null,null,{"$f":"IF(D71=\"Yes\",('Program Requirements'!G93),\"\")","v":""},{"$f":"IF(D71=\"Yes\",('Program Requirements'!L93),\"\")","v":""},{"$f":"IF(ISBLANK('Program Requirements'!M93),\"\",'Program Requirements'!M93)","v":0.25925925925925924},{"$error":"#DIV/0!"},null,{"$error":"#DIV/0!"},null,null,null,{"$error":"#DIV/0!"},null,""]
[{"$f":"IF(ISBLANK('Program Requirements'!A94),\"\",('Program Requirements'!A94))","v":"Albemarle County Community Public Charter School"},null,null,null,{"$f":"IF(ISBLANK('Program Requirements'!D94),\"\",'Program Requirements'!D94)","v":"06 - 08"},null,null,null,null,null,null,null,null,{"$f":"IF(D72=\"Yes\",('Program Requirements'!G94),\"\")","v":""},{"$f":"IF(D72=\"Yes\",('Program Requirements'!L94),\"\")","v":""},{"$f":"IF(ISBLANK('Program Requirements'!M94),\"\",'Program Requirements'!M94)","v":0.22413793103448276},{"$error":"#DIV/0!"},null,{"$error":"#DIV/0!"},null,null,null,{"$error":"#DIV/0!"},null,""]
[{"$f":"IF(ISBLANK('Program Requirements'!A95),\"\",('Program Requirements'!A95))","v":"Mortimer Y. Sutherland Middle"},null,null,null,{"$f":"IF(ISBLANK('Program Requirements'!D95),\"\",'Program Requirements'!D95)","v":"06 - 08"},null,null,null,null,null,null,null,null,{"$f":"IF(D73=\"Yes\",('Program Requirements'!G95),\"\")","v":""},{"$f":"IF(D73=\"Yes\",('Program Requirements'!L95),\"\")","v":""},{"$f":"IF(ISBLANK('Program Requirements'!M95),\"\",'Program Requirements'!M95)","v":0.22016806722689075},{"$error":"#DIV/0!"},null,{"$error":"#DIV/0!"},null,null,null,{"$error":"#DIV/0!"},null,""]
[{"$f":"IF(ISBLANK('Program Requirements'!A96),\"\",('Program Requirements'!A96))","v":"Broadus Wood Elementary"},null,null,null,{"$f":"IF(ISBLANK('Program Requirements'!D96),\"\",'Program Requirements'!D96)","v":"PK - 05"},null,null,null,null,null,null,null,null,{"$f":"IF(D74=\"Yes\",('Program Requirements'!G96),\"\")","v":""},{"$f":"IF(D74=\"Yes\",('Program Requirements'!L96),\"\")","v":""},{"$f":"IF(ISBLANK('Program Requirements'!M96),\"\",'Program Requirements'!M96)","v":0.19097222222222221},{"$error":"#DIV/0!"},null,{"$error":"#DIV/0!"},null,null,null,{"$error":"#DIV/0!"},null,""]
[{"$f":"IF(ISBLANK('Program Requirements'!A97),\"\",('Program Requirements'!A97))","v":"Hollymead Elementary"},null,null,null,{"$f":"IF(ISBLANK('Program Requirements'!D97),\"\",'Program Requirements'!D97)","v":"PK - 05"},null,null,null,null,null,null,null,null,{"$f":"IF(D75=\"Yes\",('Program Requirements'!G97),\"\")","v":""},{"$f":"IF(D75=\"Yes\",('Program Requirements'!L97),\"\")","v":""},{"$f":"IF(ISBLANK('Program Requirements'!M97),\"\",'Program Requirements'!M97)","v":0.1744186046511628},{"$error":"#DIV/0!"},null,{"$error":"#DIV/0!"},null,null,null,{"$error":"#DIV/0!"},null,""]
[{"$f":"IF(ISBLANK('Program Requirements'!A98),\"\",('Program Requirements'!A98))","v":"Joseph T. Henley Middle"},null,null,null,{"$f":"IF(ISBLANK('Program Requirements'!D98),\"\",'Program Requirements'!D98)","v":"06 - 08"},null,null,null,null,null,null,null,null,{"$f":"IF(D76=\"Yes\",('Program Requirements'!G98),\"\")","v":""},{"$f":"IF(D76=\"Yes\",('Program Requirements'!L98),\"\")","v":""},{"$f":"IF(ISBLANK('Program Requirements'!M98),\"\",'Program Requirements'!M98)","v":0.14895947426067907},{"$error":"#DIV/0!"},null,{"$error":"#DIV/0!"},null,null,null,{"$error":"#DIV/0!"},null,""]
[{"$f":"IF(ISBLANK('Program Requirements'!A99),\"\",('Program Requirements'!A99))","v":"Western Albemarle High"},null,null,null,{"$f":"IF(ISBLANK('Program Requirements'!D99),\"\",'Program Requirements'!D99)","v":"09 - 12"},null,null,null,null,null,null,null,null,{"$f":"IF(D77=\"Yes\",('Program Requirements'!G99),\"\")","v":""},{"$f":"IF(D77=\"Yes\",('Program Requirements'!L99),\"\")","v":""},{"$f":"IF(ISBLANK('Program Requirements'!M99),\"\",'Program Requirements'!M99)","v":0.12687813021702837},{"$error":"#DIV/0!"},null,{"$error":"#DIV/0!"},null,null,null,{"$error":"#DIV/0!"},null,""]
[{"$f":"IF(ISBLANK('Program Requirements'!A100),\"\",('Program Requirements'!A100))","v":"Brownsville Elementary"},null,null,null,{"$f":"IF(ISBLANK('Program Requirements'!D100),\"\",'Program Requirements'!D100)","v":"PK - 05"},null,null,null,null,null,null,null,null,{"$f":"IF(D78=\"Yes\",('Program Requirements'!G100),\"\")","v":""},{"$f":"IF(D78=\"Yes\",('Program Requirements'!L100),\"\")","v":""},{"$f":"IF(ISBLANK('Program Requirements'!M100),\"\",'Program Requirements'!M100)","v":0.12254335260115606},{"$error":"#DIV/0!"},null,{"$error":"#DIV/0!"},null,null,null,{"$error":"#DIV/0!"},null,""]
[{"$f":"IF(ISBLANK('Program Requirements'!A101),\"\",('Program Requirements'!A101))","v":"Meriwether Lewis Elementary"},null,null,null,{"$f":"IF(ISBLANK('Program Requirements'!D101),\"\",'Program Requirements'!D101)","v":"KG - 05"},null,null,null,null,null,null,null,null,{"$f":"IF(D79=\"Yes\",('Program Requirements'!G101),\"\")","v":""},{"$f":"IF(D79=\"Yes\",('Program Requirements'!L101),\"\")","v":""},{"$f":"IF(ISBLANK('Program Requirements'!M101),\"\",'Program Requirements'!M101)","v":0.12},{"$error":"#DIV/0!"},null,{"$error":"#DIV/0!"},null,null,null,{"$error":"#DIV/0!"},null,""]
[{"$f":"IF(ISBLANK('Program Requirements'!A102),\"\",('Program Requirements'!A102))","v":"Virginia L. Murray Elementary"},null,null,null,{"$f":"IF(ISBLANK('Program Requirements'!D102),\"\",'Program Requirements'!D102)","v":"PK - 05"},null,null,null,null,null,null,null,null,{"$f":"IF(D80=\"Yes\",('Program Requirements'!G102),\"\")","v":""},{"$f":"IF(D80=\"Yes\",('Program Requirements'!L102),\"\")","v":""},{"$f":"IF(ISBLANK('Program Requirements'!M102),\"\",'Program Requirements'!M102)","v":6.8702290076335881E-2},{"$error":"#DIV/0!"},null,{"$error":"#DIV/0!"},null,null,null,{"$error":"#DIV/0!"},null,""]
[{"$f":"IF(ISBLANK('Program Requirements'!A103),\"\",('Program Requirements'!A103))","v":""},null,null,null,{"$f":"IF(ISBLANK('Program Requirements'!D103),\"\",'Program Requirements'!D103)","v":""},null,null,null,null,null,null,null,null,{"$f":"IF(D81=\"Yes\",('Program Requirements'!G103),\"\")","v":""},{"$f":"IF(D81=\"Yes\",('Program Requirements'!L103),\"\")","v":""},{"$f":"IF(ISBLANK('Program Requirements'!M103),\"\",'Program Requirements'!M103)","v":{"$error":"#DIV/0!"}},{"$error":"#DIV/0!"},null,{"$error":"#DIV/0!"},null,null,null,{"$error":"#DIV/0!"},null,""]
[{"$f":"IF(ISBLANK('Program Requirements'!A104),\"\",('Program Requirements'!A104))","v":""},null,null,null,{"$f":"IF(ISBLANK('Program Requirements'!D104),\"\",'Program Requirements'!D104)","v":""},null,null,null,null,null,null,null,null,{"$f":"IF(D82=\"Yes\",('Program Requirements'!G104),\"\")","v":""},{"$f":"IF(D82=\"Yes\",('Program Requirements'!L104),\"\")","v":""},{"$f":"IF(ISBLANK('Program Requirements'!M104),\"\",'Program Requirements'!M104)","v":{"$error":"#DIV/0!"}},{"$error":"#DIV/0!"},null,{"$error":"#DIV/0!"},null,null,null,{"$error":"#DIV/0!"},null,""]
[{"$f":"IF(ISBLANK('Program Requirements'!A105),\"\",('Program Requirements'!A105))","v":""},null,null,null,{"$f":"IF(ISBLANK('Program Requirements'!D105),\"\",'Program Requirements'!D105)","v":""},null,null,null,null,null,null,null,null,{"$f":"IF(D83=\"Yes\",('Program Requirements'!G105),\"\")","v":""},{"$f":"IF(D83=\"Yes\",('Program Requirements'!L105),\"\")","v":""},{"$f":"IF(ISBLANK('Program Requirements'!M105),\"\",'Program Requirements'!M105)","v":{"$error":"#DIV/0!"}},{"$error":"#DIV/0!"},null,{"$error":"#DIV/0!"},null,null,null,{"$error":"#DIV/0!"},null,""]
[{"$f":"IF(ISBLANK('Program Requirements'!A106),\"\",('Program Requirements'!A106))","v":""},null,null,null,{"$f":"IF(ISBLANK('Program Requirements'!D106),\"\",'Program Requirements'!D106)","v":""},null,null,null,null,null,null,null,null,{"$f":"IF(D84=\"Yes\",('Program Requirements'!G106),\"\")","v":""},{"$f":"IF(D84=\"Yes\",('Program Requirements'!L106),\"\")","v":""},{"$f":"IF(ISBLANK('Program Requirements'!M106),\"\",'Program Requirements'!M106)","v":{"$error":"#DIV/0!"}},{"$error":"#DIV/0!"},null,{"$error":"#DIV/0!"},null,null,null,{"$error":"#DIV/0!"},null,""]
[{"$f":"IF(ISBLANK('Program Requirements'!A107),\"\",('Program Requirements'!A107))","v":""},null,null,null,{"$f":"IF(ISBLANK('Program Requirements'!D107),\"\",'Program Requirements'!D107)","v":""},null,null,null,null,null,null,null,null,{"$f":"IF(D85=\"Yes\",('Program Requirements'!G107),\"\")","v":""},{"$f":"IF(D85=\"Yes\",('Program Requirements'!L107),\"\")","v":""},{"$f":"IF(ISBLANK('Program Requirements'!M107),\"\",'Program Requirements'!M107)","v":{"$error":"#DIV/0!"}},{"$error":"#DIV/0!"},null,{"$error":"#DIV/0!"},null,null,null,{"$error":"#DIV/0!"},null,""]
[{"$f":"IF(ISBLANK('Program Requirements'!A108),\"\",('Program Requirements'!A108))","v":""},null,null,null,{"$f":"IF(ISBLANK('Program Requirements'!D108),\"\",'Program Requirements'!D108)","v":""},null,null,null,null,null,null,null,null,{"$f":"IF(D86=\"Yes\",('Program Requirements'!G108),\"\")","v":""},{"$f":"IF(D86=\"Yes\",('Program Requirements'!L108),\"\")","v":""},{"$f":"IF(ISBLANK('Program Requirements'!M108),\"\",'Program Requirements'!M108)","v":{"$error":"#DIV/0!"}},{"$error":"#DIV/0!"},null,{"$error":"#DIV/0!"},null,null,null,{"$error":"#DIV/0!"},null,""]
[{"$f":"IF(ISBLANK('Program Requirements'!A109),\"\",('Program Requirements'!A109))","v":""},null,null,null,{"$f":"IF(ISBLANK('Program Requirements'!D109),\"\",'Program Requirements'!D109)","v":""},null,null,null,null,null,null,null,null,{"$f":"IF(D87=\"Yes\",('Program Requirements'!G109),\"\")","v":""},{"$f":"IF(D87=\"Yes\",('Program Requirements'!L109),\"\")","v":""},{"$f":"IF(ISBLANK('Program Requirements'!M109),\"\",'Program Requirements'!M109)","v":{"$error":"#DIV/0!"}},{"$f":"IF(IF(D87=\"Yes\",IF(ISBLANK(O87),\"\",SUM(O87)*$T$47),0)>$F$46,SUM($F$46),IF(D87=\"Yes\",IF(ISBLANK(O87),\"\",SUM(O87)*$T$47),\"\"))","v":{"$error":"#DIV/0!"}},null,{"$error":"#DIV/0!"},null,null,null,{"$f":"IF(SUM(U87)=0,SUM(Q87),IF(SUM(Q87,U87)=U87,\"ERROR\",SUM(Q87,U87)))","v":{"$error":"#DIV/0!"}},null,""]
[{"$f":"IF(ISBLANK('Program Requirements'!A110),\"\",('Program Requirements'!A110))","v":""},null,null,null,{"$f":"IF(ISBLANK('Program Requirements'!D110),\"\",'Program Requirements'!D110)","v":""},null,null,null,null,null,null,null,null,{"$f":"IF(D88=\"Yes\",('Program Requirements'!G110),\"\")","v":""},{"$f":"IF(D88=\"Yes\",('Program Requirements'!L110),\"\")","v":""},{"$f":"IF(ISBLANK('Program Requirements'!M110),\"\",'Program Requirements'!M110)","v":{"$error":"#DIV/0!"}},{"$error":"#DIV/0!"},null,{"$error":"#DIV/0!"},null,null,null,{"$error":"#DIV/0!"},null,""]
[{"$f":"IF(ISBLANK('Program Requirements'!A111),\"\",('Program Requirements'!A111))","v":""},null,null,null,{"$f":"IF(ISBLANK('Program Requirements'!D111),\"\",'Program Requirements'!D111)","v":""},null,null,null,null,null,null,null,null,{"$f":"IF(D89=\"Yes\",('Program Requirements'!G111),\"\")","v":""},{"$f":"IF(D89=\"Yes\",('Program Requirements'!L111),\"\")","v":""},{"$f":"IF(ISBLANK('Program Requirements'!M111),\"\",'Program Requirements'!M111)","v":{"$error":"#DIV/0!"}},{"$error":"#DIV/0!"},null,{"$error":"#DIV/0!"},null,null,null,{"$error":"#DIV/0!"},null,""]
[{"$f":"IF(ISBLANK('Program Requirements'!A112),\"\",('Program Requirements'!A112))","v":""},null,null,null,{"$f":"IF(ISBLANK('Program Requirements'!D112),\"\",'Program Requirements'!D112)","v":""},null,null,null,null,null,null,null,null,{"$f":"IF(D90=\"Yes\",('Program Requirements'!G112),\"\")","v":""},{"$f":"IF(D90=\"Yes\",('Program Requirements'!L112),\"\")","v":""},{"$f":"IF(ISBLANK('Program Requirements'!M112),\"\",'Program Requirements'!M112)","v":{"$error":"#DIV/0!"}},{"$error":"#DIV/0!"},null,{"$error":"#DIV/0!"},null,null,null,{"$error":"#DIV/0!"},null,""]
[{"$f":"IF(ISBLANK('Program Requirements'!A113),\"\",('Program Requirements'!A113))","v":""},null,null,null,{"$f":"IF(ISBLANK('Program Requirements'!D113),\"\",'Program Requirements'!D113)","v":""},null,null,null,null,null,null,null,null,{"$f":"IF(D91=\"Yes\",('Program Requirements'!G113),\"\")","v":""},{"$f":"IF(D91=\"Yes\",('Program Requirements'!L113),\"\")","v":""},{"$f":"IF(ISBLANK('Program Requirements'!M113),\"\",'Program Requirements'!M113)","v":{"$error":"#DIV/0!"}},{"$error":"#DIV/0!"},null,{"$error":"#DIV/0!"},null,null,null,{"$error":"#DIV/0!"},null,""]
[{"$f":"IF(ISBLANK('Program Requirements'!A114),\"\",('Program Requirements'!A114))","v":""},null,null,null,{"$f":"IF(ISBLANK('Program Requirements'!D114),\"\",'Program Requirements'!D114)","v":""},null,null,null,null,null,null,null,null,{"$f":"IF(D92=\"Yes\",('Program Requirements'!G114),\"\")","v":""},{"$f":"IF(D92=\"Yes\",('Program Requirements'!L114),\"\")","v":""},{"$f":"IF(ISBLANK('Program Requirements'!M114),\"\",'Program Requirements'!M114)","v":{"$error":"#DIV/0!"}},{"$error":"#DIV/0!"},null,{"$error":"#DIV/0!"},null,null,null,{"$error":"#DIV/0!"},null,""]
[{"$f":"IF(ISBLANK('Program Requirements'!A115),\"\",('Program Requirements'!A115))","v":""},null,null,null,{"$f":"IF(ISBLANK('Program Requirements'!D115),\"\",'Program Requirements'!D115)","v":""},null,null,null,null,null,null,null,null,{"$f":"IF(D93=\"Yes\",('Program Requirements'!G115),\"\")","v":""},{"$f":"IF(D93=\"Yes\",('Program Requirements'!L115),\"\")","v":""},{"$f":"IF(ISBLANK('Program Requirements'!M115),\"\",'Program Requirements'!M115)","v":{"$error":"#DIV/0!"}},{"$error":"#DIV/0!"},null,{"$error":"#DIV/0!"},null,null,null,{"$error":"#DIV/0!"},null,""]
[{"$f":"IF(ISBLANK('Program Requirements'!A116),\"\",('Program Requirements'!A116))","v":""},null,null,null,{"$f":"IF(ISBLANK('Program Requirements'!D116),\"\",'Program Requirements'!D116)","v":""},null,null,null,null,null,null,null,null,{"$f":"IF(D94=\"Yes\",('Program Requirements'!G116),\"\")","v":""},{"$f":"IF(D94=\"Yes\",('Program Requirements'!L116),\"\")","v":""},{"$f":"IF(ISBLANK('Program Requirements'!M116),\"\",'Program Requirements'!M116)","v":{"$error":"#DIV/0!"}},{"$error":"#DIV/0!"},null,{"$error":"#DIV/0!"},null,null,null,{"$error":"#DIV/0!"},null,""]
[{"$f":"IF(ISBLANK('Program Requirements'!A117),\"\",('Program Requirements'!A117))","v":""},null,null,null,{"$f":"IF(ISBLANK('Program Requirements'!D117),\"\",'Program Requirements'!D117)","v":""},null,null,null,null,null,null,null,null,{"$f":"IF(D95=\"Yes\",('Program Requirements'!G117),\"\")","v":""},{"$f":"IF(D95=\"Yes\",('Program Requirements'!L117),\"\")","v":""},{"$f":"IF(ISBLANK('Program Requirements'!M117),\"\",'Program Requirements'!M117)","v":{"$error":"#DIV/0!"}},{"$error":"#DIV/0!"},null,{"$error":"#DIV/0!"},null,null,null,{"$error":"#DIV/0!"},null,""]
[{"$f":"IF(ISBLANK('Program Requirements'!A118),\"\",('Program Requirements'!A118))","v":""},null,null,null,{"$f":"IF(ISBLANK('Program Requirements'!D118),\"\",'Program Requirements'!D118)","v":""},null,null,null,null,null,null,null,null,{"$f":"IF(D96=\"Yes\",('Program Requirements'!G118),\"\")","v":""},{"$f":"IF(D96=\"Yes\",('Program Requirements'!L118),\"\")","v":""},{"$f":"IF(ISBLANK('Program Requirements'!M118),\"\",'Program Requirements'!M118)","v":{"$error":"#DIV/0!"}},{"$error":"#DIV/0!"},null,{"$error":"#DIV/0!"},null,null,null,{"$error":"#DIV/0!"},null,""]
[{"$f":"IF(ISBLANK('Program Requirements'!A119),\"\",('Program Requirements'!A119))","v":""},null,null,null,{"$f":"IF(ISBLANK('Program Requirements'!D119),\"\",'Program Requirements'!D119)","v":""},null,null,null,null,null,null,null,null,{"$f":"IF(D97=\"Yes\",('Program Requirements'!G119),\"\")","v":""},{"$f":"IF(D97=\"Yes\",('Program Requirements'!L119),\"\")","v":""},{"$f":"IF(ISBLANK('Program Requirements'!M119),\"\",'Program Requirements'!M119)","v":{"$error":"#DIV/0!"}},{"$error":"#DIV/0!"},null,{"$error":"#DIV/0!"},null,null,null,{"$error":"#DIV/0!"},null,""]
[{"$f":"IF(ISBLANK('Program Requirements'!A120),\"\",('Program Requirements'!A120))","v":""},null,null,null,{"$f":"IF(ISBLANK('Program Requirements'!D120),\"\",'Program Requirements'!D120)","v":""},null,null,null,null,null,null,null,null,{"$f":"IF(D98=\"Yes\",('Program Requirements'!G120),\"\")","v":""},{"$f":"IF(D98=\"Yes\",('Program Requirements'!L120),\"\")","v":""},{"$f":"IF(ISBLANK('Program Requirements'!M120),\"\",'Program Requirements'!M120)","v":{"$error":"#DIV/0!"}},{"$error":"#DIV/0!"},null,{"$error":"#DIV/0!"},null,null,null,{"$error":"#DIV/0!"},null,""]
[{"$f":"IF(ISBLANK('Program Requirements'!A121),\"\",('Program Requirements'!A121))","v":""},null,null,null,{"$f":"IF(ISBLANK('Program Requirements'!D121),\"\",'Program Requirements'!D121)","v":""},null,null,null,null,null,null,null,null,{"$f":"IF(D99=\"Yes\",('Program Requirements'!G121),\"\")","v":""},{"$f":"IF(D99=\"Yes\",('Program Requirements'!L121),\"\")","v":""},{"$f":"IF(ISBLANK('Program Requirements'!M121),\"\",'Program Requirements'!M121)","v":{"$error":"#DIV/0!"}},{"$error":"#DIV/0!"},null,{"$error":"#DIV/0!"},null,null,null,{"$error":"#DIV/0!"},null,""]
[{"$f":"IF(ISBLANK('Program Requirements'!A122),\"\",('Program Requirements'!A122))","v":""},null,null,null,{"$f":"IF(ISBLANK('Program Requirements'!D122),\"\",'Program Requirements'!D122)","v":""},null,null,null,null,null,null,null,null,{"$f":"IF(D100=\"Yes\",('Program Requirements'!G122),\"\")","v":""},{"$f":"IF(D100=\"Yes\",('Program Requirements'!L122),\"\")","v":""},{"$f":"IF(ISBLANK('Program Requirements'!M122),\"\",'Program Requirements'!M122)","v":{"$error":"#DIV/0!"}},{"$error":"#DIV/0!"},null,{"$error":"#DIV/0!"},null,null,null,{"$error":"#DIV/0!"},null,""]
[{"$f":"IF(ISBLANK('Program Requirements'!A123),\"\",('Program Requirements'!A123))","v":""},null,null,null,{"$f":"IF(ISBLANK('Program Requirements'!D123),\"\",'Program Requirements'!D123)","v":""},null,null,null,null,null,null,null,null,{"$f":"IF(D101=\"Yes\",('Program Requirements'!G123),\"\")","v":""},{"$f":"IF(D101=\"Yes\",('Program Requirements'!L123),\"\")","v":""},{"$f":"IF(ISBLANK('Program Requirements'!M123),\"\",'Program Requirements'!M123)","v":{"$error":"#DIV/0!"}},{"$error":"#DIV/0!"},null,{"$error":"#DIV/0!"},null,null,null,{"$error":"#DIV/0!"},null,""]
[{"$f":"IF(ISBLANK('Program Requirements'!A124),\"\",('Program Requirements'!A124))","v":""},null,null,null,{"$f":"IF(ISBLANK('Program Requirements'!D124),\"\",'Program Requirements'!D124)","v":""},null,null,null,null,null,null,null,null,{"$f":"IF(D102=\"Yes\",('Program Requirements'!G124),\"\")","v":""},{"$f":"IF(D102=\"Yes\",('Program Requirements'!L124),\"\")","v":""},{"$f":"IF(ISBLANK('Program Requirements'!M124),\"\",'Program Requirements'!M124)","v":{"$error":"#DIV/0!"}},{"$error":"#DIV/0!"},null,{"$error":"#DIV/0!"},null,null,null,{"$error":"#DIV/0!"},null,""]
[{"$f":"IF(ISBLANK('Program Requirements'!A125),\"\",('Program Requirements'!A125))","v":""},null,null,null,{"$f":"IF(ISBLANK('Program Requirements'!D125),\"\",'Program Requirements'!D125)","v":""},null,null,null,null,null,null,null,null,{"$f":"IF(D103=\"Yes\",('Program Requirements'!G125),\"\")","v":""},{"$f":"IF(D103=\"Yes\",('Program Requirements'!L125),\"\")","v":""},{"$f":"IF(ISBLANK('Program Requirements'!M125),\"\",'Program Requirements'!M125)","v":{"$error":"#DIV/0!"}},{"$error":"#DIV/0!"},null,{"$error":"#DIV/0!"},null,null,null,{"$error":"#DIV/0!"},null,""]
[{"$f":"IF(ISBLANK('Program Requirements'!A126),\"\",('Program Requirements'!A126))","v":""},null,null,null,{"$f":"IF(ISBLANK('Program Requirements'!D126),\"\",'Program Requirements'!D126)","v":""},null,null,null,null,null,null,null,null,{"$f":"IF(D104=\"Yes\",('Program Requirements'!G126),\"\")","v":""},{"$f":"IF(D104=\"Yes\",('Program Requirements'!L126),\"\")","v":""},{"$f":"IF(ISBLANK('Program Requirements'!M126),\"\",'Program Requirements'!M126)","v":{"$error":"#DIV/0!"}},{"$error":"#DIV/0!"},null,{"$error":"#DIV/0!"},null,null,null,{"$error":"#DIV/0!"},null,""]
[{"$f":"IF(ISBLANK('Program Requirements'!A127),\"\",('Program Requirements'!A127))","v":""},null,null,null,{"$f":"IF(ISBLANK('Program Requirements'!D127),\"\",'Program Requirements'!D127)","v":""},null,null,null,null,null,null,null,null,{"$f":"IF(D105=\"Yes\",('Program Requirements'!G127),\"\")","v":""},{"$f":"IF(D105=\"Yes\",('Program Requirements'!L127),\"\")","v":""},{"$f":"IF(ISBLANK('Program Requirements'!M127),\"\",'Program Requirements'!M127)","v":{"$error":"#DIV/0!"}},{"$error":"#DIV/0!"},null,{"$error":"#DIV/0!"},null,null,null,{"$error":"#DIV/0!"},null,""]
[{"$f":"IF(ISBLANK('Program Requirements'!A128),\"\",('Program Requirements'!A128))","v":""},null,null,null,{"$f":"IF(ISBLANK('Program Requirements'!D128),\"\",'Program Requirements'!D128)","v":""},null,null,null,null,null,null,null,null,{"$f":"IF(D106=\"Yes\",('Program Requirements'!G128),\"\")","v":""},{"$f":"IF(D106=\"Yes\",('Program Requirements'!L128),\"\")","v":""},{"$f":"IF(ISBLANK('Program Requirements'!M128),\"\",'Program Requirements'!M128)","v":{"$error":"#DIV/0!"}},{"$error":"#DIV/0!"},null,{"$error":"#DIV/0!"},null,null,null,{"$error":"#DIV/0!"},null,""]
[{"$f":"IF(ISBLANK('Program Requirements'!A129),\"\",('Program Requirements'!A129))","v":""},null,null,null,{"$f":"IF(ISBLANK('Program Requirements'!D129),\"\",'Program Requirements'!D129)","v":""},null,null,null,null,null,null,null,null,{"$f":"IF(D107=\"Yes\",('Program Requirements'!G129),\"\")","v":""},{"$f":"IF(D107=\"Yes\",('Program Requirements'!L129),\"\")","v":""},{"$f":"IF(ISBLANK('Program Requirements'!M129),\"\",'Program Requirements'!M129)","v":{"$error":"#DIV/0!"}},{"$error":"#DIV/0!"},null,{"$error":"#DIV/0!"},null,null,null,{"$error":"#DIV/0!"},null,""]
[{"$f":"IF(ISBLANK('Program Requirements'!A130),\"\",('Program Requirements'!A130))","v":""},null,null,null,{"$f":"IF(ISBLANK('Program Requirements'!D130),\"\",'Program Requirements'!D130)","v":""},null,null,null,null,null,null,null,null,{"$f":"IF(D108=\"Yes\",('Program Requirements'!G130),\"\")","v":""},{"$f":"IF(D108=\"Yes\",('Program Requirements'!L130),\"\")","v":""},{"$f":"IF(ISBLANK('Program Requirements'!M130),\"\",'Program Requirements'!M130)","v":{"$error":"#DIV/0!"}},{"$error":"#DIV/0!"},null,{"$error":"#DIV/0!"},null,null,null,{"$error":"#DIV/0!"},null,""]
[{"$f":"IF(ISBLANK('Program Requirements'!A131),\"\",('Program Requirements'!A131))","v":""},null,null,null,{"$f":"IF(ISBLANK('Program Requirements'!D131),\"\",'Program Requirements'!D131)","v":""},null,null,null,null,null,null,null,null,{"$f":"IF(D109=\"Yes\",('Program Requirements'!G131),\"\")","v":""},{"$f":"IF(D109=\"Yes\",('Program Requirements'!L131),\"\")","v":""},{"$f":"IF(ISBLANK('Program Requirements'!M131),\"\",'Program Requirements'!M131)","v":{"$error":"#DIV/0!"}},{"$error":"#DIV/0!"},null,{"$error":"#DIV/0!"},null,null,null,{"$error":"#DIV/0!"},null,""]
[{"$f":"IF(ISBLANK('Program Requirements'!A132),\"\",('Program Requirements'!A132))","v":""},null,null,null,{"$f":"IF(ISBLANK('Program Requirements'!D132),\"\",'Program Requirements'!D132)","v":""},null,null,null,null,null,null,null,null,{"$f":"IF(D110=\"Yes\",('Program Requirements'!G132),\"\")","v":""},{"$f":"IF(D110=\"Yes\",('Program Requirements'!L132),\"\")","v":""},{"$f":"IF(ISBLANK('Program Requirements'!M132),\"\",'Program Requirements'!M132)","v":{"$error":"#DIV/0!"}},{"$error":"#DIV/0!"},null,{"$error":"#DIV/0!"},null,null,null,{"$error":"#DIV/0!"},null,""]
[{"$f":"IF(ISBLANK('Program Requirements'!A133),\"\",('Program Requirements'!A133))","v":""},null,null,null,{"$f":"IF(ISBLANK('Program Requirements'!D133),\"\",'Program Requirements'!D133)","v":""},null,null,null,null,null,null,null,null,{"$f":"IF(D111=\"Yes\",('Program Requirements'!G133),\"\")","v":""},{"$f":"IF(D111=\"Yes\",('Program Requirements'!L133),\"\")","v":""},{"$f":"IF(ISBLANK('Program Requirements'!M133),\"\",'Program Requirements'!M133)","v":{"$error":"#DIV/0!"}},{"$error":"#DIV/0!"},null,{"$error":"#DIV/0!"},null,null,null,{"$error":"#DIV/0!"},null,""]
[{"$f":"IF(ISBLANK('Program Requirements'!A134),\"\",('Program Requirements'!A134))","v":""},null,null,null,{"$f":"IF(ISBLANK('Program Requirements'!D134),\"\",'Program Requirements'!D134)","v":""},null,null,null,null,null,null,null,null,{"$f":"IF(D112=\"Yes\",('Program Requirements'!G134),\"\")","v":""},{"$f":"IF(D112=\"Yes\",('Program Requirements'!L134),\"\")","v":""},{"$f":"IF(ISBLANK('Program Requirements'!M134),\"\",'Program Requirements'!M134)","v":{"$error":"#DIV/0!"}},{"$error":"#DIV/0!"},null,{"$error":"#DIV/0!"},null,null,null,{"$error":"#DIV/0!"},null,""]
[{"$f":"IF(ISBLANK('Program Requirements'!A135),\"\",('Program Requirements'!A135))","v":""},null,null,null,{"$f":"IF(ISBLANK('Program Requirements'!D135),\"\",'Program Requirements'!D135)","v":""},null,null,null,null,null,null,null,null,{"$f":"IF(D113=\"Yes\",('Program Requirements'!G135),\"\")","v":""},{"$f":"IF(D113=\"Yes\",('Program Requirements'!L135),\"\")","v":""},{"$f":"IF(ISBLANK('Program Requirements'!M135),\"\",'Program Requirements'!M135)","v":{"$error":"#DIV/0!"}},{"$error":"#DIV/0!"},null,{"$error":"#DIV/0!"},null,null,null,{"$error":"#DIV/0!"},null,""]
[{"$f":"IF(ISBLANK('Program Requirements'!A136),\"\",('Program Requirements'!A136))","v":""},null,null,null,{"$f":"IF(ISBLANK('Program Requirements'!D136),\"\",'Program Requirements'!D136)","v":""},null,null,null,null,null,null,null,null,{"$f":"IF(D114=\"Yes\",('Program Requirements'!G136),\"\")","v":""},{"$f":"IF(D114=\"Yes\",('Program Requirements'!L136),\"\")","v":""},{"$f":"IF(ISBLANK('Program Requirements'!M136),\"\",'Program Requirements'!M136)","v":{"$error":"#DIV/0!"}},{"$error":"#DIV/0!"},null,{"$error":"#DIV/0!"},null,null,null,{"$error":"#DIV/0!"},null,""]
[{"$f":"IF(ISBLANK('Program Requirements'!A137),\"\",('Program Requirements'!A137))","v":""},null,null,null,{"$f":"IF(ISBLANK('Program Requirements'!D137),\"\",'Program Requirements'!D137)","v":""},null,null,null,null,null,null,null,null,{"$f":"IF(D115=\"Yes\",('Program Requirements'!G137),\"\")","v":""},{"$f":"IF(D115=\"Yes\",('Program Requirements'!L137),\"\")","v":""},{"$f":"IF(ISBLANK('Program Requirements'!M137),\"\",'Program Requirements'!M137)","v":{"$error":"#DIV/0!"}},{"$error":"#DIV/0!"},null,{"$error":"#DIV/0!"},null,null,null,{"$error":"#DIV/0!"},null,""]
[{"$f":"IF(ISBLANK('Program Requirements'!A138),\"\",('Program Requirements'!A138))","v":""},null,null,null,{"$f":"IF(ISBLANK('Program Requirements'!D138),\"\",'Program Requirements'!D138)","v":""},null,null,null,null,null,null,null,null,{"$f":"IF(D116=\"Yes\",('Program Requirements'!G138),\"\")","v":""},{"$f":"IF(D116=\"Yes\",('Program Requirements'!L138),\"\")","v":""},{"$f":"IF(ISBLANK('Program Requirements'!M138),\"\",'Program Requirements'!M138)","v":{"$error":"#DIV/0!"}},{"$error":"#DIV/0!"},null,{"$error":"#DIV/0!"},null,null,null,{"$error":"#DIV/0!"},null,""]
[{"$f":"IF(ISBLANK('Program Requirements'!A139),\"\",('Program Requirements'!A139))","v":""},null,null,null,{"$f":"IF(ISBLANK('Program Requirements'!D139),\"\",'Program Requirements'!D139)","v":""},null,null,null,null,null,null,null,null,{"$f":"IF(D117=\"Yes\",('Program Requirements'!G139),\"\")","v":""},{"$f":"IF(D117=\"Yes\",('Program Requirements'!L139),\"\")","v":""},{"$f":"IF(ISBLANK('Program Requirements'!M139),\"\",'Program Requirements'!M139)","v":{"$error":"#DIV/0!"}},{"$error":"#DIV/0!"},null,{"$error":"#DIV/0!"},null,null,null,{"$error":"#DIV/0!"},null,""]
[{"$f":"IF(ISBLANK('Program Requirements'!A140),\"\",('Program Requirements'!A140))","v":""},null,null,null,{"$f":"IF(ISBLANK('Program Requirements'!D140),\"\",'Program Requirements'!D140)","v":""},null,null,null,null,null,null,null,null,{"$f":"IF(D118=\"Yes\",('Program Requirements'!G140),\"\")","v":""},{"$f":"IF(D118=\"Yes\",('Program Requirements'!L140),\"\")","v":""},{"$f":"IF(ISBLANK('Program Requirements'!M140),\"\",'Program Requirements'!M140)","v":{"$error":"#DIV/0!"}},{"$error":"#DIV/0!"},null,{"$error":"#DIV/0!"},null,null,null,{"$error":"#DIV/0!"},null,""]
[{"$f":"IF(ISBLANK('Program Requirements'!A141),\"\",('Program Requirements'!A141))","v":""},null,null,null,{"$f":"IF(ISBLANK('Program Requirements'!D141),\"\",'Program Requirements'!D141)","v":""},null,null,null,null,null,null,null,null,{"$f":"IF(D119=\"Yes\",('Program Requirements'!G141),\"\")","v":""},{"$f":"IF(D119=\"Yes\",('Program Requirements'!L141),\"\")","v":""},{"$f":"IF(ISBLANK('Program Requirements'!M141),\"\",'Program Requirements'!M141)","v":{"$error":"#DIV/0!"}},{"$error":"#DIV/0!"},null,{"$error":"#DIV/0!"},null,null,null,{"$error":"#DIV/0!"},null,{"$f":"IF(D119=\"Yes\",SUM(W119)/SUM(O119),\"\")","v":""}]
[{"$f":"IF(ISBLANK('Program Requirements'!A142),\"\",('Program Requirements'!A142))","v":""},null,null,null,{"$f":"IF(ISBLANK('Program Requirements'!D142),\"\",'Program Requirements'!D142)","v":""},null,null,null,null,null,null,null,null,{"$f":"IF(D120=\"Yes\",('Program Requirements'!G142),\"\")","v":""},{"$f":"IF(D120=\"Yes\",('Program Requirements'!L142),\"\")","v":""},{"$f":"IF(ISBLANK('Program Requirements'!M142),\"\",'Program Requirements'!M142)","v":{"$error":"#DIV/0!"}},{"$error":"#DIV/0!"},null,{"$f":"SUM(S119)-SUM(Q120)-SUM(U120)","v":{"$error":"#DIV/0!"}},null,null,null,{"$error":"#DIV/0!"},null,""]
[{"$f":"IF(ISBLANK('Program Requirements'!A143),\"\",('Program Requirements'!A143))","v":""},null,null,null,{"$f":"IF(ISBLANK('Program Requirements'!D143),\"\",'Program Requirements'!D143)","v":""},null,null,null,null,null,null,null,null,{"$f":"IF(D121=\"Yes\",('Program Requirements'!G143),\"\")","v":""},{"$f":"IF(D121=\"Yes\",('Program Requirements'!L143),\"\")","v":""},{"$f":"IF(ISBLANK('Program Requirements'!M143),\"\",'Program Requirements'!M143)","v":{"$error":"#DIV/0!"}},{"$error":"#DIV/0!"},null,{"$error":"#DIV/0!"},null,null,null,{"$error":"#DIV/0!"},null,""]
[{"$f":"IF(ISBLANK('Program Requirements'!A144),\"\",('Program Requirements'!A144))","v":""},null,null,null,{"$f":"IF(ISBLANK('Program Requirements'!D144),\"\",'Program Requirements'!D144)","v":""},null,null,null,null,null,null,null,null,{"$f":"IF(D122=\"Yes\",('Program Requirements'!G144),\"\")","v":""},{"$f":"IF(D122=\"Yes\",('Program Requirements'!L144),\"\")","v":""},{"$f":"IF(ISBLANK('Program Requirements'!M144),\"\",'Program Requirements'!M144)","v":{"$error":"#DIV/0!"}},{"$error":"#DIV/0!"},null,{"$error":"#DIV/0!"},null,null,null,{"$error":"#DIV/0!"},null,""]
[{"$f":"IF(ISBLANK('Program Requirements'!A145),\"\",('Program Requirements'!A145))","v":""},null,null,null,{"$f":"IF(ISBLANK('Program Requirements'!D145),\"\",'Program Requirements'!D145)","v":""},null,null,null,null,null,null,null,null,{"$f":"IF(D123=\"Yes\",('Program Requirements'!G145),\"\")","v":""},{"$f":"IF(D123=\"Yes\",('Program Requirements'!L145),\"\")","v":""},{"$f":"IF(ISBLANK('Program Requirements'!M145),\"\",'Program Requirements'!M145)","v":{"$error":"#DIV/0!"}},{"$error":"#DIV/0!"},null,{"$error":"#DIV/0!"},null,null,null,{"$error":"#DIV/0!"},null,""]
[{"$f":"IF(ISBLANK('Program Requirements'!A146),\"\",('Program Requirements'!A146))","v":""},null,null,null,{"$f":"IF(ISBLANK('Program Requirements'!D146),\"\",'Program Requirements'!D146)","v":""},null,null,null,null,null,null,null,null,{"$f":"IF(D124=\"Yes\",('Program Requirements'!G146),\"\")","v":""},{"$f":"IF(D124=\"Yes\",('Program Requirements'!L146),\"\")","v":""},{"$f":"IF(ISBLANK('Program Requirements'!M146),\"\",'Program Requirements'!M146)","v":{"$error":"#DIV/0!"}},{"$error":"#DIV/0!"},null,{"$error":"#DIV/0!"},null,null,null,{"$error":"#DIV/0!"},null,""]
[{"$f":"IF(ISBLANK('Program Requirements'!A147),\"\",('Program Requirements'!A147))","v":""},null,null,null,{"$f":"IF(ISBLANK('Program Requirements'!D147),\"\",'Program Requirements'!D147)","v":""},null,null,null,null,null,null,null,null,{"$f":"IF(D125=\"Yes\",('Program Requirements'!G147),\"\")","v":""},{"$f":"IF(D125=\"Yes\",('Program Requirements'!L147),\"\")","v":""},{"$f":"IF(ISBLANK('Program Requirements'!M147),\"\",'Program Requirements'!M147)","v":{"$error":"#DIV/0!"}},{"$error":"#DIV/0!"},null,{"$error":"#DIV/0!"},null,null,null,{"$error":"#DIV/0!"},null,""]
[{"$f":"IF(ISBLANK('Program Requirements'!A148),\"\",('Program Requirements'!A148))","v":""},null,null,null,{"$f":"IF(ISBLANK('Program Requirements'!D148),\"\",'Program Requirements'!D148)","v":""},null,null,null,null,null,null,null,null,{"$f":"IF(D126=\"Yes\",('Program Requirements'!G148),\"\")","v":""},{"$f":"IF(D126=\"Yes\",('Program Requirements'!L148),\"\")","v":""},{"$f":"IF(ISBLANK('Program Requirements'!M148),\"\",'Program Requirements'!M148)","v":{"$error":"#DIV/0!"}},{"$error":"#DIV/0!"},null,{"$error":"#DIV/0!"},null,null,null,{"$error":"#DIV/0!"},null,""]
[{"$f":"IF(ISBLANK('Program Requirements'!A149),\"\",('Program Requirements'!A149))","v":""},null,null,null,{"$f":"IF(ISBLANK('Program Requirements'!D149),\"\",'Program Requirements'!D149)","v":""},null,null,null,null,null,null,null,null,{"$f":"IF(D127=\"Yes\",('Program Requirements'!G149),\"\")","v":""},{"$f":"IF(D127=\"Yes\",('Program Requirements'!L149),\"\")","v":""},{"$f":"IF(ISBLANK('Program Requirements'!M149),\"\",'Program Requirements'!M149)","v":{"$error":"#DIV/0!"}},{"$error":"#DIV/0!"},null,{"$error":"#DIV/0!"},null,null,null,{"$error":"#DIV/0!"},null,""]
[{"$f":"IF(ISBLANK('Program Requirements'!A150),\"\",('Program Requirements'!A150))","v":""},null,null,null,{"$f":"IF(ISBLANK('Program Requirements'!D150),\"\",'Program Requirements'!D150)","v":""},null,null,null,null,null,null,null,null,{"$f":"IF(D128=\"Yes\",('Program Requirements'!G150),\"\")","v":""},{"$f":"IF(D128=\"Yes\",('Program Requirements'!L150),\"\")","v":""},{"$f":"IF(ISBLANK('Program Requirements'!M150),\"\",'Program Requirements'!M150)","v":{"$error":"#DIV/0!"}},{"$error":"#DIV/0!"},null,{"$error":"#DIV/0!"},null,null,null,{"$error":"#DIV/0!"},null,""]
[{"$f":"IF(ISBLANK('Program Requirements'!A151),\"\",('Program Requirements'!A151))","v":""},null,null,null,{"$f":"IF(ISBLANK('Program Requirements'!D151),\"\",'Program Requirements'!D151)","v":""},null,null,null,null,null,null,null,null,{"$f":"IF(D129=\"Yes\",('Program Requirements'!G151),\"\")","v":""},{"$f":"IF(D129=\"Yes\",('Program Requirements'!L151),\"\")","v":""},{"$f":"IF(ISBLANK('Program Requirements'!M151),\"\",'Program Requirements'!M151)","v":{"$error":"#DIV/0!"}},{"$error":"#DIV/0!"},null,{"$error":"#DIV/0!"},null,null,null,{"$error":"#DIV/0!"},null,""]
[{"$f":"IF(ISBLANK('Program Requirements'!A152),\"\",('Program Requirements'!A152))","v":""},null,null,null,{"$f":"IF(ISBLANK('Program Requirements'!D152),\"\",'Program Requirements'!D152)","v":""},null,null,null,null,null,null,null,null,{"$f":"IF(D130=\"Yes\",('Program Requirements'!G152),\"\")","v":""},{"$f":"IF(D130=\"Yes\",('Program Requirements'!L152),\"\")","v":""},{"$f":"IF(ISBLANK('Program Requirements'!M152),\"\",'Program Requirements'!M152)","v":{"$error":"#DIV/0!"}},{"$error":"#DIV/0!"},null,{"$error":"#DIV/0!"},null,null,null,{"$error":"#DIV/0!"},null,""]
[{"$f":"IF(ISBLANK('Program Requirements'!A153),\"\",('Program Requirements'!A153))","v":""},null,null,null,{"$f":"IF(ISBLANK('Program Requirements'!D153),\"\",'Program Requirements'!D153)","v":""},null,null,null,null,null,null,null,null,{"$f":"IF(D131=\"Yes\",('Program Requirements'!G153),\"\")","v":""},{"$f":"IF(D131=\"Yes\",('Program Requirements'!L153),\"\")","v":""},{"$f":"IF(ISBLANK('Program Requirements'!M153),\"\",'Program Requirements'!M153)","v":{"$error":"#DIV/0!"}},{"$error":"#DIV/0!"},null,{"$error":"#DIV/0!"},null,null,null,{"$error":"#DIV/0!"},null,""]
[{"$f":"IF(ISBLANK('Program Requirements'!A154),\"\",('Program Requirements'!A154))","v":""},null,null,null,{"$f":"IF(ISBLANK('Program Requirements'!D154),\"\",'Program Requirements'!D154)","v":""},null,null,null,null,null,null,null,null,{"$f":"IF(D132=\"Yes\",('Program Requirements'!G154),\"\")","v":""},{"$f":"IF(D132=\"Yes\",('Program Requirements'!L154),\"\")","v":""},{"$f":"IF(ISBLANK('Program Requirements'!M154),\"\",'Program Requirements'!M154)","v":{"$error":"#DIV/0!"}},{"$error":"#DIV/0!"},null,{"$error":"#DIV/0!"},null,null,null,{"$error":"#DIV/0!"},null,""]
[{"$f":"IF(ISBLANK('Program Requirements'!A155),\"\",('Program Requirements'!A155))","v":""},null,null,null,{"$f":"IF(ISBLANK('Program Requirements'!D155),\"\",'Program Requirements'!D155)","v":""},null,null,null,null,null,null,null,null,{"$f":"IF(D133=\"Yes\",('Program Requirements'!G155),\"\")","v":""},{"$f":"IF(D133=\"Yes\",('Program Requirements'!L155),\"\")","v":""},{"$f":"IF(ISBLANK('Program Requirements'!M155),\"\",'Program Requirements'!M155)","v":{"$error":"#DIV/0!"}},{"$error":"#DIV/0!"},null,{"$error":"#DIV/0!"},null,null,null,{"$error":"#DIV/0!"},null,""]
[{"$f":"IF(ISBLANK('Program Requirements'!A156),\"\",('Program Requirements'!A156))","v":""},null,null,null,{"$f":"IF(ISBLANK('Program Requirements'!D156),\"\",'Program Requirements'!D156)","v":""},null,null,null,null,null,null,null,null,{"$f":"IF(D134=\"Yes\",('Program Requirements'!G156),\"\")","v":""},{"$f":"IF(D134=\"Yes\",('Program Requirements'!L156),\"\")","v":""},{"$f":"IF(ISBLANK('Program Requirements'!M156),\"\",'Program Requirements'!M156)","v":{"$error":"#DIV/0!"}},{"$error":"#DIV/0!"},null,{"$error":"#DIV/0!"},null,null,null,{"$error":"#DIV/0!"},null,""]
[{"$f":"IF(ISBLANK('Program Requirements'!A157),\"\",('Program Requirements'!A157))","v":""},null,null,null,{"$f":"IF(ISBLANK('Program Requirements'!D157),\"\",'Program Requirements'!D157)","v":""},null,null,null,null,null,null,null,null,{"$f":"IF(D135=\"Yes\",('Program Requirements'!G157),\"\")","v":""},{"$f":"IF(D135=\"Yes\",('Program Requirements'!L157),\"\")","v":""},{"$f":"IF(ISBLANK('Program Requirements'!M157),\"\",'Program Requirements'!M157)","v":{"$error":"#DIV/0!"}},{"$error":"#DIV/0!"},null,{"$error":"#DIV/0!"},null,null,null,{"$error":"#DIV/0!"},null,""]
[{"$f":"IF(ISBLANK('Program Requirements'!A158),\"\",('Program Requirements'!A158))","v":""},null,null,null,{"$f":"IF(ISBLANK('Program Requirements'!D158),\"\",'Program Requirements'!D158)","v":""},null,null,null,null,null,null,null,null,{"$f":"IF(D136=\"Yes\",('Program Requirements'!G158),\"\")","v":""},{"$f":"IF(D136=\"Yes\",('Program Requirements'!L158),\"\")","v":""},{"$f":"IF(ISBLANK('Program Requirements'!M158),\"\",'Program Requirements'!M158)","v":{"$error":"#DIV/0!"}},{"$error":"#DIV/0!"},null,{"$error":"#DIV/0!"},null,null,null,{"$error":"#DIV/0!"},null,""]
[{"$f":"IF(ISBLANK('Program Requirements'!A159),\"\",('Program Requirements'!A159))","v":""},null,null,null,{"$f":"IF(ISBLANK('Program Requirements'!D159),\"\",'Program Requirements'!D159)","v":""},null,null,null,null,null,null,null,null,{"$f":"IF(D137=\"Yes\",('Program Requirements'!G159),\"\")","v":""},{"$f":"IF(D137=\"Yes\",('Program Requirements'!L159),\"\")","v":""},{"$f":"IF(ISBLANK('Program Requirements'!M159),\"\",'Program Requirements'!M159)","v":{"$error":"#DIV/0!"}},{"$error":"#DIV/0!"},null,{"$error":"#DIV/0!"},null,null,null,{"$error":"#DIV/0!"},null,""]
[{"$f":"IF(ISBLANK('Program Requirements'!A160),\"\",('Program Requirements'!A160))","v":""},null,null,null,{"$f":"IF(ISBLANK('Program Requirements'!D160),\"\",'Program Requirements'!D160)","v":""},null,null,null,null,null,null,null,null,{"$f":"IF(D138=\"Yes\",('Program Requirements'!G160),\"\")","v":""},{"$f":"IF(D138=\"Yes\",('Program Requirements'!L160),\"\")","v":""},{"$f":"IF(ISBLANK('Program Requirements'!M160),\"\",'Program Requirements'!M160)","v":{"$error":"#DIV/0!"}},{"$error":"#DIV/0!"},null,{"$error":"#DIV/0!"},null,null,null,{"$error":"#DIV/0!"},null,""]
[{"$f":"IF(ISBLANK('Program Requirements'!A161),\"\",('Program Requirements'!A161))","v":""},null,null,null,{"$f":"IF(ISBLANK('Program Requirements'!D161),\"\",'Program Requirements'!D161)","v":""},null,null,null,null,null,null,null,null,{"$f":"IF(D139=\"Yes\",('Program Requirements'!G161),\"\")","v":""},{"$f":"IF(D139=\"Yes\",('Program Requirements'!L161),\"\")","v":""},{"$f":"IF(ISBLANK('Program Requirements'!M161),\"\",'Program Requirements'!M161)","v":{"$error":"#DIV/0!"}},{"$error":"#DIV/0!"},null,{"$error":"#DIV/0!"},null,null,null,{"$error":"#DIV/0!"},null,""]
[{"$f":"IF(ISBLANK('Program Requirements'!A162),\"\",('Program Requirements'!A162))","v":""},null,null,null,{"$f":"IF(ISBLANK('Program Requirements'!D162),\"\",'Program Requirements'!D162)","v":""},null,null,null,null,null,null,null,null,{"$f":"IF(D140=\"Yes\",('Program Requirements'!G162),\"\")","v":""},{"$f":"IF(D140=\"Yes\",('Program Requirements'!L162),\"\")","v":""},{"$f":"IF(ISBLANK('Program Requirements'!M162),\"\",'Program Requirements'!M162)","v":{"$error":"#DIV/0!"}},{"$error":"#DIV/0!"},null,{"$error":"#DIV/0!"},null,null,null,{"$error":"#DIV/0!"},null,""]
[{"$f":"IF(ISBLANK('Program Requirements'!A163),\"\",('Program Requirements'!A163))","v":""},null,null,null,{"$f":"IF(ISBLANK('Program Requirements'!D163),\"\",'Program Requirements'!D163)","v":""},null,null,null,null,null,null,null,null,{"$f":"IF(D141=\"Yes\",('Program Requirements'!G163),\"\")","v":""},{"$f":"IF(D141=\"Yes\",('Program Requirements'!L163),\"\")","v":""},{"$f":"IF(ISBLANK('Program Requirements'!M163),\"\",'Program Requirements'!M163)","v":{"$error":"#DIV/0!"}},{"$error":"#DIV/0!"},null,{"$error":"#DIV/0!"},null,null,null,{"$error":"#DIV/0!"},null,""]
[{"$f":"IF(ISBLANK('Program Requirements'!A164),\"\",('Program Requirements'!A164))","v":""},null,null,null,{"$f":"IF(ISBLANK('Program Requirements'!D164),\"\",'Program Requirements'!D164)","v":""},null,null,null,null,null,null,null,null,{"$f":"IF(D142=\"Yes\",('Program Requirements'!G164),\"\")","v":""},{"$f":"IF(D142=\"Yes\",('Program Requirements'!L164),\"\")","v":""},{"$f":"IF(ISBLANK('Program Requirements'!M164),\"\",'Program Requirements'!M164)","v":{"$error":"#DIV/0!"}},{"$error":"#DIV/0!"},null,{"$error":"#DIV/0!"},null,null,null,{"$error":"#DIV/0!"},null,""]
[{"$f":"IF(ISBLANK('Program Requirements'!A165),\"\",('Program Requirements'!A165))","v":""},null,null,null,{"$f":"IF(ISBLANK('Program Requirements'!D165),\"\",'Program Requirements'!D165)","v":""},null,null,null,null,null,null,null,null,{"$f":"IF(D143=\"Yes\",('Program Requirements'!G165),\"\")","v":""},{"$f":"IF(D143=\"Yes\",('Program Requirements'!L165),\"\")","v":""},{"$f":"IF(ISBLANK('Program Requirements'!M165),\"\",'Program Requirements'!M165)","v":{"$error":"#DIV/0!"}},{"$error":"#DIV/0!"},null,{"$error":"#DIV/0!"},null,null,null,{"$error":"#DIV/0!"},null,""]
[{"$f":"IF(ISBLANK('Program Requirements'!A166),\"\",('Program Requirements'!A166))","v":""},null,null,null,{"$f":"IF(ISBLANK('Program Requirements'!D166),\"\",'Program Requirements'!D166)","v":""},null,null,null,null,null,null,null,null,{"$f":"IF(D144=\"Yes\",('Program Requirements'!G166),\"\")","v":""},{"$f":"IF(D144=\"Yes\",('Program Requirements'!L166),\"\")","v":""},{"$f":"IF(ISBLANK('Program Requirements'!M166),\"\",'Program Requirements'!M166)","v":{"$error":"#DIV/0!"}},{"$error":"#DIV/0!"},null,{"$error":"#DIV/0!"},null,null,null,{"$error":"#DIV/0!"},null,""]
[{"$f":"IF(ISBLANK('Program Requirements'!A167),\"\",('Program Requirements'!A167))","v":""},null,null,null,{"$f":"IF(ISBLANK('Program Requirements'!D167),\"\",'Program Requirements'!D167)","v":""},null,null,null,null,null,null,null,null,{"$f":"IF(D145=\"Yes\",('Program Requirements'!G167),\"\")","v":""},{"$f":"IF(D145=\"Yes\",('Program Requirements'!L167),\"\")","v":""},{"$f":"IF(ISBLANK('Program Requirements'!M167),\"\",'Program Requirements'!M167)","v":{"$error":"#DIV/0!"}},{"$error":"#DIV/0!"},null,{"$error":"#DIV/0!"},null,null,null,{"$error":"#DIV/0!"},null,""]
[{"$f":"IF(ISBLANK('Program Requirements'!A168),\"\",('Program Requirements'!A168))","v":""},null,null,null,{"$f":"IF(ISBLANK('Program Requirements'!D168),\"\",'Program Requirements'!D168)","v":""},null,null,null,null,null,null,null,null,{"$f":"IF(D146=\"Yes\",('Program Requirements'!G168),\"\")","v":""},{"$f":"IF(D146=\"Yes\",('Program Requirements'!L168),\"\")","v":""},{"$f":"IF(ISBLANK('Program Requirements'!M168),\"\",'Program Requirements'!M168)","v":{"$error":"#DIV/0!"}},{"$error":"#DIV/0!"},null,{"$error":"#DIV/0!"},null,null,null,{"$error":"#DIV/0!"},null,""]
[{"$f":"IF(ISBLANK('Program Requirements'!A169),\"\",('Program Requirements'!A169))","v":""},null,null,null,{"$f":"IF(ISBLANK('Program Requirements'!D169),\"\",'Program Requirements'!D169)","v":""},null,null,null,null,null,null,null,null,{"$f":"IF(D147=\"Yes\",('Program Requirements'!G169),\"\")","v":""},{"$f":"IF(D147=\"Yes\",('Program Requirements'!L169),\"\")","v":""},{"$f":"IF(ISBLANK('Program Requirements'!M169),\"\",'Program Requirements'!M169)","v":{"$error":"#DIV/0!"}},{"$error":"#DIV/0!"},null,{"$error":"#DIV/0!"},null,null,null,{"$error":"#DIV/0!"},null,""]
[{"$f":"IF(ISBLANK('Program Requirements'!A170),\"\",('Program Requirements'!A170))","v":""},null,null,null,{"$f":"IF(ISBLANK('Program Requirements'!D170),\"\",'Program Requirements'!D170)","v":""},null,null,null,null,null,null,null,null,{"$f":"IF(D148=\"Yes\",('Program Requirements'!G170),\"\")","v":""},{"$f":"IF(D148=\"Yes\",('Program Requirements'!L170),\"\")","v":""},{"$f":"IF(ISBLANK('Program Requirements'!M170),\"\",'Program Requirements'!M170)","v":{"$error":"#DIV/0!"}},{"$error":"#DIV/0!"},null,{"$error":"#DIV/0!"},null,null,null,{"$error":"#DIV/0!"},null,""]
[{"$f":"IF(ISBLANK('Program Requirements'!A171),\"\",('Program Requirements'!A171))","v":""},null,null,null,{"$f":"IF(ISBLANK('Program Requirements'!D171),\"\",'Program Requirements'!D171)","v":""},null,null,null,null,null,null,null,null,{"$f":"IF(D149=\"Yes\",('Program Requirements'!G171),\"\")","v":""},{"$f":"IF(D149=\"Yes\",('Program Requirements'!L171),\"\")","v":""},{"$f":"IF(ISBLANK('Program Requirements'!M171),\"\",'Program Requirements'!M171)","v":{"$error":"#DIV/0!"}},{"$error":"#DIV/0!"},null,{"$error":"#DIV/0!"},null,null,null,{"$error":"#DIV/0!"},null,""]
[{"$f":"IF(ISBLANK('Program Requirements'!A172),\"\",('Program Requirements'!A172))","v":""},null,null,null,{"$f":"IF(ISBLANK('Program Requirements'!D172),\"\",'Program Requirements'!D172)","v":""},null,null,null,null,null,null,null,null,{"$f":"IF(D150=\"Yes\",('Program Requirements'!G172),\"\")","v":""},{"$f":"IF(D150=\"Yes\",('Program Requirements'!L172),\"\")","v":""},{"$f":"IF(ISBLANK('Program Requirements'!M172),\"\",'Program Requirements'!M172)","v":{"$error":"#DIV/0!"}},{"$error":"#DIV/0!"},null,{"$error":"#DIV/0!"},null,null,null,{"$error":"#DIV/0!"},null,""]
[{"$f":"IF(ISBLANK('Program Requirements'!A173),\"\",('Program Requirements'!A173))","v":""},null,null,null,{"$f":"IF(ISBLANK('Program Requirements'!D173),\"\",'Program Requirements'!D173)","v":""},null,null,null,null,null,null,null,null,{"$f":"IF(D151=\"Yes\",('Program Requirements'!G173),\"\")","v":""},{"$f":"IF(D151=\"Yes\",('Program Requirements'!L173),\"\")","v":""},{"$f":"IF(ISBLANK('Program Requirements'!M173),\"\",'Program Requirements'!M173)","v":{"$error":"#DIV/0!"}},{"$f":"IF(IF(D151=\"Yes\",IF(ISBLANK(O151),\"\",SUM(O151)*$T$47),0)>$F$46,SUM($F$46),IF(D151=\"Yes\",IF(ISBLANK(O151),\"\",SUM(O151)*$T$47),\"\"))","v":{"$error":"#DIV/0!"}},null,{"$error":"#DIV/0!"},null,null,null,{"$f":"IF(SUM(U151)=0,SUM(Q151),IF(SUM(Q151,U151)=U151,\"ERROR\",SUM(Q151,U151)))","v":{"$error":"#DIV/0!"}},null,""]
[{"$f":"IF(ISBLANK('Program Requirements'!A174),\"\",('Program Requirements'!A174))","v":""},null,null,null,{"$f":"IF(ISBLANK('Program Requirements'!D174),\"\",'Program Requirements'!D174)","v":""},null,null,null,null,null,null,null,null,{"$f":"IF(D152=\"Yes\",('Program Requirements'!G174),\"\")","v":""},{"$f":"IF(D152=\"Yes\",('Program Requirements'!L174),\"\")","v":""},{"$f":"IF(ISBLANK('Program Requirements'!M174),\"\",'Program Requirements'!M174)","v":{"$error":"#DIV/0!"}},{"$error":"#DIV/0!"},null,{"$error":"#DIV/0!"},null,null,null,{"$error":"#DIV/0!"},null,""]
[{"$f":"IF(ISBLANK('Program Requirements'!A175),\"\",('Program Requirements'!A175))","v":""},null,null,null,{"$f":"IF(ISBLANK('Program Requirements'!D175),\"\",'Program Requirements'!D175)","v":""},null,null,null,null,null,null,null,null,{"$f":"IF(D153=\"Yes\",('Program Requirements'!G175),\"\")","v":""},{"$f":"IF(D153=\"Yes\",('Program Requirements'!L175),\"\")","v":""},{"$f":"IF(ISBLANK('Program Requirements'!M175),\"\",'Program Requirements'!M175)","v":{"$error":"#DIV/0!"}},{"$error":"#DIV/0!"},null,{"$error":"#DIV/0!"},null,null,null,{"$error":"#DIV/0!"},null,""]
[{"$f":"IF(ISBLANK('Program Requirements'!A176),\"\",('Program Requirements'!A176))","v":""},null,null,null,{"$f":"IF(ISBLANK('Program Requirements'!D176),\"\",'Program Requirements'!D176)","v":""},null,null,null,null,null,null,null,null,{"$f":"IF(D154=\"Yes\",('Program Requirements'!G176),\"\")","v":""},{"$f":"IF(D154=\"Yes\",('Program Requirements'!L176),\"\")","v":""},{"$f":"IF(ISBLANK('Program Requirements'!M176),\"\",'Program Requirements'!M176)","v":{"$error":"#DIV/0!"}},{"$error":"#DIV/0!"},null,{"$error":"#DIV/0!"},null,null,null,{"$error":"#DIV/0!"},null,""]
[{"$f":"IF(ISBLANK('Program Requirements'!A177),\"\",('Program Requirements'!A177))","v":""},null,null,null,{"$f":"IF(ISBLANK('Program Requirements'!D177),\"\",'Program Requirements'!D177)","v":""},null,null,null,null,null,null,null,null,{"$f":"IF(D155=\"Yes\",('Program Requirements'!G177),\"\")","v":""},{"$f":"IF(D155=\"Yes\",('Program Requirements'!L177),\"\")","v":""},{"$f":"IF(ISBLANK('Program Requirements'!M177),\"\",'Program Requirements'!M177)","v":{"$error":"#DIV/0!"}},{"$error":"#DIV/0!"},null,{"$error":"#DIV/0!"},null,null,null,{"$error":"#DIV/0!"},null,""]
[{"$f":"IF(ISBLANK('Program Requirements'!A178),\"\",('Program Requirements'!A178))","v":""},null,null,null,{"$f":"IF(ISBLANK('Program Requirements'!D178),\"\",'Program Requirements'!D178)","v":""},null,null,null,null,null,null,null,null,{"$f":"IF(D156=\"Yes\",('Program Requirements'!G178),\"\")","v":""},{"$f":"IF(D156=\"Yes\",('Program Requirements'!L178),\"\")","v":""},{"$f":"IF(ISBLANK('Program Requirements'!M178),\"\",'Program Requirements'!M178)","v":{"$error":"#DIV/0!"}},{"$error":"#DIV/0!"},null,{"$error":"#DIV/0!"},null,null,null,{"$error":"#DIV/0!"},null,""]
[{"$f":"IF(ISBLANK('Program Requirements'!A179),\"\",('Program Requirements'!A179))","v":""},null,null,null,{"$f":"IF(ISBLANK('Program Requirements'!D179),\"\",'Program Requirements'!D179)","v":""},null,null,null,null,null,null,null,null,{"$f":"IF(D157=\"Yes\",('Program Requirements'!G179),\"\")","v":""},{"$f":"IF(D157=\"Yes\",('Program Requirements'!L179),\"\")","v":""},{"$f":"IF(ISBLANK('Program Requirements'!M179),\"\",'Program Requirements'!M179)","v":{"$error":"#DIV/0!"}},{"$error":"#DIV/0!"},null,{"$error":"#DIV/0!"},null,null,null,{"$error":"#DIV/0!"},null,""]
[{"$f":"IF(ISBLANK('Program Requirements'!A180),\"\",('Program Requirements'!A180))","v":""},null,null,null,{"$f":"IF(ISBLANK('Program Requirements'!D180),\"\",'Program Requirements'!D180)","v":""},null,null,null,null,null,null,null,null,{"$f":"IF(D158=\"Yes\",('Program Requirements'!G180),\"\")","v":""},{"$f":"IF(D158=\"Yes\",('Program Requirements'!L180),\"\")","v":""},{"$f":"IF(ISBLANK('Program Requirements'!M180),\"\",'Program Requirements'!M180)","v":{"$error":"#DIV/0!"}},{"$error":"#DIV/0!"},null,{"$error":"#DIV/0!"},null,null,null,{"$error":"#DIV/0!"},null,""]
[{"$f":"IF(ISBLANK('Program Requirements'!A181),\"\",('Program Requirements'!A181))","v":""},null,null,null,{"$f":"IF(ISBLANK('Program Requirements'!D181),\"\",'Program Requirements'!D181)","v":""},null,null,null,null,null,null,null,null,{"$f":"IF(D159=\"Yes\",('Program Requirements'!G181),\"\")","v":""},{"$f":"IF(D159=\"Yes\",('Program Requirements'!L181),\"\")","v":""},{"$f":"IF(ISBLANK('Program Requirements'!M181),\"\",'Program Requirements'!M181)","v":{"$error":"#DIV/0!"}},{"$error":"#DIV/0!"},null,{"$error":"#DIV/0!"},null,null,null,{"$error":"#DIV/0!"},null,""]
[{"$f":"IF(ISBLANK('Program Requirements'!A182),\"\",('Program Requirements'!A182))","v":""},null,null,null,{"$f":"IF(ISBLANK('Program Requirements'!D182),\"\",'Program Requirements'!D182)","v":""},null,null,null,null,null,null,null,null,{"$f":"IF(D160=\"Yes\",('Program Requirements'!G182),\"\")","v":""},{"$f":"IF(D160=\"Yes\",('Program Requirements'!L182),\"\")","v":""},{"$f":"IF(ISBLANK('Program Requirements'!M182),\"\",'Program Requirements'!M182)","v":{"$error":"#DIV/0!"}},{"$error":"#DIV/0!"},null,{"$error":"#DIV/0!"},null,null,null,{"$error":"#DIV/0!"},null,""]
[{"$f":"IF(ISBLANK('Program Requirements'!A183),\"\",('Program Requirements'!A183))","v":""},null,null,null,{"$f":"IF(ISBLANK('Program Requirements'!D183),\"\",'Program Requirements'!D183)","v":""},null,null,null,null,null,null,null,null,{"$f":"IF(D161=\"Yes\",('Program Requirements'!G183),\"\")","v":""},{"$f":"IF(D161=\"Yes\",('Program Requirements'!L183),\"\")","v":""},{"$f":"IF(ISBLANK('Program Requirements'!M183),\"\",'Program Requirements'!M183)","v":{"$error":"#DIV/0!"}},{"$error":"#DIV/0!"},null,{"$error":"#DIV/0!"},null,null,null,{"$error":"#DIV/0!"},null,""]
[{"$f":"IF(ISBLANK('Program Requirements'!A184),\"\",('Program Requirements'!A184))","v":""},null,null,null,{"$f":"IF(ISBLANK('Program Requirements'!D184),\"\",'Program Requirements'!D184)","v":""},null,null,null,null,null,null,null,null,{"$f":"IF(D162=\"Yes\",('Program Requirements'!G184),\"\")","v":""},{"$f":"IF(D162=\"Yes\",('Program Requirements'!L184),\"\")","v":""},{"$f":"IF(ISBLANK('Program Requirements'!M184),\"\",'Program Requirements'!M184)","v":{"$error":"#DIV/0!"}},{"$error":"#DIV/0!"},null,{"$error":"#DIV/0!"},null,null,null,{"$error":"#DIV/0!"},null,""]
[{"$f":"IF(ISBLANK('Program Requirements'!A185),\"\",('Program Requirements'!A185))","v":""},null,null,null,{"$f":"IF(ISBLANK('Program Requirements'!D185),\"\",'Program Requirements'!D185)","v":""},null,null,null,null,null,null,null,null,{"$f":"IF(D163=\"Yes\",('Program Requirements'!G185),\"\")","v":""},{"$f":"IF(D163=\"Yes\",('Program Requirements'!L185),\"\")","v":""},{"$f":"IF(ISBLANK('Program Requirements'!M185),\"\",'Program Requirements'!M185)","v":{"$error":"#DIV/0!"}},{"$error":"#DIV/0!"},null,{"$error":"#DIV/0!"},null,null,null,{"$error":"#DIV/0!"},null,""]
[{"$f":"IF(ISBLANK('Program Requirements'!A186),\"\",('Program Requirements'!A186))","v":""},null,null,null,{"$f":"IF(ISBLANK('Program Requirements'!D186),\"\",'Program Requirements'!D186)","v":""},null,null,null,null,null,null,null,null,{"$f":"IF(D164=\"Yes\",('Program Requirements'!G186),\"\")","v":""},{"$f":"IF(D164=\"Yes\",('Program Requirements'!L186),\"\")","v":""},{"$f":"IF(ISBLANK('Program Requirements'!M186),\"\",'Program Requirements'!M186)","v":{"$error":"#DIV/0!"}},{"$error":"#DIV/0!"},null,{"$error":"#DIV/0!"},null,null,null,{"$error":"#DIV/0!"},null,""]
[{"$f":"IF(ISBLANK('Program Requirements'!A187),\"\",('Program Requirements'!A187))","v":""},null,null,null,{"$f":"IF(ISBLANK('Program Requirements'!D187),\"\",'Program Requirements'!D187)","v":""},null,null,null,null,null,null,null,null,{"$f":"IF(D165=\"Yes\",('Program Requirements'!G187),\"\")","v":""},{"$f":"IF(D165=\"Yes\",('Program Requirements'!L187),\"\")","v":""},{"$f":"IF(ISBLANK('Program Requirements'!M187),\"\",'Program Requirements'!M187)","v":{"$error":"#DIV/0!"}},{"$error":"#DIV/0!"},null,{"$error":"#DIV/0!"},null,null,null,{"$error":"#DIV/0!"},null,""]
[{"$f":"IF(ISBLANK('Program Requirements'!A188),\"\",('Program Requirements'!A188))","v":""},null,null,null,{"$f":"IF(ISBLANK('Program Requirements'!D188),\"\",'Program Requirements'!D188)","v":""},null,null,null,null,null,null,null,null,{"$f":"IF(D166=\"Yes\",('Program Requirements'!G188),\"\")","v":""},{"$f":"IF(D166=\"Yes\",('Program Requirements'!L188),\"\")","v":""},{"$f":"IF(ISBLANK('Program Requirements'!M188),\"\",'Program Requirements'!M188)","v":{"$error":"#DIV/0!"}},{"$error":"#DIV/0!"},null,{"$error":"#DIV/0!"},null,null,null,{"$error":"#DIV/0!"},null,""]
[{"$f":"IF(ISBLANK('Program Requirements'!A189),\"\",('Program Requirements'!A189))","v":""},null,null,null,{"$f":"IF(ISBLANK('Program Requirements'!D189),\"\",'Program Requirements'!D189)","v":""},null,null,null,null,null,null,null,null,{"$f":"IF(D167=\"Yes\",('Program Requirements'!G189),\"\")","v":""},{"$f":"IF(D167=\"Yes\",('Program Requirements'!L189),\"\")","v":""},{"$f":"IF(ISBLANK('Program Requirements'!M189),\"\",'Program Requirements'!M189)","v":{"$error":"#DIV/0!"}},{"$error":"#DIV/0!"},null,{"$error":"#DIV/0!"},null,null,null,{"$error":"#DIV/0!"},null,""]
[{"$f":"IF(ISBLANK('Program Requirements'!A190),\"\",('Program Requirements'!A190))","v":""},null,null,null,{"$f":"IF(ISBLANK('Program Requirements'!D190),\"\",'Program Requirements'!D190)","v":""},null,null,null,null,null,null,null,null,{"$f":"IF(D168=\"Yes\",('Program Requirements'!G190),\"\")","v":""},{"$f":"IF(D168=\"Yes\",('Program Requirements'!L190),\"\")","v":""},{"$f":"IF(ISBLANK('Program Requirements'!M190),\"\",'Program Requirements'!M190)","v":{"$error":"#DIV/0!"}},{"$error":"#DIV/0!"},null,{"$error":"#DIV/0!"},null,null,null,{"$error":"#DIV/0!"},null,""]
[{"$f":"IF(ISBLANK('Program Requirements'!A191),\"\",('Program Requirements'!A191))","v":""},null,null,null,{"$f":"IF(ISBLANK('Program Requirements'!D191),\"\",'Program Requirements'!D191)","v":""},null,null,null,null,null,null,null,null,{"$f":"IF(D169=\"Yes\",('Program Requirements'!G191),\"\")","v":""},{"$f":"IF(D169=\"Yes\",('Program Requirements'!L191),\"\")","v":""},{"$f":"IF(ISBLANK('Program Requirements'!M191),\"\",'Program Requirements'!M191)","v":{"$error":"#DIV/0!"}},{"$error":"#DIV/0!"},null,{"$error":"#DIV/0!"},null,null,null,{"$error":"#DIV/0!"},null,""]
[{"$f":"IF(ISBLANK('Program Requirements'!A192),\"\",('Program Requirements'!A192))","v":""},null,null,null,{"$f":"IF(ISBLANK('Program Requirements'!D192),\"\",'Program Requirements'!D192)","v":""},null,null,null,null,null,null,null,null,{"$f":"IF(D170=\"Yes\",('Program Requirements'!G192),\"\")","v":""},{"$f":"IF(D170=\"Yes\",('Program Requirements'!L192),\"\")","v":""},{"$f":"IF(ISBLANK('Program Requirements'!M192),\"\",'Program Requirements'!M192)","v":{"$error":"#DIV/0!"}},{"$error":"#DIV/0!"},null,{"$error":"#DIV/0!"},null,null,null,{"$error":"#DIV/0!"},null,""]
[{"$f":"IF(ISBLANK('Program Requirements'!A193),\"\",('Program Requirements'!A193))","v":""},null,null,null,{"$f":"IF(ISBLANK('Program Requirements'!D193),\"\",'Program Requirements'!D193)","v":""},null,null,null,null,null,null,null,null,{"$f":"IF(D171=\"Yes\",('Program Requirements'!G193),\"\")","v":""},{"$f":"IF(D171=\"Yes\",('Program Requirements'!L193),\"\")","v":""},{"$f":"IF(ISBLANK('Program Requirements'!M193),\"\",'Program Requirements'!M193)","v":{"$error":"#DIV/0!"}},{"$error":"#DIV/0!"},null,{"$error":"#DIV/0!"},null,null,null,{"$error":"#DIV/0!"},null,""]
[{"$f":"IF(ISBLANK('Program Requirements'!A194),\"\",('Program Requirements'!A194))","v":""},null,null,null,{"$f":"IF(ISBLANK('Program Requirements'!D194),\"\",'Program Requirements'!D194)","v":""},null,null,null,null,null,null,null,null,{"$f":"IF(D172=\"Yes\",('Program Requirements'!G194),\"\")","v":""},{"$f":"IF(D172=\"Yes\",('Program Requirements'!L194),\"\")","v":""},{"$f":"IF(ISBLANK('Program Requirements'!M194),\"\",'Program Requirements'!M194)","v":{"$error":"#DIV/0!"}},{"$error":"#DIV/0!"},null,{"$error":"#DIV/0!"},null,null,null,{"$error":"#DIV/0!"},null,""]
[{"$f":"IF(ISBLANK('Program Requirements'!A195),\"\",('Program Requirements'!A195))","v":""},null,null,null,{"$f":"IF(ISBLANK('Program Requirements'!D195),\"\",'Program Requirements'!D195)","v":""},null,null,null,null,null,null,null,null,{"$f":"IF(D173=\"Yes\",('Program Requirements'!G195),\"\")","v":""},{"$f":"IF(D173=\"Yes\",('Program Requirements'!L195),\"\")","v":""},{"$f":"IF(ISBLANK('Program Requirements'!M195),\"\",'Program Requirements'!M195)","v":{"$error":"#DIV/0!"}},{"$error":"#DIV/0!"},null,{"$error":"#DIV/0!"},null,null,null,{"$error":"#DIV/0!"},null,""]
[{"$f":"IF(ISBLANK('Program Requirements'!A196),\"\",('Program Requirements'!A196))","v":""},null,null,null,{"$f":"IF(ISBLANK('Program Requirements'!D196),\"\",'Program Requirements'!D196)","v":""},null,null,null,null,null,null,null,null,{"$f":"IF(D174=\"Yes\",('Program Requirements'!G196),\"\")","v":""},{"$f":"IF(D174=\"Yes\",('Program Requirements'!L196),\"\")","v":""},{"$f":"IF(ISBLANK('Program Requirements'!M196),\"\",'Program Requirements'!M196)","v":{"$error":"#DIV/0!"}},{"$error":"#DIV/0!"},null,{"$error":"#DIV/0!"},null,null,null,{"$error":"#DIV/0!"},null,""]
[{"$f":"IF(ISBLANK('Program Requirements'!A197),\"\",('Program Requirements'!A197))","v":""},null,null,null,{"$f":"IF(ISBLANK('Program Requirements'!D197),\"\",'Program Requirements'!D197)","v":""},null,null,null,null,null,null,null,null,{"$f":"IF(D175=\"Yes\",('Program Requirements'!G197),\"\")","v":""},{"$f":"IF(D175=\"Yes\",('Program Requirements'!L197),\"\")","v":""},{"$f":"IF(ISBLANK('Program Requirements'!M197),\"\",'Program Requirements'!M197)","v":{"$error":"#DIV/0!"}},{"$error":"#DIV/0!"},null,{"$error":"#DIV/0!"},null,null,null,{"$error":"#DIV/0!"},null,""]
[{"$f":"IF(ISBLANK('Program Requirements'!A198),\"\",('Program Requirements'!A198))","v":""},null,null,null,{"$f":"IF(ISBLANK('Program Requirements'!D198),\"\",'Program Requirements'!D198)","v":""},null,null,null,null,null,null,null,null,{"$f":"IF(D176=\"Yes\",('Program Requirements'!G198),\"\")","v":""},{"$f":"IF(D176=\"Yes\",('Program Requirements'!L198),\"\")","v":""},{"$f":"IF(ISBLANK('Program Requirements'!M198),\"\",'Program Requirements'!M198)","v":{"$error":"#DIV/0!"}},{"$error":"#DIV/0!"},null,{"$error":"#DIV/0!"},null,null,null,{"$error":"#DIV/0!"},null,""]
[{"$f":"IF(ISBLANK('Program Requirements'!A199),\"\",('Program Requirements'!A199))","v":""},null,null,null,{"$f":"IF(ISBLANK('Program Requirements'!D199),\"\",'Program Requirements'!D199)","v":""},null,null,null,null,null,null,null,null,{"$f":"IF(D177=\"Yes\",('Program Requirements'!G199),\"\")","v":""},{"$f":"IF(D177=\"Yes\",('Program Requirements'!L199),\"\")","v":""},{"$f":"IF(ISBLANK('Program Requirements'!M199),\"\",'Program Requirements'!M199)","v":{"$error":"#DIV/0!"}},{"$error":"#DIV/0!"},null,{"$error":"#DIV/0!"},null,null,null,{"$error":"#DIV/0!"},null,""]
[{"$f":"IF(ISBLANK('Program Requirements'!A200),\"\",('Program Requirements'!A200))","v":""},null,null,null,{"$f":"IF(ISBLANK('Program Requirements'!D200),\"\",'Program Requirements'!D200)","v":""},null,null,null,null,null,null,null,null,{"$f":"IF(D178=\"Yes\",('Program Requirements'!G200),\"\")","v":""},{"$f":"IF(D178=\"Yes\",('Program Requirements'!L200),\"\")","v":""},{"$f":"IF(ISBLANK('Program Requirements'!M200),\"\",'Program Requirements'!M200)","v":{"$error":"#DIV/0!"}},{"$error":"#DIV/0!"},null,{"$error":"#DIV/0!"},null,null,null,{"$error":"#DIV/0!"},null,""]
[{"$f":"IF(ISBLANK('Program Requirements'!A201),\"\",('Program Requirements'!A201))","v":""},null,null,null,{"$f":"IF(ISBLANK('Program Requirements'!D201),\"\",'Program Requirements'!D201)","v":""},null,null,null,null,null,null,null,null,{"$f":"IF(D179=\"Yes\",('Program Requirements'!G201),\"\")","v":""},{"$f":"IF(D179=\"Yes\",('Program Requirements'!L201),\"\")","v":""},{"$f":"IF(ISBLANK('Program Requirements'!M201),\"\",'Program Requirements'!M201)","v":{"$error":"#DIV/0!"}},{"$error":"#DIV/0!"},null,{"$error":"#DIV/0!"},null,null,null,{"$error":"#DIV/0!"},null,""]
[{"$f":"IF(ISBLANK('Program Requirements'!A202),\"\",('Program Requirements'!A202))","v":""},null,null,null,{"$f":"IF(ISBLANK('Program Requirements'!D202),\"\",'Program Requirements'!D202)","v":""},null,null,null,null,null,null,null,null,{"$f":"IF(D180=\"Yes\",('Program Requirements'!G202),\"\")","v":""},{"$f":"IF(D180=\"Yes\",('Program Requirements'!L202),\"\")","v":""},{"$f":"IF(ISBLANK('Program Requirements'!M202),\"\",'Program Requirements'!M202)","v":{"$error":"#DIV/0!"}},{"$error":"#DIV/0!"},null,{"$error":"#DIV/0!"},null,null,null,{"$error":"#DIV/0!"},null,""]
[{"$f":"IF(ISBLANK('Program Requirements'!A203),\"\",('Program Requirements'!A203))","v":""},null,null,null,{"$f":"IF(ISBLANK('Program Requirements'!D203),\"\",'Program Requirements'!D203)","v":""},null,null,null,null,null,null,null,null,{"$f":"IF(D181=\"Yes\",('Program Requirements'!G203),\"\")","v":""},{"$f":"IF(D181=\"Yes\",('Program Requirements'!L203),\"\")","v":""},{"$f":"IF(ISBLANK('Program Requirements'!M203),\"\",'Program Requirements'!M203)","v":{"$error":"#DIV/0!"}},{"$error":"#DIV/0!"},null,{"$error":"#DIV/0!"},null,null,null,{"$error":"#DIV/0!"},null,""]
[{"$f":"IF(ISBLANK('Program Requirements'!A204),\"\",('Program Requirements'!A204))","v":""},null,null,null,{"$f":"IF(ISBLANK('Program Requirements'!D204),\"\",'Program Requirements'!D204)","v":""},null,null,null,null,null,null,null,null,{"$f":"IF(D182=\"Yes\",('Program Requirements'!G204),\"\")","v":""},{"$f":"IF(D182=\"Yes\",('Program Requirements'!L204),\"\")","v":""},{"$f":"IF(ISBLANK('Program Requirements'!M204),\"\",'Program Requirements'!M204)","v":{"$error":"#DIV/0!"}},{"$error":"#DIV/0!"},null,{"$error":"#DIV/0!"},null,null,null,{"$error":"#DIV/0!"},null,""]
[{"$f":"IF(ISBLANK('Program Requirements'!A205),\"\",('Program Requirements'!A205))","v":""},null,null,null,{"$f":"IF(ISBLANK('Program Requirements'!D205),\"\",'Program Requirements'!D205)","v":""},null,null,null,null,null,null,null,null,{"$f":"IF(D183=\"Yes\",('Program Requirements'!G205),\"\")","v":""},{"$f":"IF(D183=\"Yes\",('Program Requirements'!L205),\"\")","v":""},{"$f":"IF(ISBLANK('Program Requirements'!M205),\"\",'Program Requirements'!M205)","v":{"$error":"#DIV/0!"}},{"$error":"#DIV/0!"},null,{"$error":"#DIV/0!"},null,null,null,{"$error":"#DIV/0!"},null,{"$f":"IF(D183=\"Yes\",SUM(W183)/SUM(O183),\"\")","v":""}]
[{"$f":"IF(ISBLANK('Program Requirements'!A206),\"\",('Program Requirements'!A206))","v":""},null,null,null,{"$f":"IF(ISBLANK('Program Requirements'!D206),\"\",'Program Requirements'!D206)","v":""},null,null,null,null,null,null,null,null,{"$f":"IF(D184=\"Yes\",('Program Requirements'!G206),\"\")","v":""},{"$f":"IF(D184=\"Yes\",('Program Requirements'!L206),\"\")","v":""},{"$f":"IF(ISBLANK('Program Requirements'!M206),\"\",'Program Requirements'!M206)","v":{"$error":"#DIV/0!"}},{"$error":"#DIV/0!"},null,{"$f":"SUM(S183)-SUM(Q184)-SUM(U184)","v":{"$error":"#DIV/0!"}},null,null,null,{"$error":"#DIV/0!"},null,""]
[{"$f":"IF(ISBLANK('Program Requirements'!A207),\"\",('Program Requirements'!A207))","v":""},null,null,null,{"$f":"IF(ISBLANK('Program Requirements'!D207),\"\",'Program Requirements'!D207)","v":""},null,null,null,null,null,null,null,null,{"$f":"IF(D185=\"Yes\",('Program Requirements'!G207),\"\")","v":""},{"$f":"IF(D185=\"Yes\",('Program Requirements'!L207),\"\")","v":""},{"$f":"IF(ISBLANK('Program Requirements'!M207),\"\",'Program Requirements'!M207)","v":{"$error":"#DIV/0!"}},{"$error":"#DIV/0!"},null,{"$error":"#DIV/0!"},null,null,null,{"$error":"#DIV/0!"},null,""]
[{"$f":"IF(ISBLANK('Program Requirements'!A208),\"\",('Program Requirements'!A208))","v":""},null,null,null,{"$f":"IF(ISBLANK('Program Requirements'!D208),\"\",'Program Requirements'!D208)","v":""},null,null,null,null,null,null,null,null,{"$f":"IF(D186=\"Yes\",('Program Requirements'!G208),\"\")","v":""},{"$f":"IF(D186=\"Yes\",('Program Requirements'!L208),\"\")","v":""},{"$f":"IF(ISBLANK('Program Requirements'!M208),\"\",'Program Requirements'!M208)","v":{"$error":"#DIV/0!"}},{"$error":"#DIV/0!"},null,{"$error":"#DIV/0!"},null,null,null,{"$error":"#DIV/0!"},null,""]
[{"$f":"IF(ISBLANK('Program Requirements'!A209),\"\",('Program Requirements'!A209))","v":""},null,null,null,{"$f":"IF(ISBLANK('Program Requirements'!D209),\"\",'Program Requirements'!D209)","v":""},null,null,null,null,null,null,null,null,{"$f":"IF(D187=\"Yes\",('Program Requirements'!G209),\"\")","v":""},{"$f":"IF(D187=\"Yes\",('Program Requirements'!L209),\"\")","v":""},{"$f":"IF(ISBLANK('Program Requirements'!M209),\"\",'Program Requirements'!M209)","v":{"$error":"#DIV/0!"}},{"$error":"#DIV/0!"},null,{"$error":"#DIV/0!"},null,null,null,{"$error":"#DIV/0!"},null,""]
[{"$f":"IF(ISBLANK('Program Requirements'!A210),\"\",('Program Requirements'!A210))","v":""},null,null,null,{"$f":"IF(ISBLANK('Program Requirements'!D210),\"\",'Program Requirements'!D210)","v":""},null,null,null,null,null,null,null,null,{"$f":"IF(D188=\"Yes\",('Program Requirements'!G210),\"\")","v":""},{"$f":"IF(D188=\"Yes\",('Program Requirements'!L210),\"\")","v":""},{"$f":"IF(ISBLANK('Program Requirements'!M210),\"\",'Program Requirements'!M210)","v":{"$error":"#DIV/0!"}},{"$error":"#DIV/0!"},null,{"$error":"#DIV/0!"},null,null,null,{"$error":"#DIV/0!"},null,""]
[{"$f":"IF(ISBLANK('Program Requirements'!A211),\"\",('Program Requirements'!A211))","v":""},null,null,null,{"$f":"IF(ISBLANK('Program Requirements'!D211),\"\",'Program Requirements'!D211)","v":""},null,null,null,null,null,null,null,null,{"$f":"IF(D189=\"Yes\",('Program Requirements'!G211),\"\")","v":""},{"$f":"IF(D189=\"Yes\",('Program Requirements'!L211),\"\")","v":""},{"$f":"IF(ISBLANK('Program Requirements'!M211),\"\",'Program Requirements'!M211)","v":{"$error":"#DIV/0!"}},{"$error":"#DIV/0!"},null,{"$error":"#DIV/0!"},null,null,null,{"$error":"#DIV/0!"},null,""]
[{"$f":"IF(ISBLANK('Program Requirements'!A212),\"\",('Program Requirements'!A212))","v":""},null,null,null,{"$f":"IF(ISBLANK('Program Requirements'!D212),\"\",'Program Requirements'!D212)","v":""},null,null,null,null,null,null,null,null,{"$f":"IF(D190=\"Yes\",('Program Requirements'!G212),\"\")","v":""},{"$f":"IF(D190=\"Yes\",('Program Requirements'!L212),\"\")","v":""},{"$f":"IF(ISBLANK('Program Requirements'!M212),\"\",'Program Requirements'!M212)","v":{"$error":"#DIV/0!"}},{"$error":"#DIV/0!"},null,{"$error":"#DIV/0!"},null,null,null,{"$error":"#DIV/0!"},null,""]
[{"$f":"IF(ISBLANK('Program Requirements'!A213),\"\",('Program Requirements'!A213))","v":""},null,null,null,{"$f":"IF(ISBLANK('Program Requirements'!D213),\"\",'Program Requirements'!D213)","v":""},null,null,null,null,null,null,null,null,{"$f":"IF(D191=\"Yes\",('Program Requirements'!G213),\"\")","v":""},{"$f":"IF(D191=\"Yes\",('Program Requirements'!L213),\"\")","v":""},{"$f":"IF(ISBLANK('Program Requirements'!M213),\"\",'Program Requirements'!M213)","v":{"$error":"#DIV/0!"}},{"$error":"#DIV/0!"},null,{"$error":"#DIV/0!"},null,null,null,{"$error":"#DIV/0!"},null,""]
[{"$f":"IF(ISBLANK('Program Requirements'!A214),\"\",('Program Requirements'!A214))","v":""},null,null,null,{"$f":"IF(ISBLANK('Program Requirements'!D214),\"\",'Program Requirements'!D214)","v":""},null,null,null,null,null,null,null,null,{"$f":"IF(D192=\"Yes\",('Program Requirements'!G214),\"\")","v":""},{"$f":"IF(D192=\"Yes\",('Program Requirements'!L214),\"\")","v":""},{"$f":"IF(ISBLANK('Program Requirements'!M214),\"\",'Program Requirements'!M214)","v":{"$error":"#DIV/0!"}},{"$error":"#DIV/0!"},null,{"$error":"#DIV/0!"},null,null,null,{"$error":"#DIV/0!"},null,""]
[{"$f":"IF(ISBLANK('Program Requirements'!A215),\"\",('Program Requirements'!A215))","v":""},null,null,null,{"$f":"IF(ISBLANK('Program Requirements'!D215),\"\",'Program Requirements'!D215)","v":""},null,null,null,null,null,null,null,null,{"$f":"IF(D193=\"Yes\",('Program Requirements'!G215),\"\")","v":""},{"$f":"IF(D193=\"Yes\",('Program Requirements'!L215),\"\")","v":""},{"$f":"IF(ISBLANK('Program Requirements'!M215),\"\",'Program Requirements'!M215)","v":{"$error":"#DIV/0!"}},{"$error":"#DIV/0!"},null,{"$error":"#DIV/0!"},null,null,null,{"$error":"#DIV/0!"},null,""]
[{"$f":"IF(ISBLANK('Program Requirements'!A216),\"\",('Program Requirements'!A216))","v":""},null,null,null,{"$f":"IF(ISBLANK('Program Requirements'!D216),\"\",'Program Requirements'!D216)","v":""},null,null,null,null,null,null,null,null,{"$f":"IF(D194=\"Yes\",('Program Requirements'!G216),\"\")","v":""},{"$f":"IF(D194=\"Yes\",('Program Requirements'!L216),\"\")","v":""},{"$f":"IF(ISBLANK('Program Requirements'!M216),\"\",'Program Requirements'!M216)","v":{"$error":"#DIV/0!"}},{"$error":"#DIV/0!"},null,{"$error":"#DIV/0!"},null,null,null,{"$error":"#DIV/0!"},null,""]
[{"$f":"IF(ISBLANK('Program Requirements'!A217),\"\",('Program Requirements'!A217))","v":""},null,null,null,{"$f":"IF(ISBLANK('Program Requirements'!D217),\"\",'Program Requirements'!D217)","v":""},null,null,null,null,null,null,null,null,{"$f":"IF(D195=\"Yes\",('Program Requirements'!G217),\"\")","v":""},{"$f":"IF(D195=\"Yes\",('Program Requirements'!L217),\"\")","v":""},{"$f":"IF(ISBLANK('Program Requirements'!M217),\"\",'Program Requirements'!M217)","v":{"$error":"#DIV/0!"}},{"$error":"#DIV/0!"},null,{"$error":"#DIV/0!"},null,null,null,{"$error":"#DIV/0!"},null,""]
[{"$f":"IF(ISBLANK('Program Requirements'!A218),\"\",('Program Requirements'!A218))","v":""},null,null,null,{"$f":"IF(ISBLANK('Program Requirements'!D218),\"\",'Program Requirements'!D218)","v":""},null,null,null,null,null,null,null,null,{"$f":"IF(D196=\"Yes\",('Program Requirements'!G218),\"\")","v":""},{"$f":"IF(D196=\"Yes\",('Program Requirements'!L218),\"\")","v":""},{"$f":"IF(ISBLANK('Program Requirements'!M218),\"\",'Program Requirements'!M218)","v":{"$error":"#DIV/0!"}},{"$error":"#DIV/0!"},null,{"$error":"#DIV/0!"},null,null,null,{"$error":"#DIV/0!"},null,""]
[{"$f":"IF(ISBLANK('Program Requirements'!A219),\"\",('Program Requirements'!A219))","v":""},null,null,null,{"$f":"IF(ISBLANK('Program Requirements'!D219),\"\",'Program Requirements'!D219)","v":""},null,null,null,null,null,null,null,null,{"$f":"IF(D197=\"Yes\",('Program Requirements'!G219),\"\")","v":""},{"$f":"IF(D197=\"Yes\",('Program Requirements'!L219),\"\")","v":""},{"$f":"IF(ISBLANK('Program Requirements'!M219),\"\",'Program Requirements'!M219)","v":{"$error":"#DIV/0!"}},{"$error":"#DIV/0!"},null,{"$error":"#DIV/0!"},null,null,null,{"$error":"#DIV/0!"},null,""]
[{"$f":"IF(ISBLANK('Program Requirements'!A220),\"\",('Program Requirements'!A220))","v":""},null,null,null,{"$f":"IF(ISBLANK('Program Requirements'!D220),\"\",'Program Requirements'!D220)","v":""},null,null,null,null,null,null,null,null,{"$f":"IF(D198=\"Yes\",('Program Requirements'!G220),\"\")","v":""},{"$f":"IF(D198=\"Yes\",('Program Requirements'!L220),\"\")","v":""},{"$f":"IF(ISBLANK('Program Requirements'!M220),\"\",'Program Requirements'!M220)","v":{"$error":"#DIV/0!"}},{"$error":"#DIV/0!"},null,{"$error":"#DIV/0!"},null,null,null,{"$error":"#DIV/0!"},null,""]
[{"$f":"IF(ISBLANK('Program Requirements'!A221),\"\",('Program Requirements'!A221))","v":""},null,null,null,{"$f":"IF(ISBLANK('Program Requirements'!D221),\"\",'Program Requirements'!D221)","v":""},null,null,null,null,null,null,null,null,{"$f":"IF(D199=\"Yes\",('Program Requirements'!G221),\"\")","v":""},{"$f":"IF(D199=\"Yes\",('Program Requirements'!L221),\"\")","v":""},{"$f":"IF(ISBLANK('Program Requirements'!M221),\"\",'Program Requirements'!M221)","v":{"$error":"#DIV/0!"}},{"$error":"#DIV/0!"},null,{"$error":"#DIV/0!"},null,null,null,{"$error":"#DIV/0!"},null,""]
[{"$f":"IF(ISBLANK('Program Requirements'!A222),\"\",('Program Requirements'!A222))","v":""},null,null,null,{"$f":"IF(ISBLANK('Program Requirements'!D222),\"\",'Program Requirements'!D222)","v":""},null,null,null,null,null,null,null,null,{"$f":"IF(D200=\"Yes\",('Program Requirements'!G222),\"\")","v":""},{"$f":"IF(D200=\"Yes\",('Program Requirements'!L222),\"\")","v":""},{"$f":"IF(ISBLANK('Program Requirements'!M222),\"\",'Program Requirements'!M222)","v":{"$error":"#DIV/0!"}},{"$error":"#DIV/0!"},null,{"$error":"#DIV/0!"},null,null,null,{"$error":"#DIV/0!"},null,""]
[{"$f":"IF(ISBLANK('Program Requirements'!A223),\"\",('Program Requirements'!A223))","v":""},null,null,null,{"$f":"IF(ISBLANK('Program Requirements'!D223),\"\",'Program Requirements'!D223)","v":""},null,null,null,null,null,null,null,null,{"$f":"IF(D201=\"Yes\",('Program Requirements'!G223),\"\")","v":""},{"$f":"IF(D201=\"Yes\",('Program Requirements'!L223),\"\")","v":""},{"$f":"IF(ISBLANK('Program Requirements'!M223),\"\",'Program Requirements'!M223)","v":{"$error":"#DIV/0!"}},{"$error":"#DIV/0!"},null,{"$error":"#DIV/0!"},null,null,null,{"$error":"#DIV/0!"},null,""]
[{"$f":"IF(ISBLANK('Program Requirements'!A224),\"\",('Program Requirements'!A224))","v":""},null,null,null,{"$f":"IF(ISBLANK('Program Requirements'!D224),\"\",'Program Requirements'!D224)","v":""},null,null,null,null,null,null,null,null,{"$f":"IF(D202=\"Yes\",('Program Requirements'!G224),\"\")","v":""},{"$f":"IF(D202=\"Yes\",('Program Requirements'!L224),\"\")","v":""},{"$f":"IF(ISBLANK('Program Requirements'!M224),\"\",'Program Requirements'!M224)","v":{"$error":"#DIV/0!"}},{"$error":"#DIV/0!"},null,{"$error":"#DIV/0!"},null,null,null,{"$error":"#DIV/0!"},null,""]
[{"$f":"IF(ISBLANK('Program Requirements'!A225),\"\",('Program Requirements'!A225))","v":""},null,null,null,{"$f":"IF(ISBLANK('Program Requirements'!D225),\"\",'Program Requirements'!D225)","v":""},null,null,null,null,null,null,null,null,{"$f":"IF(D203=\"Yes\",('Program Requirements'!G225),\"\")","v":""},{"$f":"IF(D203=\"Yes\",('Program Requirements'!L225),\"\")","v":""},{"$f":"IF(ISBLANK('Program Requirements'!M225),\"\",'Program Requirements'!M225)","v":{"$error":"#DIV/0!"}},{"$error":"#DIV/0!"},null,{"$error":"#DIV/0!"},null,null,null,{"$error":"#DIV/0!"},null,""]
[{"$f":"IF(ISBLANK('Program Requirements'!A226),\"\",('Program Requirements'!A226))","v":""},null,null,null,{"$f":"IF(ISBLANK('Program Requirements'!D226),\"\",'Program Requirements'!D226)","v":""},null,null,null,null,null,null,null,null,{"$f":"IF(D204=\"Yes\",('Program Requirements'!G226),\"\")","v":""},{"$f":"IF(D204=\"Yes\",('Program Requirements'!L226),\"\")","v":""},{"$f":"IF(ISBLANK('Program Requirements'!M226),\"\",'Program Requirements'!M226)","v":{"$error":"#DIV/0!"}},{"$error":"#DIV/0!"},null,{"$error":"#DIV/0!"},null,null,null,{"$error":"#DIV/0!"},null,""]
[{"$f":"IF(ISBLANK('Program Requirements'!A227),\"\",('Program Requirements'!A227))","v":""},null,null,null,{"$f":"IF(ISBLANK('Program Requirements'!D227),\"\",'Program Requirements'!D227)","v":""},null,null,null,null,null,null,null,null,{"$f":"IF(D205=\"Yes\",('Program Requirements'!G227),\"\")","v":""},{"$f":"IF(D205=\"Yes\",('Program Requirements'!L227),\"\")","v":""},{"$f":"IF(ISBLANK('Program Requirements'!M227),\"\",'Program Requirements'!M227)","v":{"$error":"#DIV/0!"}},{"$error":"#DIV/0!"},null,{"$error":"#DIV/0!"},null,null,null,{"$error":"#DIV/0!"},null,""]
[{"$f":"IF(ISBLANK('Program Requirements'!A228),\"\",('Program Requirements'!A228))","v":""},null,null,null,{"$f":"IF(ISBLANK('Program Requirements'!D228),\"\",'Program Requirements'!D228)","v":""},null,null,null,null,null,null,null,null,{"$f":"IF(D206=\"Yes\",('Program Requirements'!G228),\"\")","v":""},{"$f":"IF(D206=\"Yes\",('Program Requirements'!L228),\"\")","v":""},{"$f":"IF(ISBLANK('Program Requirements'!M228),\"\",'Program Requirements'!M228)","v":{"$error":"#DIV/0!"}},{"$error":"#DIV/0!"},null,{"$error":"#DIV/0!"},null,null,null,{"$error":"#DIV/0!"},null,""]
[{"$f":"IF(ISBLANK('Program Requirements'!A229),\"\",('Program Requirements'!A229))","v":""},null,null,null,{"$f":"IF(ISBLANK('Program Requirements'!D229),\"\",'Program Requirements'!D229)","v":""},null,null,null,null,null,null,null,null,{"$f":"IF(D207=\"Yes\",('Program Requirements'!G229),\"\")","v":""},{"$f":"IF(D207=\"Yes\",('Program Requirements'!L229),\"\")","v":""},{"$f":"IF(ISBLANK('Program Requirements'!M229),\"\",'Program Requirements'!M229)","v":{"$error":"#DIV/0!"}},{"$error":"#DIV/0!"},null,{"$error":"#DIV/0!"},null,null,null,{"$error":"#DIV/0!"},null,""]
[{"$f":"IF(ISBLANK('Program Requirements'!A230),\"\",('Program Requirements'!A230))","v":""},null,null,null,{"$f":"IF(ISBLANK('Program Requirements'!D230),\"\",'Program Requirements'!D230)","v":""},null,null,null,null,null,null,null,null,{"$f":"IF(D208=\"Yes\",('Program Requirements'!G230),\"\")","v":""},{"$f":"IF(D208=\"Yes\",('Program Requirements'!L230),\"\")","v":""},{"$f":"IF(ISBLANK('Program Requirements'!M230),\"\",'Program Requirements'!M230)","v":{"$error":"#DIV/0!"}},{"$error":"#DIV/0!"},null,{"$error":"#DIV/0!"},null,null,null,{"$error":"#DIV/0!"},null,""]
[{"$f":"IF(ISBLANK('Program Requirements'!A231),\"\",('Program Requirements'!A231))","v":""},null,null,null,{"$f":"IF(ISBLANK('Program Requirements'!D231),\"\",'Program Requirements'!D231)","v":""},null,null,null,null,null,null,null,null,{"$f":"IF(D209=\"Yes\",('Program Requirements'!G231),\"\")","v":""},{"$f":"IF(D209=\"Yes\",('Program Requirements'!L231),\"\")","v":""},{"$f":"IF(ISBLANK('Program Requirements'!M231),\"\",'Program Requirements'!M231)","v":{"$error":"#DIV/0!"}},{"$error":"#DIV/0!"},null,{"$error":"#DIV/0!"},null,null,null,{"$error":"#DIV/0!"},null,""]
[{"$f":"IF(ISBLANK('Program Requirements'!A232),\"\",('Program Requirements'!A232))","v":""},null,null,null,{"$f":"IF(ISBLANK('Program Requirements'!D232),\"\",'Program Requirements'!D232)","v":""},null,null,null,null,null,null,null,null,{"$f":"IF(D210=\"Yes\",('Program Requirements'!G232),\"\")","v":""},{"$f":"IF(D210=\"Yes\",('Program Requirements'!L232),\"\")","v":""},{"$f":"IF(ISBLANK('Program Requirements'!M232),\"\",'Program Requirements'!M232)","v":{"$error":"#DIV/0!"}},{"$error":"#DIV/0!"},null,{"$error":"#DIV/0!"},null,null,null,{"$error":"#DIV/0!"},null,""]
[{"$f":"IF(ISBLANK('Program Requirements'!A233),\"\",('Program Requirements'!A233))","v":""},null,null,null,{"$f":"IF(ISBLANK('Program Requirements'!D233),\"\",'Program Requirements'!D233)","v":""},null,null,null,null,null,null,null,null,{"$f":"IF(D211=\"Yes\",('Program Requirements'!G233),\"\")","v":""},{"$f":"IF(D211=\"Yes\",('Program Requirements'!L233),\"\")","v":""},{"$f":"IF(ISBLANK('Program Requirements'!M233),\"\",'Program Requirements'!M233)","v":{"$error":"#DIV/0!"}},{"$error":"#DIV/0!"},null,{"$error":"#DIV/0!"},null,null,null,{"$error":"#DIV/0!"},null,""]
[{"$f":"IF(ISBLANK('Program Requirements'!A234),\"\",('Program Requirements'!A234))","v":""},null,null,null,{"$f":"IF(ISBLANK('Program Requirements'!D234),\"\",'Program Requirements'!D234)","v":""},null,null,null,null,null,null,null,null,{"$f":"IF(D212=\"Yes\",('Program Requirements'!G234),\"\")","v":""},{"$f":"IF(D212=\"Yes\",('Program Requirements'!L234),\"\")","v":""},{"$f":"IF(ISBLANK('Program Requirements'!M234),\"\",'Program Requirements'!M234)","v":{"$error":"#DIV/0!"}},{"$error":"#DIV/0!"},null,{"$error":"#DIV/0!"},null,null,null,{"$error":"#DIV/0!"},null,""]
[{"$f":"IF(ISBLANK('Program Requirements'!A235),\"\",('Program Requirements'!A235))","v":""},null,null,null,{"$f":"IF(ISBLANK('Program Requirements'!D235),\"\",'Program Requirements'!D235)","v":""},null,null,null,null,null,null,null,null,{"$f":"IF(D213=\"Yes\",('Program Requirements'!G235),\"\")","v":""},{"$f":"IF(D213=\"Yes\",('Program Requirements'!L235),\"\")","v":""},{"$f":"IF(ISBLANK('Program Requirements'!M235),\"\",'Program Requirements'!M235)","v":{"$error":"#DIV/0!"}},{"$error":"#DIV/0!"},null,{"$error":"#DIV/0!"},null,null,null,{"$error":"#DIV/0!"},null,""]
[{"$f":"IF(ISBLANK('Program Requirements'!A236),\"\",('Program Requirements'!A236))","v":""},null,null,null,{"$f":"IF(ISBLANK('Program Requirements'!D236),\"\",'Program Requirements'!D236)","v":""},null,null,null,null,null,null,null,null,{"$f":"IF(D214=\"Yes\",('Program Requirements'!G236),\"\")","v":""},{"$f":"IF(D214=\"Yes\",('Program Requirements'!L236),\"\")","v":""},{"$f":"IF(ISBLANK('Program Requirements'!M236),\"\",'Program Requirements'!M236)","v":{"$error":"#DIV/0!"}},{"$error":"#DIV/0!"},null,{"$error":"#DIV/0!"},null,null,null,{"$error":"#DIV/0!"},null,""]
[{"$f":"IF(ISBLANK('Program Requirements'!A237),\"\",('Program Requirements'!A237))","v":""},null,null,null,{"$f":"IF(ISBLANK('Program Requirements'!D237),\"\",'Program Requirements'!D237)","v":""},null,null,null,null,null,null,null,null,{"$f":"IF(D215=\"Yes\",('Program Requirements'!G237),\"\")","v":""},{"$f":"IF(D215=\"Yes\",('Program Requirements'!L237),\"\")","v":""},{"$f":"IF(ISBLANK('Program Requirements'!M237),\"\",'Program Requirements'!M237)","v":{"$error":"#DIV/0!"}},{"$f":"IF(IF(D215=\"Yes\",IF(ISBLANK(O215),\"\",SUM(O215)*$T$47),0)>$F$46,SUM($F$46),IF(D215=\"Yes\",IF(ISBLANK(O215),\"\",SUM(O215)*$T$47),\"\"))","v":{"$error":"#DIV/0!"}},null,{"$error":"#DIV/0!"},null,null,null,{"$f":"IF(SUM(U215)=0,SUM(Q215),IF(SUM(Q215,U215)=U215,\"ERROR\",SUM(Q215,U215)))","v":{"$error":"#DIV/0!"}},null,""]
[{"$f":"IF(ISBLANK('Program Requirements'!A238),\"\",('Program Requirements'!A238))","v":""},null,null,null,{"$f":"IF(ISBLANK('Program Requirements'!D238),\"\",'Program Requirements'!D238)","v":""},null,null,null,null,null,null,null,null,{"$f":"IF(D216=\"Yes\",('Program Requirements'!G238),\"\")","v":""},{"$f":"IF(D216=\"Yes\",('Program Requirements'!L238),\"\")","v":""},{"$f":"IF(ISBLANK('Program Requirements'!M238),\"\",'Program Requirements'!M238)","v":{"$error":"#DIV/0!"}},{"$error":"#DIV/0!"},null,{"$error":"#DIV/0!"},null,null,null,{"$error":"#DIV/0!"},null,""]
[{"$f":"IF(ISBLANK('Program Requirements'!A239),\"\",('Program Requirements'!A239))","v":""},null,null,null,{"$f":"IF(ISBLANK('Program Requirements'!D239),\"\",'Program Requirements'!D239)","v":""},null,null,null,null,null,null,null,null,{"$f":"IF(D217=\"Yes\",('Program Requirements'!G239),\"\")","v":""},{"$f":"IF(D217=\"Yes\",('Program Requirements'!L239),\"\")","v":""},{"$f":"IF(ISBLANK('Program Requirements'!M239),\"\",'Program Requirements'!M239)","v":{"$error":"#DIV/0!"}},{"$error":"#DIV/0!"},null,{"$error":"#DIV/0!"},null,null,null,{"$error":"#DIV/0!"},null,""]
[{"$f":"IF(ISBLANK('Program Requirements'!A240),\"\",('Program Requirements'!A240))","v":""},null,null,null,{"$f":"IF(ISBLANK('Program Requirements'!D240),\"\",'Program Requirements'!D240)","v":""},null,null,null,null,null,null,null,null,{"$f":"IF(D218=\"Yes\",('Program Requirements'!G240),\"\")","v":""},{"$f":"IF(D218=\"Yes\",('Program Requirements'!L240),\"\")","v":""},{"$f":"IF(ISBLANK('Program Requirements'!M240),\"\",'Program Requirements'!M240)","v":{"$error":"#DIV/0!"}},{"$error":"#DIV/0!"},null,{"$error":"#DIV/0!"},null,null,null,{"$error":"#DIV/0!"},null,""]
[{"$f":"IF(ISBLANK('Program Requirements'!A241),\"\",('Program Requirements'!A241))","v":""},null,null,null,{"$f":"IF(ISBLANK('Program Requirements'!D241),\"\",'Program Requirements'!D241)","v":""},null,null,null,null,null,null,null,null,{"$f":"IF(D219=\"Yes\",('Program Requirements'!G241),\"\")","v":""},{"$f":"IF(D219=\"Yes\",('Program Requirements'!L241),\"\")","v":""},{"$f":"IF(ISBLANK('Program Requirements'!M241),\"\",'Program Requirements'!M241)","v":{"$error":"#DIV/0!"}},{"$error":"#DIV/0!"},null,{"$error":"#DIV/0!"},null,null,null,{"$error":"#DIV/0!"},null,""]
[{"$f":"IF(ISBLANK('Program Requirements'!A242),\"\",('Program Requirements'!A242))","v":""},null,null,null,{"$f":"IF(ISBLANK('Program Requirements'!D242),\"\",'Program Requirements'!D242)","v":""},null,null,null,null,null,null,null,null,{"$f":"IF(D220=\"Yes\",('Program Requirements'!G242),\"\")","v":""},{"$f":"IF(D220=\"Yes\",('Program Requirements'!L242),\"\")","v":""},{"$f":"IF(ISBLANK('Program Requirements'!M242),\"\",'Program Requirements'!M242)","v":{"$error":"#DIV/0!"}},{"$error":"#DIV/0!"},null,{"$error":"#DIV/0!"},null,null,null,{"$error":"#DIV/0!"},null,""]
[{"$f":"IF(ISBLANK('Program Requirements'!A243),\"\",('Program Requirements'!A243))","v":""},null,null,null,{"$f":"IF(ISBLANK('Program Requirements'!D243),\"\",'Program Requirements'!D243)","v":""},null,null,null,null,null,null,null,null,{"$f":"IF(D221=\"Yes\",('Program Requirements'!G243),\"\")","v":""},{"$f":"IF(D221=\"Yes\",('Program Requirements'!L243),\"\")","v":""},{"$f":"IF(ISBLANK('Program Requirements'!M243),\"\",'Program Requirements'!M243)","v":{"$error":"#DIV/0!"}},{"$error":"#DIV/0!"},null,{"$error":"#DIV/0!"},null,null,null,{"$error":"#DIV/0!"},null,""]
[{"$f":"IF(ISBLANK('Program Requirements'!A244),\"\",('Program Requirements'!A244))","v":""},null,null,null,{"$f":"IF(ISBLANK('Program Requirements'!D244),\"\",'Program Requirements'!D244)","v":""},null,null,null,null,null,null,null,null,{"$f":"IF(D222=\"Yes\",('Program Requirements'!G244),\"\")","v":""},{"$f":"IF(D222=\"Yes\",('Program Requirements'!L244),\"\")","v":""},{"$f":"IF(ISBLANK('Program Requirements'!M244),\"\",'Program Requirements'!M244)","v":{"$error":"#DIV/0!"}},{"$error":"#DIV/0!"},null,{"$error":"#DIV/0!"},null,null,null,{"$error":"#DIV/0!"},null,""]
[{"$f":"IF(ISBLANK('Program Requirements'!A245),\"\",('Program Requirements'!A245))","v":""},null,null,null,{"$f":"IF(ISBLANK('Program Requirements'!D245),\"\",'Program Requirements'!D245)","v":""},null,null,null,null,null,null,null,null,{"$f":"IF(D223=\"Yes\",('Program Requirements'!G245),\"\")","v":""},{"$f":"IF(D223=\"Yes\",('Program Requirements'!L245),\"\")","v":""},{"$f":"IF(ISBLANK('Program Requirements'!M245),\"\",'Program Requirements'!M245)","v":{"$error":"#DIV/0!"}},{"$error":"#DIV/0!"},null,{"$error":"#DIV/0!"},null,null,null,{"$error":"#DIV/0!"},null,""]
[{"$f":"IF(ISBLANK('Program Requirements'!A246),\"\",('Program Requirements'!A246))","v":""},null,null,null,{"$f":"IF(ISBLANK('Program Requirements'!D246),\"\",'Program Requirements'!D246)","v":""},null,null,null,null,null,null,null,null,{"$f":"IF(D224=\"Yes\",('Program Requirements'!G246),\"\")","v":""},{"$f":"IF(D224=\"Yes\",('Program Requirements'!L246),\"\")","v":""},{"$f":"IF(ISBLANK('Program Requirements'!M246),\"\",'Program Requirements'!M246)","v":{"$error":"#DIV/0!"}},{"$error":"#DIV/0!"},null,{"$error":"#DIV/0!"},null,null,null,{"$error":"#DIV/0!"},null,""]
[{"$f":"IF(ISBLANK('Program Requirements'!A247),\"\",('Program Requirements'!A247))","v":""},null,null,null,{"$f":"IF(ISBLANK('Program Requirements'!D247),\"\",'Program Requirements'!D247)","v":""},null,null,null,null,null,null,null,null,{"$f":"IF(D225=\"Yes\",('Program Requirements'!G247),\"\")","v":""},{"$f":"IF(D225=\"Yes\",('Program Requirements'!L247),\"\")","v":""},{"$f":"IF(ISBLANK('Program Requirements'!M247),\"\",'Program Requirements'!M247)","v":{"$error":"#DIV/0!"}},{"$error":"#DIV/0!"},null,{"$error":"#DIV/0!"},null,null,null,{"$error":"#DIV/0!"},null,""]
[{"$f":"IF(ISBLANK('Program Requirements'!A248),\"\",('Program Requirements'!A248))","v":""},null,null,null,{"$f":"IF(ISBLANK('Program Requirements'!D248),\"\",'Program Requirements'!D248)","v":""},null,null,null,null,null,null,null,null,{"$f":"IF(D226=\"Yes\",('Program Requirements'!G248),\"\")","v":""},{"$f":"IF(D226=\"Yes\",('Program Requirements'!L248),\"\")","v":""},{"$f":"IF(ISBLANK('Program Requirements'!M248),\"\",'Program Requirements'!M248)","v":{"$error":"#DIV/0!"}},{"$error":"#DIV/0!"},null,{"$error":"#DIV/0!"},null,null,null,{"$error":"#DIV/0!"},null,""]
[{"$f":"IF(ISBLANK('Program Requirements'!A249),\"\",('Program Requirements'!A249))","v":""},null,null,null,{"$f":"IF(ISBLANK('Program Requirements'!D249),\"\",'Program Requirements'!D249)","v":""},null,null,null,null,null,null,null,null,{"$f":"IF(D227=\"Yes\",('Program Requirements'!G249),\"\")","v":""},{"$f":"IF(D227=\"Yes\",('Program Requirements'!L249),\"\")","v":""},{"$f":"IF(ISBLANK('Program Requirements'!M249),\"\",'Program Requirements'!M249)","v":{"$error":"#DIV/0!"}},{"$error":"#DIV/0!"},null,{"$error":"#DIV/0!"},null,null,null,{"$error":"#DIV/0!"},null,""]
[{"$f":"IF(ISBLANK('Program Requirements'!A250),\"\",('Program Requirements'!A250))","v":""},null,null,null,{"$f":"IF(ISBLANK('Program Requirements'!D250),\"\",'Program Requirements'!D250)","v":""},null,null,null,null,null,null,null,null,{"$f":"IF(D228=\"Yes\",('Program Requirements'!G250),\"\")","v":""},{"$f":"IF(D228=\"Yes\",('Program Requirements'!L250),\"\")","v":""},{"$f":"IF(ISBLANK('Program Requirements'!M250),\"\",'Program Requirements'!M250)","v":{"$error":"#DIV/0!"}},{"$error":"#DIV/0!"},null,{"$error":"#DIV/0!"},null,null,null,{"$error":"#DIV/0!"},null,""]
[{"$f":"IF(ISBLANK('Program Requirements'!A251),\"\",('Program Requirements'!A251))","v":""},null,null,null,{"$f":"IF(ISBLANK('Program Requirements'!D251),\"\",'Program Requirements'!D251)","v":""},null,null,null,null,null,null,null,null,{"$f":"IF(D229=\"Yes\",('Program Requirements'!G251),\"\")","v":""},{"$f":"IF(D229=\"Yes\",('Program Requirements'!L251),\"\")","v":""},{"$f":"IF(ISBLANK('Program Requirements'!M251),\"\",'Program Requirements'!M251)","v":{"$error":"#DIV/0!"}},{"$error":"#DIV/0!"},null,{"$error":"#DIV/0!"},null,null,null,{"$error":"#DIV/0!"},null,""]
[{"$f":"IF(ISBLANK('Program Requirements'!A252),\"\",('Program Requirements'!A252))","v":""},null,null,null,{"$f":"IF(ISBLANK('Program Requirements'!D252),\"\",'Program Requirements'!D252)","v":""},null,null,null,null,null,null,null,null,{"$f":"IF(D230=\"Yes\",('Program Requirements'!G252),\"\")","v":""},{"$f":"IF(D230=\"Yes\",('Program Requirements'!L252),\"\")","v":""},{"$f":"IF(ISBLANK('Program Requirements'!M252),\"\",'Program Requirements'!M252)","v":{"$error":"#DIV/0!"}},{"$error":"#DIV/0!"},null,{"$error":"#DIV/0!"},null,null,null,{"$error":"#DIV/0!"},null,""]
[{"$f":"IF(ISBLANK('Program Requirements'!A253),\"\",('Program Requirements'!A253))","v":""},null,null,null,{"$f":"IF(ISBLANK('Program Requirements'!D253),\"\",'Program Requirements'!D253)","v":""},null,null,null,null,null,null,null,null,{"$f":"IF(D231=\"Yes\",('Program Requirements'!G253),\"\")","v":""},{"$f":"IF(D231=\"Yes\",('Program Requirements'!L253),\"\")","v":""},{"$f":"IF(ISBLANK('Program Requirements'!M253),\"\",'Program Requirements'!M253)","v":{"$error":"#DIV/0!"}},{"$error":"#DIV/0!"},null,{"$error":"#DIV/0!"},null,null,null,{"$error":"#DIV/0!"},null,""]
[{"$f":"IF(ISBLANK('Program Requirements'!A254),\"\",('Program Requirements'!A254))","v":""},null,null,null,{"$f":"IF(ISBLANK('Program Requirements'!D254),\"\",'Program Requirements'!D254)","v":""},null,null,null,null,null,null,null,null,{"$f":"IF(D232=\"Yes\",('Program Requirements'!G254),\"\")","v":""},{"$f":"IF(D232=\"Yes\",('Program Requirements'!L254),\"\")","v":""},{"$f":"IF(ISBLANK('Program Requirements'!M254),\"\",'Program Requirements'!M254)","v":{"$error":"#DIV/0!"}},{"$error":"#DIV/0!"},null,{"$error":"#DIV/0!"},null,null,null,{"$error":"#DIV/0!"},null,""]
[{"$f":"IF(ISBLANK('Program Requirements'!A255),\"\",('Program Requirements'!A255))","v":""},null,null,null,{"$f":"IF(ISBLANK('Program Requirements'!D255),\"\",'Program Requirements'!D255)","v":""},null,null,null,null,null,null,null,null,{"$f":"IF(D233=\"Yes\",('Program Requirements'!G255),\"\")","v":""},{"$f":"IF(D233=\"Yes\",('Program Requirements'!L255),\"\")","v":""},{"$f":"IF(ISBLANK('Program Requirements'!M255),\"\",'Program Requirements'!M255)","v":{"$error":"#DIV/0!"}},{"$error":"#DIV/0!"},null,{"$error":"#DIV/0!"},null,null,null,{"$error":"#DIV/0!"},null,""]
[{"$f":"IF(ISBLANK('Program Requirements'!A256),\"\",('Program Requirements'!A256))","v":""},null,null,null,{"$f":"IF(ISBLANK('Program Requirements'!D256),\"\",'Program Requirements'!D256)","v":""},null,null,null,null,null,null,null,null,{"$f":"IF(D234=\"Yes\",('Program Requirements'!G256),\"\")","v":""},{"$f":"IF(D234=\"Yes\",('Program Requirements'!L256),\"\")","v":""},{"$f":"IF(ISBLANK('Program Requirements'!M256),\"\",'Program Requirements'!M256)","v":{"$error":"#DIV/0!"}},{"$error":"#DIV/0!"},null,{"$error":"#DIV/0!"},null,null,null,{"$error":"#DIV/0!"},null,""]
[{"$f":"IF(ISBLANK('Program Requirements'!A257),\"\",('Program Requirements'!A257))","v":""},null,null,null,{"$f":"IF(ISBLANK('Program Requirements'!D257),\"\",'Program Requirements'!D257)","v":""},null,null,null,null,null,null,null,null,{"$f":"IF(D235=\"Yes\",('Program Requirements'!G257),\"\")","v":""},{"$f":"IF(D235=\"Yes\",('Program Requirements'!L257),\"\")","v":""},{"$f":"IF(ISBLANK('Program Requirements'!M257),\"\",'Program Requirements'!M257)","v":{"$error":"#DIV/0!"}},{"$error":"#DIV/0!"},null,{"$error":"#DIV/0!"},null,null,null,{"$error":"#DIV/0!"},null,""]
[{"$f":"IF(ISBLANK('Program Requirements'!A258),\"\",('Program Requirements'!A258))","v":""},null,null,null,{"$f":"IF(ISBLANK('Program Requirements'!D258),\"\",'Program Requirements'!D258)","v":""},null,null,null,null,null,null,null,null,{"$f":"IF(D236=\"Yes\",('Program Requirements'!G258),\"\")","v":""},{"$f":"IF(D236=\"Yes\",('Program Requirements'!L258),\"\")","v":""},{"$f":"IF(ISBLANK('Program Requirements'!M258),\"\",'Program Requirements'!M258)","v":{"$error":"#DIV/0!"}},{"$error":"#DIV/0!"},null,{"$error":"#DIV/0!"},null,null,null,{"$error":"#DIV/0!"},null,""]
[{"$f":"IF(ISBLANK('Program Requirements'!A259),\"\",('Program Requirements'!A259))","v":""},null,null,null,{"$f":"IF(ISBLANK('Program Requirements'!D259),\"\",'Program Requirements'!D259)","v":""},null,null,null,null,null,null,null,null,{"$f":"IF(D237=\"Yes\",('Program Requirements'!G259),\"\")","v":""},{"$f":"IF(D237=\"Yes\",('Program Requirements'!L259),\"\")","v":""},{"$f":"IF(ISBLANK('Program Requirements'!M259),\"\",'Program Requirements'!M259)","v":{"$error":"#DIV/0!"}},{"$error":"#DIV/0!"},null,{"$error":"#DIV/0!"},null,null,null,{"$error":"#DIV/0!"},null,""]
[{"$f":"IF(ISBLANK('Program Requirements'!A260),\"\",('Program Requirements'!A260))","v":""},null,null,null,{"$f":"IF(ISBLANK('Program Requirements'!D260),\"\",'Program Requirements'!D260)","v":""},null,null,null,null,null,null,null,null,{"$f":"IF(D238=\"Yes\",('Program Requirements'!G260),\"\")","v":""},{"$f":"IF(D238=\"Yes\",('Program Requirements'!L260),\"\")","v":""},{"$f":"IF(ISBLANK('Program Requirements'!M260),\"\",'Program Requirements'!M260)","v":{"$error":"#DIV/0!"}},{"$error":"#DIV/0!"},null,{"$error":"#DIV/0!"},null,null,null,{"$error":"#DIV/0!"},null,""]
[{"$f":"IF(ISBLANK('Program Requirements'!A261),\"\",('Program Requirements'!A261))","v":""},null,null,null,{"$f":"IF(ISBLANK('Program Requirements'!D261),\"\",'Program Requirements'!D261)","v":""},null,null,null,null,null,null,null,null,{"$f":"IF(D239=\"Yes\",('Program Requirements'!G261),\"\")","v":""},{"$f":"IF(D239=\"Yes\",('Program Requirements'!L261),\"\")","v":""},{"$f":"IF(ISBLANK('Program Requirements'!M261),\"\",'Program Requirements'!M261)","v":{"$error":"#DIV/0!"}},{"$error":"#DIV/0!"},null,{"$error":"#DIV/0!"},null,null,null,{"$error":"#DIV/0!"},null,""]
[{"$f":"IF(ISBLANK('Program Requirements'!A262),\"\",('Program Requirements'!A262))","v":""},null,null,null,{"$f":"IF(ISBLANK('Program Requirements'!D262),\"\",'Program Requirements'!D262)","v":""},null,null,null,null,null,null,null,null,{"$f":"IF(D240=\"Yes\",('Program Requirements'!G262),\"\")","v":""},{"$f":"IF(D240=\"Yes\",('Program Requirements'!L262),\"\")","v":""},{"$f":"IF(ISBLANK('Program Requirements'!M262),\"\",'Program Requirements'!M262)","v":{"$error":"#DIV/0!"}},{"$error":"#DIV/0!"},null,{"$error":"#DIV/0!"},null,null,null,{"$error":"#DIV/0!"},null,""]
[{"$f":"IF(ISBLANK('Program Requirements'!A263),\"\",('Program Requirements'!A263))","v":""},null,null,null,{"$f":"IF(ISBLANK('Program Requirements'!D263),\"\",'Program Requirements'!D263)","v":""},null,null,null,null,null,null,null,null,{"$f":"IF(D241=\"Yes\",('Program Requirements'!G263),\"\")","v":""},{"$f":"IF(D241=\"Yes\",('Program Requirements'!L263),\"\")","v":""},{"$f":"IF(ISBLANK('Program Requirements'!M263),\"\",'Program Requirements'!M263)","v":{"$error":"#DIV/0!"}},{"$error":"#DIV/0!"},null,{"$error":"#DIV/0!"},null,null,null,{"$error":"#DIV/0!"},null,""]
[{"$f":"IF(ISBLANK('Program Requirements'!A264),\"\",('Program Requirements'!A264))","v":""},null,null,null,{"$f":"IF(ISBLANK('Program Requirements'!D264),\"\",'Program Requirements'!D264)","v":""},null,null,null,null,null,null,null,null,{"$f":"IF(D242=\"Yes\",('Program Requirements'!G264),\"\")","v":""},{"$f":"IF(D242=\"Yes\",('Program Requirements'!L264),\"\")","v":""},{"$f":"IF(ISBLANK('Program Requirements'!M264),\"\",'Program Requirements'!M264)","v":{"$error":"#DIV/0!"}},{"$error":"#DIV/0!"},null,{"$error":"#DIV/0!"},null,null,null,{"$error":"#DIV/0!"},null,""]
[{"$f":"IF(ISBLANK('Program Requirements'!A265),\"\",('Program Requirements'!A265))","v":""},null,null,null,{"$f":"IF(ISBLANK('Program Requirements'!D265),\"\",'Program Requirements'!D265)","v":""},null,null,null,null,null,null,null,null,{"$f":"IF(D243=\"Yes\",('Program Requirements'!G265),\"\")","v":""},{"$f":"IF(D243=\"Yes\",('Program Requirements'!L265),\"\")","v":""},{"$f":"IF(ISBLANK('Program Requirements'!M265),\"\",'Program Requirements'!M265)","v":{"$error":"#DIV/0!"}},{"$error":"#DIV/0!"},null,{"$error":"#DIV/0!"},null,null,null,{"$error":"#DIV/0!"},null,""]
[{"$f":"IF(ISBLANK('Program Requirements'!A266),\"\",('Program Requirements'!A266))","v":""},null,null,null,{"$f":"IF(ISBLANK('Program Requirements'!D266),\"\",'Program Requirements'!D266)","v":""},null,null,null,null,null,null,null,null,{"$f":"IF(D244=\"Yes\",('Program Requirements'!G266),\"\")","v":""},{"$f":"IF(D244=\"Yes\",('Program Requirements'!L266),\"\")","v":""},{"$f":"IF(ISBLANK('Program Requirements'!M266),\"\",'Program Requirements'!M266)","v":{"$error":"#DIV/0!"}},{"$error":"#DIV/0!"},null,{"$error":"#DIV/0!"},null,null,null,{"$error":"#DIV/0!"},null,""]
[{"$f":"IF(ISBLANK('Program Requirements'!A267),\"\",('Program Requirements'!A267))","v":""},null,null,null,{"$f":"IF(ISBLANK('Program Requirements'!D267),\"\",'Program Requirements'!D267)","v":""},null,null,null,null,null,null,null,null,{"$f":"IF(D245=\"Yes\",('Program Requirements'!G267),\"\")","v":""},{"$f":"IF(D245=\"Yes\",('Program Requirements'!L267),\"\")","v":""},{"$f":"IF(ISBLANK('Program Requirements'!M267),\"\",'Program Requirements'!M267)","v":{"$error":"#DIV/0!"}},{"$error":"#DIV/0!"},null,{"$error":"#DIV/0!"},null,null,null,{"$error":"#DIV/0!"},null,""]
[{"$f":"IF(ISBLANK('Program Requirements'!A268),\"\",('Program Requirements'!A268))","v":""},null,null,null,{"$f":"IF(ISBLANK('Program Requirements'!D268),\"\",'Program Requirements'!D268)","v":""},null,null,null,null,null,null,null,null,{"$f":"IF(D246=\"Yes\",('Program Requirements'!G268),\"\")","v":""},{"$f":"IF(D246=\"Yes\",('Program Requirements'!L268),\"\")","v":""},{"$f":"IF(ISBLANK('Program Requirements'!M268),\"\",'Program Requirements'!M268)","v":{"$error":"#DIV/0!"}},{"$error":"#DIV/0!"},null,{"$error":"#DIV/0!"},null,null,null,{"$error":"#DIV/0!"},null,""]
[{"$f":"IF(ISBLANK('Program Requirements'!A269),\"\",('Program Requirements'!A269))","v":""},null,null,null,{"$f":"IF(ISBLANK('Program Requirements'!D269),\"\",'Program Requirements'!D269)","v":""},null,null,null,null,null,null,null,null,{"$f":"IF(D247=\"Yes\",('Program Requirements'!G269),\"\")","v":""},{"$f":"IF(D247=\"Yes\",('Program Requirements'!L269),\"\")","v":""},{"$f":"IF(ISBLANK('Program Requirements'!M269),\"\",'Program Requirements'!M269)","v":{"$error":"#DIV/0!"}},{"$error":"#DIV/0!"},null,{"$error":"#DIV/0!"},null,null,null,{"$error":"#DIV/0!"},null,{"$f":"IF(D247=\"Yes\",SUM(W247)/SUM(O247),\"\")","v":""}]
[{"$f":"IF(ISBLANK('Program Requirements'!A270),\"\",('Program Requirements'!A270))","v":""},null,null,null,{"$f":"IF(ISBLANK('Program Requirements'!D270),\"\",'Program Requirements'!D270)","v":""},null,null,null,null,null,null,null,null,{"$f":"IF(D248=\"Yes\",('Program Requirements'!G270),\"\")","v":""},{"$f":"IF(D248=\"Yes\",('Program Requirements'!L270),\"\")","v":""},{"$f":"IF(ISBLANK('Program Requirements'!M270),\"\",'Program Requirements'!M270)","v":{"$error":"#DIV/0!"}},{"$error":"#DIV/0!"},null,{"$f":"SUM(S247)-SUM(Q248)-SUM(U248)","v":{"$error":"#DIV/0!"}},null,null,null,{"$error":"#DIV/0!"},null,""]
[{"$f":"IF(ISBLANK('Program Requirements'!A271),\"\",('Program Requirements'!A271))","v":""},null,null,null,{"$f":"IF(ISBLANK('Program Requirements'!D271),\"\",'Program Requirements'!D271)","v":""},null,null,null,null,null,null,null,null,{"$f":"IF(D249=\"Yes\",('Program Requirements'!G271),\"\")","v":""},{"$f":"IF(D249=\"Yes\",('Program Requirements'!L271),\"\")","v":""},{"$f":"IF(ISBLANK('Program Requirements'!M271),\"\",'Program Requirements'!M271)","v":{"$error":"#DIV/0!"}},{"$error":"#DIV/0!"},null,{"$error":"#DIV/0!"},null,null,null,{"$error":"#DIV/0!"},null,""]
[{"$f":"IF(ISBLANK('Program Requirements'!A272),\"\",('Program Requirements'!A272))","v":""},null,null,null,{"$f":"IF(ISBLANK('Program Requirements'!D272),\"\",'Program Requirements'!D272)","v":""},null,null,null,null,null,null,null,null,{"$f":"IF(D250=\"Yes\",('Program Requirements'!G272),\"\")","v":""},{"$f":"IF(D250=\"Yes\",('Program Requirements'!L272),\"\")","v":""},{"$f":"IF(ISBLANK('Program Requirements'!M272),\"\",'Program Requirements'!M272)","v":{"$error":"#DIV/0!"}},{"$error":"#DIV/0!"},null,{"$error":"#DIV/0!"},null,null,null,{"$error":"#DIV/0!"},null,""]
[{"$f":"IF(ISBLANK('Program Requirements'!A273),\"\",('Program Requirements'!A273))","v":""},null,null,null,{"$f":"IF(ISBLANK('Program Requirements'!D273),\"\",'Program Requirements'!D273)","v":""},null,null,null,null,null,null,null,null,{"$f":"IF(D251=\"Yes\",('Program Requirements'!G273),\"\")","v":""},{"$f":"IF(D251=\"Yes\",('Program Requirements'!L273),\"\")","v":""},{"$f":"IF(ISBLANK('Program Requirements'!M273),\"\",'Program Requirements'!M273)","v":{"$error":"#DIV/0!"}},{"$error":"#DIV/0!"},null,{"$error":"#DIV/0!"},null,null,null,{"$error":"#DIV/0!"},null,""]
[{"$f":"IF(ISBLANK('Program Requirements'!A274),\"\",('Program Requirements'!A274))","v":""},null,null,null,{"$f":"IF(ISBLANK('Program Requirements'!D274),\"\",'Program Requirements'!D274)","v":""},null,null,null,null,null,null,null,null,{"$f":"IF(D252=\"Yes\",('Program Requirements'!G274),\"\")","v":""},{"$f":"IF(D252=\"Yes\",('Program Requirements'!L274),\"\")","v":""},{"$f":"IF(ISBLANK('Program Requirements'!M274),\"\",'Program Requirements'!M274)","v":{"$error":"#DIV/0!"}},{"$error":"#DIV/0!"},null,{"$error":"#DIV/0!"},null,null,null,{"$error":"#DIV/0!"},null,""]
[{"$f":"IF(ISBLANK('Program Requirements'!A275),\"\",('Program Requirements'!A275))","v":""},null,null,null,{"$f":"IF(ISBLANK('Program Requirements'!D275),\"\",'Program Requirements'!D275)","v":""},null,null,null,null,null,null,null,null,{"$f":"IF(D253=\"Yes\",('Program Requirements'!G275),\"\")","v":""},{"$f":"IF(D253=\"Yes\",('Program Requirements'!L275),\"\")","v":""},{"$f":"IF(ISBLANK('Program Requirements'!M275),\"\",'Program Requirements'!M275)","v":{"$error":"#DIV/0!"}},{"$error":"#DIV/0!"},null,{"$error":"#DIV/0!"},null,null,null,{"$error":"#DIV/0!"},null,""]
[{"$f":"IF(ISBLANK('Program Requirements'!A276),\"\",('Program Requirements'!A276))","v":""},null,null,null,{"$f":"IF(ISBLANK('Program Requirements'!D276),\"\",'Program Requirements'!D276)","v":""},null,null,null,null,null,null,null,null,{"$f":"IF(D254=\"Yes\",('Program Requirements'!G276),\"\")","v":""},{"$f":"IF(D254=\"Yes\",('Program Requirements'!L276),\"\")","v":""},{"$f":"IF(ISBLANK('Program Requirements'!M276),\"\",'Program Requirements'!M276)","v":{"$error":"#DIV/0!"}},{"$error":"#DIV/0!"},null,{"$error":"#DIV/0!"},null,null,null,{"$error":"#DIV/0!"},null,""]
["Page 48"]

{"sheet":"Private School","index":7,"n_rows":79,"n_cols":21,"rows_kept":79,"cut":false,"hidden":false,"merged":[[45,11,45,19],[20,0,20,20],[78,0,78,20],[75,17,75,19],[68,1,68,5],[68,6,68,7],[68,8,68,10],[68,11,68,16],[69,1,69,5],[69,6,69,7],[69,8,69,10],[69,11,69,16],[77,0,77,20],[70,1,70,5],[70,6,70,7],[70,8,70,10],[70,11,70,16],[71,1,71,5],[71,6,71,7],[71,8,71,10],[71,11,71,16],[72,1,72,5],[72,6,72,7],[72,8,72,10],[72,11,72,16],[73,1,73,5],[65,1,65,5],[65,6,65,7],[65,8,65,10],[65,11,65,16],[66,1,66,5],[66,6,66,7],[66,8,66,10],[66,11,66,16],[67,1,67,5],[67,6,67,7],[67,8,67,10],[67,11,67,16],[73,6,73,7],[73,8,73,10],[73,11,73,16],[1,0,1,20],[3,0,3,20],[9,0,10,20],[23,1,23,10],[24,1,24,10],[25,1,25,10],[26,1,26,10],[27,1,27,10],[15,13,15,19],[23,11,23,19],[24,11,24,19],[17,10,17,11],[18,10,18,11],[19,10,19,11],[25,11,25,19],[26,11,26,19],[27,11,27,19],[21,0,21,20],[19,0,19,9],[18,0,18,9],[17,0,17,9],[31,1,31,10],[31,11,31,19],[66,17,66,19],[67,17,67,19],[68,17,68,19],[69,17,69,19],[70,17,70,19],[71,17,71,19],[72,17,72,19],[60,11,60,16],[61,1,61,5],[64,17,64,19],[55,1,55,5],[55,6,55,7],[55,8,55,10],[55,11,55,16],[56,1,56,5],[56,6,56,7],[56,8,56,10],[56,11,56,16],[61,6,61,7],[61,8,61,10],[61,11,61,16],[62,1,62,5],[73,17,73,19],[74,17,74,19],[65,17,65,19],[28,1,28,10],[29,1,29,10],[30,1,30,10],[52,17,52,19],[53,17,53,19],[57,17,57,19],[58,17,58,19],[50,0,50,20],[52,20,52,21],[53,20,53,21],[54,17,54,19],[55,17,55,19],[56,17,56,19],[63,17,63,19],[62,17,62,19],[59,17,59,19],[60,17,60,19],[61,17,61,19],[60,1,60,5],[60,6,60,7],[60,8,60,10],[62,6,62,7],[62,8,62,10],[62,11,62,16],[63,1,63,5],[63,6,63,7],[63,8,63,10],[63,11,63,16],[64,1,64,5],[64,6,64,7],[64,8,64,10],[64,11,64,16],[54,11,54,16],[52,11,52,16],[53,11,53,16],[41,1,41,10],[42,1,42,10],[43,1,43,10],[36,1,36,10],[37,1,37,10],[38,1,38,10],[39,1,39,10],[40,1,40,10],[52,8,52,10],[53,8,53,10],[52,1,52,5],[53,1,53,5],[52,6,52,7],[53,6,53,7],[54,1,54,5],[54,6,54,7],[54,8,54,10],[47,0,47,20],[44,1,44,10],[44,11,44,19],[45,1,45,10],[57,11,57,16],[58,1,58,5],[58,6,58,7],[58,8,58,10],[58,11,58,16],[59,1,59,5],[59,6,59,7],[59,8,59,10],[59,11,59,16],[74,1,74,5],[74,6,74,7],[74,8,74,10],[74,11,74,16],[75,1,75,7],[75,8,75,10],[75,11,75,16],[28,11,28,19],[29,11,29,19],[30,11,30,19],[43,11,43,19],[42,11,42,19],[41,11,41,19],[40,11,40,19],[39,11,39,19],[38,11,38,19],[37,11,37,19],[36,11,36,19],[34,0,34,16383],[32,1,32,10],[32,11,32,19],[57,1,57,5],[57,6,57,7],[57,8,57,10]]}
[null,null,null,null,"School Division:",null,{"$f":"'Narrative & Detail Budget'!$A$15","v":"ALBEMARLE COUNTY PUBLIC SCHOOLS"},null,null,null,null,null,null,null,"Division Number:",null,null,null,null,null,{"$f":"'Narrative & Detail Budget'!$I$15","v":2}]
["R.  PRIVATE SCHOOL PARTICIPATION"]
[]
["Each year, the school division must contact all eligible private (nonprofit) schools and engage in meaningful consultation on the availability of equitable services funded by Title I, Part A. (ESEA Section 1117(a) and Title VIII  Uniform Provisions, Part F, Subpart 1)."]
["1. Are there private nonprofit schools which students residing within the Title I attendance zone attend?"]
[null,"X","Yes (If yes, complete the remainder of this page.)",null,null,null,null,null,null,null,"No (If no, it is not necessary to complete the rest of this page.)"]
[]
[null,null,null,null,null,null,null,null,null,null,"No (If division participated in the bypass)"]
[]
["2. Place an \"X\" in the appropriate block(s) to indicate how private schools were notified of the availability of equitable services funded by Title I, Part A. (Copies of the notification must be kept on file for monitoring purposes.)"]
[]
[null,null,"Regular Mail",null,null,null,null,null,null,"X","Certified Mail"]
[]
[null,null,"Telephone Calls",null,null,null,null,null,null,"X","Meetings"]
[]
[null,null,"Visits to the Private School",null,null,null,null,null,null,"X","Other (Please specify)",null,null,"Email, Zoom Meetings"]
[]
["3. Number of Public School Low-Income Children in Title I Schools",null,null,null,null,null,null,null,null,null,{"$f":"IF('Below 35% Low-Income'!O53>0,'Below 35% Low-Income'!O53,'35% and Above Low-Income'!O53)","v":1612}]
["4. Number of Private School Low-Income Children Residing in Title I Attendance Zones",null,null,null,null,null,null,null,null,null,{"$f":"IF('35% and Above Low-Income'!N53>0,'35% and Above Low-Income'!N53,'Below 35% Low-Income'!N53)","v":10}]
["5.  Percentage used to determine  proportionate share for  equitable services.",null,null,null,null,null,null,null,null,null,{"$f":"K19/(K19+K18)","v":6.1652281134401974E-3}]
[]
["6. Determining Set-Asides (These fields will calculate automatically once enrollment figures have been entered.)"]
[]
[null,"a. Total Title I, Part A Allocation ",null,null,null,null,null,null,null,null,null,{"$f":"'Narrative & Detail Budget'!N44","v":1494988}]
[null,"b1. Proportionate share of Title I funds available to provide equitable services - 35% and Above Low-Income",null,null,null,null,null,null,null,null,null,{"$f":"L24*'35% and Above Low-Income'!Z53","v":9216.9420468557346}]
[null,"b2. Proportionate share of Title I funds available to provide equitable services - Below 35% Low-Income",null,null,null,null,null,null,null,null,null,{"$f":"L24*'Below 35% Low-Income'!Z53","v":{"$error":"#DIV/0!"}}]
[null,"c1. Amount of funds for 1% for parent and family engagement\n(If LEA’s Title I allocation exceeds $500,000) - 35% and Above Low-Income",null,null,null,null,null,null,null,null,null,{"$f":"(L24*0.01)*'35% and Above Low-Income'!Z53","v":92.169420468557348}]
[null,"c2. Amount of funds for 1% for parent and family engagement\n(If LEA’s Title I allocation exceeds $500,000) - Below 35% Low-Income",null,null,null,null,null,null,null,null,null,{"$f":"(L24*0.01)*'Below 35% Low-Income'!Z53","v":{"$error":"#DIV/0!"}}]
[null,"d. School Division Admin set-aside (Optional)"]
[null,"e1. Total  Private School Set-Aside  for  Non-Administration - 35% and Above Low-Income",null,null,null,null,null,null,null,null,null,{"$f":"IF(L25>0,L25-L29,0)","v":9216.9420468557346}]
[null,"e2. Total  Private School Set-Aside  for  Non-Administration - Below 35% Low-Income",null,null,null,null,null,null,null,null,null,{"$f":"IF(L26>0,L26-L29,0)","v":{"$error":"#DIV/0!"}}]
[null,"Has the required private school set-aside been met? -  35% and Above Low-Income",null,null,null,null,null,null,null,null,null,{"$f":"IF(SUM('Budget Summary'!G45:K45)>=SUM(L25),\"Yes\",\"No - please review your entries.\")","v":"No - please review your entries."}]
[null,"Has the required private school set-aside been met? - Below 35% Low-Income",null,null,null,null,null,null,null,null,null,{"$f":"IF(SUM('Budget Summary'!G45:K45)>=SUM(L26),\"Yes\",\"No - please review your entries.\")","v":{"$error":"#DIV/0!"}}]
[]
["7. Determining additional set-asides as a result of Transferability. These fields will calculate automatically once budget and enrollment figures have been entered."]
[]
[null,"a. Total Title I, Part A Transferability",null,null,null,null,null,null,null,null,null,{"$f":"SUM(Transferability!D13+Transferability!E13)","v":0}]
[null,"b1. Proportionate share of Title I funds available to provide equitable services - 35% and Above Low-Income",null,null,null,null,null,null,null,null,null,{"$f":"L37*'35% and Above Low-Income'!Z53","v":0}]
[null,"b2. Proportionate share of Title I funds available to provide equitable services - Below 35% Low-Income",null,null,null,null,null,null,null,null,null,{"$f":"L37*'Below 35% Low-Income'!Z53","v":{"$error":"#DIV/0!"}}]
[null,"c1. Amount of funds for 1% for parent and family engagement\n(If LEA’s Title I allocation exceeds $500,000) - 35% and Above Low-Income",null,null,null,null,null,null,null,null,null,{"$f":"(L37*0.01)*'35% and Above Low-Income'!Z53","v":0}]
[null,"c2. Amount of funds for 1% for parent and family engagement\n(If LEA’s Title I allocation exceeds $500,000) - Below 35% Low-Income",null,null,null,null,null,null,null,null,null,{"$f":"(L37*0.01)*'Below 35% Low-Income'!Z53","v":{"$error":"#DIV/0!"}}]
[null,"d. School Division Admin set-aside (Optional)"]
[null,"e1. Total  Private School Set-Aside  for  Non-Administration - 35% and Above Low-Income",null,null,null,null,null,null,null,null,null,{"$f":"IF(L38>0,L38-L42,0)","v":0}]
[null,"e2. Total  Private School Set-Aside  for  Non-Administration - Below 35% Low-Income",null,null,null,null,null,null,null,null,null,{"$f":"IF(L39>0,L39-L42,0)","v":{"$error":"#DIV/0!"}}]
[null,"Has the required private school set-aside been met? -  35% and Above Low-Income",null,null,null,null,null,null,null,null,null,{"$f":"IF(SUM(Transferability!D59:E59)>=SUM(L38),\"Yes\",\"No - please review your entries.\")","v":"Yes"}]
[null,"Has the required private school set-aside been met? - Below 35% Low-Income",null,null,null,null,null,null,null,null,null,{"$f":"IF(SUM(Transferability!D59:E59)>=SUM(L39),\"Yes\",\"No - please review your entries.\")","v":{"$error":"#DIV/0!"}}]
[]
["Page 49"]
[null,null,null,null,"School Division:",null,{"$f":"'Narrative & Detail Budget'!$A$15","v":"ALBEMARLE COUNTY PUBLIC SCHOOLS"},null,null,null,null,null,null,null,"Division Number:",null,null,null,null,null,{"$f":"'Narrative & Detail Budget'!$I$15","v":2}]
[]
["8. Complete the chart below:\n• In Column A, list all private schools which students residing within the Title I attendance zone attend.\n• In Column C, enter the number of students in private schools participating in services for the 2020-2021 award year.  \n• In Column D, enter the description of services provided for participating children.\n• In Column E, enter the amount of funds obligated to support eligible students."]
[]
[null,"A",null,null,null,null,"B",null,"C",null,null,"D"]
[null," Private Schools",null,null,null,null,"Participation Status for 2020-2021 Award Year?\n(Yes/No)  ",null,"Number of \nParticipating Children",null,null,"Description of Services"]
[null,"Charlottesville Catholic School",null,null,null,null,"No"]
[null,"Charlottesville Waldorf School",null,null,null,null,"No"]
[null,"Community Christian Academy",null,null,null,null,"Yes",null,3,null,null,"Tutoring (reading), Professional Development"]
[null,"The Covenant School",null,null,null,null,"No"]
[null,"Free Union Country School",null,null,null,null,"No"]
[null,"Little Keswick School",null,null,null,null,"No"]
[null,"Miller School of Albemarle",null,null,null,null,"No"]
[null,"Tandem Friends School",null,null,null,null,"No"]
[null,"University Montessori School",null,null,null,null,"No"]
[null,"Mountaintop Montessori School",null,null,null,null,"No"]
[null,"Peabody School",null,null,null,null,"No"]
[null,"Field School of Charlottesville",null,null,null,null,"No"]
[null,"St. Anne's Belfield School",null,null,null,null,"No"]
[]
[]
[]
[]
[]
[]
[]
[]
[null,"Total Identified Students",null,null,null,null,null,null,{"$f":"SUM(I55:J75)","v":3}]
[]
["9. Enter the private school services set-aside in the detailed budget description and Budget Summary.  "]
["Page 50"]

{"sheet":"School Improvement","index":8,"n_rows":17,"n_cols":16,"rows_kept":17,"cut":false,"hidden":false,"merged":[[0,3,0,5],[1,0,1,15],[3,0,3,15],[5,0,5,15],[16,0,16,15],[15,0,15,15],[7,0,7,15],[13,0,13,15],[9,0,9,15],[11,0,11,15],[8,0,8,15],[14,0,14,15]]}
[null,null,null,"School Division:",null,null,{"$f":"'Narrative & Detail Budget'!A15","v":"ALBEMARLE COUNTY PUBLIC SCHOOLS"},null,null,null,null,null,"Division Number:",null,null,{"$f":"'Narrative & Detail Budget'!I15","v":2}]
["S.  NARRATIVE:  SCHOOL IMPROVEMENT"]
[]
["This section should only be completed if the school division has schools identified for Comprehensive Support and Improvement or Targeted Support and Improvement.   "]
[]
["Comprehensive Support and Improvement"]
[]
["Describe how the local educational agency will carry out its responsibilities under Section 1111(d)(1)."]
["NA"]
[]
[]
["Targeted or Additional Targeted Support and Improvement"]
[]
["Describe how the local educational agency will carry out its responsibilities under Section 1111(d)(2)."]
["NA"]
[]
["Page 51"]

{"sheet":"Skipped School Provision","index":9,"n_rows":16,"n_cols":16,"rows_kept":16,"cut":false,"hidden":false,"merged":[[15,0,15,15],[1,0,1,15],[4,0,4,15],[11,5,11,11],[9,0,9,15],[13,0,13,15],[2,0,2,15],[7,0,7,15],[3,0,3,15],[12,0,12,15],[5,0,5,15]]}
[null,null,null,null,"School Division:",null,{"$f":"'Narrative & Detail Budget'!$A$15","v":"ALBEMARLE COUNTY PUBLIC SCHOOLS"},null,null,null,null,null,"Division Number:",null,null,{"$f":"'Narrative & Detail Budget'!$I$15","v":2}]
["T.  SKIPPED SCHOOL PROVISION"]
[]
["If on the Allocation to Eligible Schools a school was \"skipped\" that was eligible for Title I under the Eligible Attendance area you selected, provide the name(s) of the school in the box below."]
["NA"]
["The criteria for the skipped school provision can be found in the guidelines, instructions, and assurances document on page 13."]
[]
["Did the school(s) meet the criteria for skipped schools provision and the division allocates to the skipped schools the amount of funding the schools would have received were they served under Title I, Part A?"]
[]
["Place an \"X\" in the appropriate yes or no box."]
[]
[null,null,"Yes ",null,null,"No "]
["If yes, explain how the provision was met in the section below. If no, explain why the school was skipped in the section below."]
[]
[]
["Page 52"]

{"sheet":"Neglected","index":10,"n_rows":35,"n_cols":16,"rows_kept":35,"cut":false,"hidden":false,"merged":[[29,0,29,15],[5,0,5,4],[14,0,14,7],[14,8,14,15],[15,0,15,15],[25,0,25,15],[11,0,11,15],[21,0,21,15],[22,0,22,15],[23,0,23,15],[24,0,24,15],[28,0,28,15],[34,0,34,15],[9,1,9,15],[20,0,20,15],[1,0,1,15],[3,0,3,15],[5,5,5,15],[7,1,7,15],[18,0,18,15],[19,0,19,15],[10,0,10,15],[8,0,8,15],[12,0,12,7],[12,8,12,15],[13,0,13,7],[13,8,13,15],[31,0,31,15]]}
[null,null,null,null,"School Division:",null,{"$f":"'Narrative & Detail Budget'!$A$15","v":"ALBEMARLE COUNTY PUBLIC SCHOOLS"},null,null,null,null,null,"Division Number:",null,null,{"$f":"'Narrative & Detail Budget'!$I$15","v":2}]
["U.  TITLE I, PART A, NEGLECTED CHILDREN AND YOUTH"]
[]
["All school divisions must complete this page."]
[]
["Title I, Part D Coordinator",null,null,null,null,"Sharon Root"]
[]
[{"$f":"VLOOKUP($P$1,Prefills!$BK$3:$BL$138,2)","v":0},"Total number of children and youth who are identified as neglected (year-to-date) for 2019-2020 based on the definition in Title I, Part D Section 1432(4)(A). (automatically populates)\n\n"]
["School divisions that have facilities that report one or more neglected students in the most recently submitted Title I, Part D, October Count under the neglected column must complete this tab. Please refer to the Guidelines, Instructions, and Assurances for more information.\n"]
[null,"Check here if the local neglected facility has declined services.  If this box is checked, the remaining items in this tab should be left blank."]
["\n\nA local educational agency shall reserve such funds as are necessary under this part to provide services comparable to those provided to children in schools funded under Title I, Part A, to serve\n(ii) children in local institutions for neglected children; and \n(iii) if appropriate, children in local institutions for delinquent children, and neglected or delinquent children in community day school programs. Section 1007(3)(A)\n\nThe funds set aside from a LEA’s Title I, Part A allocation may be used:\n (1) to improve educational services for children and youth in local and state institutions for neglected or delinquent children and youth so that such children and youth have the opportunity to meet the same challenging state academic content standards and challenging State student academic achievement standards that all children in the state are expected to meet;\n(2) to provide such children and youth with the services needed to make a successful transition from institutionalization to further schooling or employment; and\n(3) to prevent at-risk youth from dropping out of school, and to provide dropouts, and children and youth returning from correctional facilities or institutions for neglected or delinquent children and youth, with a support system to ensure their continued education. Section 1401 (3)(A)\n"]
["Provide the name of the participating local neglecged facilities and the location of the educational services provided to the students."]
["Neglected Facility Name",null,null,null,null,null,null,null,"Location of Educational Services"]
[]
[]
["Page 53"]
[null,null,null,null,"School Division:",null,{"$f":"'Narrative & Detail Budget'!$A$15","v":"ALBEMARLE COUNTY PUBLIC SCHOOLS"},null,null,null,null,null,"Division Number:",null,null,{"$f":"'Narrative & Detail Budget'!$I$15","v":2}]
[]
["1. Describe the needs of the neglected students served identified during the needs assessment process.  Include a brief summary of the needs assessment process and how services are coordinated with the neglected facilities or programs."]
[]
[]
["2. Describe the activities that will be implemented to address the identified need(s). Include the following information for each activity listed:\na. Describe the facility and/or population that will be served.\nb. Describe each specific activity that will be implemented based on data analysis of neglected/delinquent children in local institutions or at-risk programs.\nc. Describe how the funds will be distributed to benefit neglected children being served.\n\n"]
[]
["3. Describe how Title I, Part A, set-aside neglected funds are coordinated with the Title I, Part D, Subpart 2, subgrants, if the division also receives those funds, as well as coordination with other federal, state, and local programs serving at-risk children and youth.  "]
[]
["Page 54"]
[null,null,null,null,"School Division:",null,{"$f":"'Narrative & Detail Budget'!$A$15","v":"ALBEMARLE COUNTY PUBLIC SCHOOLS"},null,null,null,null,null,"Division Number:",null,null,{"$f":"'Narrative & Detail Budget'!$I$15","v":2}]
[]
["4. Describe the process the LEA will use to evaluate the effectiveness of the activities implemented to address the described needs."]
[]
[]
["Guidance related to services for neglected and delinquent students can be found on Virginia’s Title I, Part D, website at http://www.doe.virginia.gov/federal_programs/esea/title1/part_d/index.shtml or by contacting Tiffany Frierson, Virginia’s Title I, Part D Coordinator at Tiffany.Frierson@doe.virginia.gov or 804-371-2682."]
[]
[]
["Page 55"]

{"sheet":"Homeless","index":11,"n_rows":24,"n_cols":16,"rows_kept":24,"cut":false,"hidden":false,"merged":[[22,0,22,15],[23,0,23,15],[15,0,15,15],[16,0,16,15],[17,0,17,15],[18,0,18,15],[19,0,19,15],[20,0,20,15],[13,16304,13,16319],[13,16320,13,16335],[13,16336,13,16351],[13,16352,13,16367],[13,16368,13,16383],[14,0,14,15],[13,16208,13,16223],[13,16224,13,16239],[13,16240,13,16255],[13,16256,13,16271],[13,16272,13,16287],[13,16288,13,16303],[13,16112,13,16127],[13,16128,13,16143],[13,16144,13,16159],[13,16160,13,16175],[13,16176,13,16191],[13,16192,13,16207],[13,16016,13,16031],[13,16032,13,16047],[13,16048,13,16063],[13,16064,13,16079],[13,16080,13,16095],[13,16096,13,16111],[13,15920,13,15935],[13,15936,13,15951],[13,15952,13,15967],[13,15968,13,15983],[13,15984,13,15999],[13,16000,13,16015],[13,15824,13,15839],[13,15840,13,15855],[13,15856,13,15871],[13,15872,13,15887],[13,15888,13,15903],[13,15904,13,15919],[13,15728,13,15743],[13,15744,13,15759],[13,15760,13,15775],[13,15776,13,15791],[13,15792,13,15807],[13,15808,13,15823],[13,15632,13,15647],[13,15648,13,15663],[13,15664,13,15679],[13,15680,13,15695],[13,15696,13,15711],[13,15712,13,15727],[13,15536,13,15551],[13,15552,13,15567],[13,15568,13,15583],[13,15584,13,15599],[13,15600,13,15615],[13,15616,13,15631],[13,15440,13,15455],[13,15456,13,15471],[13,15472,13,15487],[13,15488,13,15503],[13,15504,13,15519],[13,15520,13,15535],[13,15344,13,15359],[13,15360,13,15375],[13,15376,13,15391],[13,15392,13,15407],[13,15408,13,15423],[13,15424,13,15439],[13,15248,13,15263],[13,15264,13,15279],[13,15280,13,15295],[13,15296,13,15311],[13,15312,13,15327],[13,15328,13,15343],[13,15152,13,15167],[13,15168,13,15183],[13,15184,13,15199],[13,15200,13,15215],[13,15216,13,15231],[13,15232,13,15247],[13,15056,13,15071],[13,15072,13,15087],[13,15088,13,15103],[13,15104,13,15119],[13,15120,13,15135],[13,15136,13,15151],[13,14960,13,14975],[13,14976,13,14991],[13,14992,13,15007],[13,15008,13,15023],[13,15024,13,15039],[13,15040,13,15055],[13,14864,13,14879],[13,14880,13,14895],[13,14896,13,14911],[13,14912,13,14927],[13,14928,13,14943],[13,14944,13,14959],[13,14768,13,14783],[13,14784,13,14799],[13,14800,13,14815],[13,14816,13,14831],[13,14832,13,14847],[13,14848,13,14863],[13,14672,13,14687],[13,14688,13,14703],[13,14704,13,14719],[13,14720,13,14735],[13,14736,13,14751],[13,14752,13,14767],[13,14576,13,14591],[13,14592,13,14607],[13,14608,13,14623],[13,14624,13,14639],[13,14640,13,14655],[13,14656,13,14671],[13,14480,13,14495],[13,14496,13,14511],[13,14512,13,14527],[13,14528,13,14543],[13,14544,13,14559],[13,14560,13,14575],[13,14384,13,14399],[13,14400,13,14415],[13,14416,13,14431],[13,14432,13,14447],[13,14448,13,14463],[13,14464,13,14479],[13,14288,13,14303],[13,14304,13,14319],[13,14320,13,14335],[13,14336,13,14351],[13,14352,13,14367],[13,14368,13,14383],[13,14192,13,14207],[13,14208,13,14223],[13,14224,13,14239],[13,14240,13,14255],[13,14256,13,14271],[13,14272,13,14287],[13,14096,13,14111],[13,14112,13,14127],[13,14128,13,14143],[13,14144,13,14159],[13,14160,13,14175],[13,14176,13,14191],[13,14000,13,14015],[13,14016,13,14031],[13,14032,13,14047],[13,14048,13,14063],[13,14064,13,14079],[13,14080,13,14095],[13,13904,13,13919],[13,13920,13,13935],[13,13936,13,13951],[13,13952,13,13967],[13,13968,13,13983],[13,13984,13,13999],[13,13808,13,13823],[13,13824,13,13839],[13,13840,13,13855],[13,13856,13,13871],[13,13872,13,13887],[13,13888,13,13903],[13,13712,13,13727],[13,13728,13,13743],[13,13744,13,13759],[13,13760,13,13775],[13,13776,13,13791],[13,13792,13,13807],[13,13616,13,13631],[13,13632,13,13647],[13,13648,13,13663],[13,13664,13,13679],[13,13680,13,13695],[13,13696,13,13711],[13,13520,13,13535],[13,13536,13,13551],[13,13552,13,13567],[13,13568,13,13583],[13,13584,13,13599],[13,13600,13,13615],[13,13424,13,13439],[13,13440,13,13455],[13,13456,13,13471],[13,13472,13,13487],[13,13488,13,13503],[13,13504,13,13519],[13,13328,13,13343],[13,13344,13,13359],[13,13360,13,13375],[13,13376,13,13391],[13,13392,13,13407],[13,13408,13,13423],[13,13232,13,13247],[13,13248,13,13263],[13,13264,13,13279],[13,13280,13,13295],[13,13296,13,13311],[13,13312,13,13327],[13,13136,13,13151],[13,13152,13,13167],[13,13168,13,13183],[13,13184,13,13199],[13,13200,13,13215],[13,13216,13,13231],[13,13040,13,13055],[13,13056,13,13071],[13,13072,13,13087],[13,13088,13,13103],[13,13104,13,13119],[13,13120,13,13135],[13,12944,13,12959],[13,12960,13,12975],[13,12976,13,12991],[13,12992,13,13007],[13,13008,13,13023],[13,13024,13,13039],[13,12848,13,12863],[13,12864,13,12879],[13,12880,13,12895],[13,12896,13,12911],[13,12912,13,12927],[13,12928,13,12943],[13,12752,13,12767],[13,12768,13,12783],[13,12784,13,12799],[13,12800,13,12815],[13,12816,13,12831],[13,12832,13,12847],[13,12656,13,12671],[13,12672,13,12687],[13,12688,13,12703],[13,12704,13,12719],[13,12720,13,12735],[13,12736,13,12751],[13,12560,13,12575],[13,12576,13,12591],[13,12592,13,12607],[13,12608,13,12623],[13,12624,13,12639],[13,12640,13,12655],[13,12464,13,12479],[13,12480,13,12495],[13,12496,13,12511],[13,12512,13,12527],[13,12528,13,12543],[13,12544,13,12559],[13,12368,13,12383],[13,12384,13,12399],[13,12400,13,12415],[13,12416,13,12431],[13,12432,13,12447],[13,12448,13,12463],[13,12272,13,12287],[13,12288,13,12303],[13,12304,13,12319],[13,12320,13,12335],[13,12336,13,12351],[13,12352,13,12367],[13,12176,13,12191],[13,12192,13,12207],[13,12208,13,12223],[13,12224,13,12239],[13,12240,13,12255],[13,12256,13,12271],[13,12080,13,12095],[13,12096,13,12111],[13,12112,13,12127],[13,12128,13,12143],[13,12144,13,12159],[13,12160,13,12175],[13,11984,13,11999],[13,12000,13,12015],[13,12016,13,12031],[13,12032,13,12047],[13,12048,13,12063],[13,12064,13,12079],[13,11888,13,11903],[13,11904,13,11919],[13,11920,13,11935],[13,11936,13,11951],[13,11952,13,11967],[13,11968,13,11983],[13,11792,13,11807],[13,11808,13,11823],[13,11824,13,11839],[13,11840,13,11855],[13,11856,13,11871],[13,11872,13,11887],[13,11696,13,11711],[13,11712,13,11727],[13,11728,13,11743],[13,11744,13,11759],[13,11760,13,11775],[13,11776,13,11791],[13,11600,13,11615],[13,11616,13,11631],[13,11632,13,11647],[13,11648,13,11663],[13,11664,13,11679],[13,11680,13,11695],[13,11504,13,11519],[13,11520,13,11535],[13,11536,13,11551],[13,11552,13,11567],[13,11568,13,11583],[13,11584,13,11599],[13,11408,13,11423],[13,11424,13,11439],[13,11440,13,11455],[13,11456,13,11471],[13,11472,13,11487],[13,11488,13,11503],[13,11312,13,11327],[13,11328,13,11343],[13,11344,13,11359],[13,11360,13,11375],[13,11376,13,11391],[13,11392,13,11407],[13,11216,13,11231],[13,11232,13,11247],[13,11248,13,11263],[13,11264,13,11279],[13,11280,13,11295],[13,11296,13,11311],[13,11120,13,11135],[13,11136,13,11151],[13,11152,13,11167],[13,11168,13,11183],[13,11184,13,11199],[13,11200,13,11215],[13,11024,13,11039],[13,11040,13,11055],[13,11056,13,11071],[13,11072,13,11087],[13,11088,13,11103],[13,11104,13,11119],[13,10928,13,10943],[13,10944,13,10959],[13,10960,13,10975],[13,10976,13,10991],[13,10992,13,11007],[13,11008,13,11023],[13,10832,13,10847],[13,10848,13,10863],[13,10864,13,10879],[13,10880,13,10895],[13,10896,13,10911],[13,10912,13,10927],[13,10736,13,10751],[13,10752,13,10767],[13,10768,13,10783],[13,10784,13,10799],[13,10800,13,10815],[13,10816,13,10831],[13,10640,13,10655],[13,10656,13,10671],[13,10672,13,10687],[13,10688,13,10703],[13,10704,13,10719],[13,10720,13,10735],[13,10544,13,10559],[13,10560,13,10575],[13,10576,13,10591],[13,10592,13,10607],[13,10608,13,10623],[13,10624,13,10639],[13,10448,13,10463],[13,10464,13,10479],[13,10480,13,10495],[13,10496,13,10511],[13,10512,13,10527],[13,10528,13,10543],[13,10352,13,10367],[13,10368,13,10383],[13,10384,13,10399],[13,10400,13,10415],[13,10416,13,10431],[13,10432,13,10447],[13,10256,13,10271],[13,10272,13,10287],[13,10288,13,10303],[13,10304,13,10319],[13,10320,13,10335],[13,10336,13,10351],[13,10160,13,10175],[13,10176,13,10191],[13,10192,13,10207],[13,10208,13,10223],[13,10224,13,10239],[13,10240,13,10255],[13,10064,13,10079],[13,10080,13,10095],[13,10096,13,10111],[13,10112,13,10127],[13,10128,13,10143],[13,10144,13,10159],[13,9968,13,9983],[13,9984,13,9999],[13,10000,13,10015],[13,10016,13,10031],[13,10032,13,10047],[13,10048,13,10063],[13,9872,13,9887],[13,9888,13,9903],[13,9904,13,9919],[13,9920,13,9935],[13,9936,13,9951],[13,9952,13,9967],[13,9776,13,9791],[13,9792,13,9807],[13,9808,13,9823],[13,9824,13,9839],[13,9840,13,9855],[13,9856,13,9871],[13,9680,13,9695],[13,9696,13,9711],[13,9712,13,9727],[13,9728,13,9743],[13,9744,13,9759],[13,9760,13,9775],[13,9584,13,9599],[13,9600,13,9615],[13,9616,13,9631],[13,9632,13,9647],[13,9648,13,9663],[13,9664,13,9679],[13,9488,13,9503],[13,9504,13,9519],[13,9520,13,9535],[13,9536,13,9551],[13,9552,13,9567],[13,9568,13,9583],[13,9392,13,9407],[13,9408,13,9423],[13,9424,13,9439],[13,9440,13,9455],[13,9456,13,9471],[13,9472,13,9487],[13,9296,13,9311],[13,9312,13,9327],[13,9328,13,9343],[13,9344,13,9359],[13,9360,13,9375],[13,9376,13,9391],[13,9200,13,9215],[13,9216,13,9231],[13,9232,13,9247],[13,9248,13,9263],[13,9264,13,9279],[13,9280,13,9295],[13,9104,13,9119],[13,9120,13,9135],[13,9136,13,9151],[13,9152,13,9167],[13,9168,13,9183],[13,9184,13,9199],[13,9008,13,9023],[13,9024,13,9039],[13,9040,13,9055],[13,9056,13,9071],[13,9072,13,9087],[13,9088,13,9103],[13,8912,13,8927],[13,8928,13,8943],[13,8944,13,8959],[13,8960,13,8975],[13,8976,13,8991],[13,8992,13,9007],[13,8816,13,8831],[13,8832,13,8847],[13,8848,13,8863],[13,8864,13,8879],[13,8880,13,8895],[13,8896,13,8911],[13,8720,13,8735],[13,8736,13,8751],[13,8752,13,8767],[13,8768,13,8783],[13,8784,13,8799],[13,8800,13,8815],[13,8624,13,8639],[13,8640,13,8655],[13,8656,13,8671],[13,8672,13,8687],[13,8688,13,8703],[13,8704,13,8719],[13,8528,13,8543],[13,8544,13,8559],[13,8560,13,8575],[13,8576,13,8591],[13,8592,13,8607],[13,8608,13,8623],[13,8432,13,8447],[13,8448,13,8463],[13,8464,13,8479],[13,8480,13,8495],[13,8496,13,8511],[13,8512,13,8527],[13,8336,13,8351],[13,8352,13,8367],[13,8368,13,8383],[13,8384,13,8399],[13,8400,13,8415],[13,8416,13,8431],[13,8240,13,8255],[13,8256,13,8271],[13,8272,13,8287],[13,8288,13,8303],[13,8304,13,8319],[13,8320,13,8335],[13,8144,13,8159],[13,8160,13,8175],[13,8176,13,8191],[13,8192,13,8207],[13,8208,13,8223],[13,8224,13,8239],[13,8048,13,8063],[13,8064,13,8079],[13,8080,13,8095],[13,8096,13,8111],[13,8112,13,8127],[13,8128,13,8143],[13,7952,13,7967],[13,7968,13,7983],[13,7984,13,7999],[13,8000,13,8015],[13,8016,13,8031],[13,8032,13,8047],[13,7856,13,7871],[13,7872,13,7887],[13,7888,13,7903],[13,7904,13,7919],[13,7920,13,7935],[13,7936,13,7951],[13,7760,13,7775],[13,7776,13,7791],[13,7792,13,7807],[13,7808,13,7823],[13,7824,13,7839],[13,7840,13,7855],[13,7664,13,7679],[13,7680,13,7695],[13,7696,13,7711],[13,7712,13,7727],[13,7728,13,7743],[13,7744,13,7759],[13,7568,13,7583],[13,7584,13,7599],[13,7600,13,7615],[13,7616,13,7631],[13,7632,13,7647],[13,7648,13,7663],[13,7472,13,7487],[13,7488,13,7503],[13,7504,13,7519],[13,7520,13,7535],[13,7536,13,7551],[13,7552,13,7567],[13,7376,13,7391],[13,7392,13,7407],[13,7408,13,7423],[13,7424,13,7439],[13,7440,13,7455],[13,7456,13,7471],[13,7280,13,7295],[13,7296,13,7311],[13,7312,13,7327],[13,7328,13,7343],[13,7344,13,7359],[13,7360,13,7375],[13,7184,13,7199],[13,7200,13,7215],[13,7216,13,7231],[13,7232,13,7247],[13,7248,13,7263],[13,7264,13,7279],[13,7088,13,7103],[13,7104,13,7119],[13,7120,13,7135],[13,7136,13,7151],[13,7152,13,7167],[13,7168,13,7183],[13,6992,13,7007],[13,7008,13,7023],[13,7024,13,7039],[13,7040,13,7055],[13,7056,13,7071],[13,7072,13,7087],[13,6896,13,6911],[13,6912,13,6927],[13,6928,13,6943],[13,6944,13,6959],[13,6960,13,6975],[13,6976,13,6991],[13,6800,13,6815],[13,6816,13,6831],[13,6832,13,6847],[13,6848,13,6863],[13,6864,13,6879],[13,6880,13,6895],[13,6704,13,6719],[13,6720,13,6735],[13,6736,13,6751],[13,6752,13,6767],[13,6768,13,6783],[13,6784,13,6799],[13,6608,13,6623],[13,6624,13,6639],[13,6640,13,6655],[13,6656,13,6671],[13,6672,13,6687],[13,6688,13,6703],[13,6512,13,6527],[13,6528,13,6543],[13,6544,13,6559],[13,6560,13,6575],[13,6576,13,6591],[13,6592,13,6607],[13,6416,13,6431],[13,6432,13,6447],[13,6448,13,6463],[13,6464,13,6479],[13,6480,13,6495],[13,6496,13,6511],[13,6320,13,6335],[13,6336,13,6351],[13,6352,13,6367],[13,6368,13,6383],[13,6384,13,6399],[13,6400,13,6415],[13,6224,13,6239],[13,6240,13,6255],[13,6256,13,6271],[13,6272,13,6287],[13,6288,13,6303],[13,6304,13,6319],[13,6128,13,6143],[13,6144,13,6159],[13,6160,13,6175],[13,6176,13,6191],[13,6192,13,6207],[13,6208,13,6223],[13,6032,13,6047],[13,6048,13,6063],[13,6064,13,6079],[13,6080,13,6095],[13,6096,13,6111],[13,6112,13,6127],[13,5936,13,5951],[13,5952,13,5967],[13,5968,13,5983],[13,5984,13,5999],[13,6000,13,6015],[13,6016,13,6031],[13,5840,13,5855],[13,5856,13,5871],[13,5872,13,5887],[13,5888,13,5903],[13,5904,13,5919],[13,5920,13,5935],[13,5744,13,5759],[13,5760,13,5775],[13,5776,13,5791],[13,5792,13,5807],[13,5808,13,5823],[13,5824,13,5839],[13,5648,13,5663],[13,5664,13,5679],[13,5680,13,5695],[13,5696,13,5711],[13,5712,13,5727],[13,5728,13,5743],[13,5552,13,5567],[13,5568,13,5583],[13,5584,13,5599],[13,5600,13,5615],[13,5616,13,5631],[13,5632,13,5647],[13,5456,13,5471],[13,5472,13,5487],[13,5488,13,5503],[13,5504,13,5519],[13,5520,13,5535],[13,5536,13,5551],[13,5360,13,5375],[13,5376,13,5391],[13,5392,13,5407],[13,5408,13,5423],[13,5424,13,5439],[13,5440,13,5455],[13,5264,13,5279],[13,5280,13,5295],[13,5296,13,5311],[13,5312,13,5327],[13,5328,13,5343],[13,5344,13,5359],[13,5168,13,5183],[13,5184,13,5199],[13,5200,13,5215],[13,5216,13,5231],[13,5232,13,5247],[13,5248,13,5263],[13,5072,13,5087],[13,5088,13,5103],[13,5104,13,5119],[13,5120,13,5135],[13,5136,13,5151],[13,5152,13,5167],[13,4976,13,4991],[13,4992,13,5007],[13,5008,13,5023],[13,5024,13,5039],[13,5040,13,5055],[13,5056,13,5071],[13,4880,13,4895],[13,4896,13,4911],[13,4912,13,4927],[13,4928,13,4943],[13,4944,13,4959],[13,4960,13,4975],[13,4784,13,4799],[13,4800,13,4815],[13,4816,13,4831],[13,4832,13,4847],[13,4848,13,4863],[13,4864,13,4879],[13,4688,13,4703],[13,4704,13,4719],[13,4720,13,4735],[13,4736,13,4751],[13,4752,13,4767],[13,4768,13,4783],[13,4592,13,4607],[13,4608,13,4623],[13,4624,13,4639],[13,4640,13,4655],[13,4656,13,4671],[13,4672,13,4687],[13,4496,13,4511],[13,4512,13,4527],[13,4528,13,4543],[13,4544,13,4559],[13,4560,13,4575],[13,4576,13,4591],[13,4400,13,4415],[13,4416,13,4431],[13,4432,13,4447],[13,4448,13,4463],[13,4464,13,4479],[13,4480,13,4495],[13,4304,13,4319],[13,4320,13,4335],[13,4336,13,4351],[13,4352,13,4367],[13,4368,13,4383],[13,4384,13,4399],[13,4208,13,4223],[13,4224,13,4239],[13,4240,13,4255],[13,4256,13,4271],[13,4272,13,4287],[13,4288,13,4303],[13,4112,13,4127],[13,4128,13,4143],[13,4144,13,4159],[13,4160,13,4175],[13,4176,13,4191],[13,4192,13,4207],[13,4016,13,4031],[13,4032,13,4047],[13,4048,13,4063],[13,4064,13,4079],[13,4080,13,4095],[13,4096,13,4111],[13,3920,13,3935],[13,3936,13,3951],[13,3952,13,3967],[13,3968,13,3983],[13,3984,13,3999],[13,4000,13,4015],[13,3824,13,3839],[13,3840,13,3855],[13,3856,13,3871],[13,3872,13,3887],[13,3888,13,3903],[13,3904,13,3919],[13,3728,13,3743],[13,3744,13,3759],[13,3760,13,3775],[13,3776,13,3791],[13,3792,13,3807],[13,3808,13,3823],[13,3632,13,3647],[13,3648,13,3663],[13,3664,13,3679],[13,3680,13,3695],[13,3696,13,3711],[13,3712,13,3727],[13,3536,13,3551],[13,3552,13,3567],[13,3568,13,3583],[13,3584,13,3599],[13,3600,13,3615],[13,3616,13,3631],[13,3440,13,3455],[13,3456,13,3471],[13,3472,13,3487],[13,3488,13,3503],[13,3504,13,3519],[13,3520,13,3535],[13,3344,13,3359],[13,3360,13,3375],[13,3376,13,3391],[13,3392,13,3407],[13,3408,13,3423],[13,3424,13,3439],[13,3248,13,3263],[13,3264,13,3279],[13,3280,13,3295],[13,3296,13,3311],[13,3312,13,3327],[13,3328,13,3343],[13,3152,13,3167],[13,3168,13,3183],[13,3184,13,3199],[13,3200,13,3215],[13,3216,13,3231],[13,3232,13,3247],[13,3056,13,3071],[13,3072,13,3087],[13,3088,13,3103],[13,3104,13,3119],[13,3120,13,3135],[13,3136,13,3151],[13,2960,13,2975],[13,2976,13,2991],[13,2992,13,3007],[13,3008,13,3023],[13,3024,13,3039],[13,3040,13,3055],[13,2864,13,2879],[13,2880,13,2895],[13,2896,13,2911],[13,2912,13,2927],[13,2928,13,2943],[13,2944,13,2959],[13,2768,13,2783],[13,2784,13,2799],[13,2800,13,2815],[13,2816,13,2831],[13,2832,13,2847],[13,2848,13,2863],[13,2672,13,2687],[13,2688,13,2703],[13,2704,13,2719],[13,2720,13,2735],[13,2736,13,2751],[13,2752,13,2767],[13,2576,13,2591],[13,2592,13,2607],[13,2608,13,2623],[13,2624,13,2639],[13,2640,13,2655],[13,2656,13,2671],[13,2480,13,2495],[13,2496,13,2511],[13,2512,13,2527],[13,2528,13,2543],[13,2544,13,2559],[13,2560,13,2575],[13,2384,13,2399],[13,2400,13,2415],[13,2416,13,2431],[13,2432,13,2447],[13,2448,13,2463],[13,2464,13,2479],[13,2288,13,2303],[13,2304,13,2319],[13,2320,13,2335],[13,2336,13,2351],[13,2352,13,2367],[13,2368,13,2383],[13,2192,13,2207],[13,2208,13,2223],[13,2224,13,2239],[13,2240,13,2255],[13,2256,13,2271],[13,2272,13,2287],[13,2096,13,2111],[13,2112,13,2127],[13,2128,13,2143],[13,2144,13,2159],[13,2160,13,2175],[13,2176,13,2191],[13,2000,13,2015],[13,2016,13,2031],[13,2032,13,2047],[13,2048,13,2063],[13,2064,13,2079],[13,2080,13,2095],[13,1904,13,1919],[13,1920,13,1935],[13,1936,13,1951],[13,1952,13,1967],[13,1968,13,1983],[13,1984,13,1999],[13,1808,13,1823],[13,1824,13,1839],[13,1840,13,1855],[13,1856,13,1871],[13,1872,13,1887],[13,1888,13,1903],[13,1712,13,1727],[13,1728,13,1743],[13,1744,13,1759],[13,1760,13,1775],[13,1776,13,1791],[13,1792,13,1807],[13,1616,13,1631],[13,1632,13,1647],[13,1648,13,1663],[13,1664,13,1679],[13,1680,13,1695],[13,1696,13,1711],[13,1520,13,1535],[13,1536,13,1551],[13,1552,13,1567],[13,1568,13,1583],[13,1584,13,1599],[13,1600,13,1615],[13,1424,13,1439],[13,1440,13,1455],[13,1456,13,1471],[13,1472,13,1487],[13,1488,13,1503],[13,1504,13,1519],[13,1328,13,1343],[13,1344,13,1359],[13,1360,13,1375],[13,1376,13,1391],[13,1392,13,1407],[13,1408,13,1423],[13,1232,13,1247],[13,1248,13,1263],[13,1264,13,1279],[13,1280,13,1295],[13,1296,13,1311],[13,1312,13,1327],[13,1136,13,1151],[13,1152,13,1167],[13,1168,13,1183],[13,1184,13,1199],[13,1200,13,1215],[13,1216,13,1231],[13,1040,13,1055],[13,1056,13,1071],[13,1072,13,1087],[13,1088,13,1103],[13,1104,13,1119],[13,1120,13,1135],[13,944,13,959],[13,960,13,975],[13,976,13,991],[13,992,13,1007],[13,1008,13,1023],[13,1024,13,1039],[13,848,13,863],[13,864,13,879],[13,880,13,895],[13,896,13,911],[13,912,13,927],[13,928,13,943],[13,752,13,767],[13,768,13,783],[13,784,13,799],[13,800,13,815],[13,816,13,831],[13,832,13,847],[13,656,13,671],[13,672,13,687],[13,688,13,703],[13,704,13,719],[13,720,13,735],[13,736,13,751],[13,560,13,575],[13,576,13,591],[13,592,13,607],[13,608,13,623],[13,624,13,639],[13,640,13,655],[13,464,13,479],[13,480,13,495]],"merged_total":1040,"flags":["merged_cut"]}
[null,null,null,null,"School Division:",null,{"$f":"'Narrative & Detail Budget'!$A$15","v":"ALBEMARLE COUNTY PUBLIC SCHOOLS"},null,null,null,null,null,"Division Number:",null,null,{"$f":"'Narrative & Detail Budget'!$I$15","v":2}]
["V.  TITLE I, PART A, HOMELESS CHILDREN AND YOUTH"]
[]
["Any LEA receiving Title I, Part A funds must include in its local plan a description of how the plan is coordinated with the McKinney-Vento Act. The local plan must describe services provided to any homeless child. (ESEA sections 1112(a)(1)(B) and (b)(6)). Content for this page and the homeless reservation should be completed in conjunction with the local homeless education liaison. (See US Department of Education 2017 Education for Homeless Children and Youths Program Non-Regulatory Guidance Section M on pages 39-43 for further detail.)"]
[]
["Local Homeless Education Liaison:",null,null,null,null,"Sharon Root"]
[]
[250,"Total number of children and youth identified as homeless in the school division (year-to-date) for 2019-2020 based on the definition in Title IX, Part A, Section 725. (*Place mouse curser over comment in cell A8 for definition.)"]
[]
["1. Describe the process used to identify students experiencing homelessness and how the needs of homeless children and youths are determined."]
[" Each student and their family are dealt with on an individual basis and an enrollment form is completed for each family, which includes a checklist and space for specific needs to be identified on the first page. All notes of conversations with the family and collaborating personnel are kept on file with the form.  All services provided are documented in the file, and all information is input into the local homeless database.  The required data is entered into our local SIS system for state reporting.  Close collaboration is established with school staff, social workers, and other agency personnel involved with the family to identify needs and coordinate services.  Confidentiality is kept, and trust established so that the family feels safe in sharing information in order to have necessary services provided."]
[]
["2. Describe the method used for determining the amount reserved to serve students experiencing homelessness.\na. List staff (names and positions) consulted to determine the reservation.\nb. What needs were identified?\nc. What costs are associated with those needs?\nd. What other school division funds are budgeted specifically to meet the needs of students experiencing homeless?\ne. How did the school division determine the Title I, Part A set-aside is sufficient to meet the needs of students experiencing homelessness?\nf. What process will the school division use to reassess how it meets the needs of these students throughout the year?\ng. How much of last year’s homeless set-aside was used to serve students experiencing homelessness?\n"]
["A. Many staff members were consulted to determine the Homeless reservation: Debora Collins, Deputy Superintendent; Catrina Sims, Title I Coordinator; Michele Castner, Director of Elementary Education; Renee DeVall, Routing and Planning Transportation Manager; Laura Brown, Migrant and Homeless Specialist, Lynn Horwitz, Homeless Specialist; Anne Hindman, Management Analyst.\nB. Tutoring, addressing social-emotional needs, counseling, coordination, transportation, fund-raising, writing grants, and "]
["collaboration were identified as high needs.\nC. A portion of the Homeless Liaison's salary with benefits and one-to-one tutoring funding are needed.\nD. Special transportation and gas cards ($30,000), a portion of the Homeless Liaison's salary with benefits, supervision and Human Resources support for staff, computers and IT support, office space, county cars when needed, travel expenses, mileage, and administrative and instructional materials and supplies are all provided by the school division.\nE. The set aside is based on data, past history, costs, and perceived needs especially due to the recent Pandemic. The Albemarle Title I Program has always adequately supported the Homeless Program to ensure high performance.\nF. Ongoing evaluations will be conducted and data reviewed, including grades, dropout rates, performance, transportation, attendance, and graduation rates.\nG. The amount used is $86,697. Not all tutoring funding was spent due to the COVID 19 Pandemic. Some of the tutoring continued online, but not all of it could be arranged that way.\n"]
["Page 56"]
["3. Describe the services provided to students experiencing homelessness by the Title I, Part A program to support their enrollment, attendance, and success. Include a description of the services provided with funds reserved under Title I, Part A, Section 1113(c)(3)(A)-(C).  Place curser over this comment for the legislative text."]
[" Title I Part A supports the Albemarle Homeless Program \"Families in Crisis\" with partial support of the Homeless Liaison's salary and funds for hourly tutors.  The Homeless Liaison collaborates with Title I staff to assure the quick and appropriate delivery of educational supports for all homeless children and their families.  She writes the supplementary grants and procures donations to enable the program to meet the varied individualized needs of Homeless students and their families. Services provided include counseling, resource coordination, and coordination and provision of education support services, emphasizing individual tutoring and addressing social-emotional student needs.\n\nServices provided but not funded by Title I include transportation, immediate free lunch, housing money, food, gas, immediate enrollment, counseling, clothes, school supplies, and rental deposits.  Individualized tutoring is offered to all students in need of academic support on a one-to-one basis in collaboration with their regular classroom teachers.  "]
[]
[]
["*If an LEA has not identified any students experiencing homelessness during the last three school years, no set aside is required if the following McKinney-Vento Education of Homeless Children and Youth Program (Title IX, Part A) requirements have been fulfilled:\na. The LEA can document outreach and coordination activities with other entities and agencies to identify homeless children and youths [Section 722(g)(6)(i)]\nb. Public notice of the educational rights of homeless children and youths is disseminated in locations frequented by parents or guardians of such children and youths, and unaccompanied youths, including schools, shelters, public libraries, and soup kitchens in a manner and form understandable to the parents and guardians of homeless children and youths, and unaccompanied youths [Section 722(g)(6)(iv)]\nc. The LEA can document that school personnel receive professional development and support to assist in the identification and support of homeless children and youths [Section 722(g)(6)(ix)]\n"]
[]
["Guidance related to the local homeless education liaison, the definition of homelessness for educational purposes, identification strategies, professional development, and other services that can be provided through Title I, Part A, funding can be found on the Project HOPE-VA website: www.wm.edu/hope or by contacting Project HOPE-VA, Virginia’s Education for Homeless Children and Youth Program: phone: 757-221-4002 or email: homlss@wm.edu. "]
["Page 57"]

{"sheet":"Early Childhood","index":12,"n_rows":63,"n_cols":16,"rows_kept":63,"cut":false,"hidden":false,"merged":[[42,11,42,12],[42,13,42,15],[43,0,43,2],[43,3,43,6],[43,7,43,10],[43,11,43,12],[43,13,43,15],[40,0,40,2],[40,3,40,6],[41,0,41,2],[41,3,41,6],[41,7,41,10],[41,11,41,12],[41,13,41,15],[42,3,42,6],[42,7,42,10],[62,0,62,15],[44,0,44,2],[44,3,44,6],[44,7,44,10],[44,11,44,12],[44,13,44,15],[45,0,45,2],[45,3,45,6],[45,7,45,10],[45,11,45,12],[45,13,45,15],[61,0,61,2],[61,3,61,6],[61,7,61,10],[46,3,46,6],[46,7,46,10],[51,0,51,2],[53,3,53,6],[47,7,47,10],[47,3,47,6],[47,0,47,2],[60,0,60,2],[60,3,60,6],[60,7,60,10],[37,11,37,12],[37,13,37,15],[38,0,38,2],[38,3,38,6],[38,7,38,10],[38,11,38,12],[38,13,38,15],[39,0,39,2],[39,3,39,6],[39,7,39,10],[39,11,39,12],[39,13,39,15],[37,0,37,2],[37,3,37,6],[59,0,59,2],[59,3,59,6],[59,7,59,10],[57,0,57,2],[57,3,57,6],[57,7,57,10],[58,0,58,2],[58,3,58,6],[52,3,52,6],[52,7,52,10],[55,0,55,2],[54,0,54,2],[58,7,58,10],[46,0,46,2],[50,3,50,6],[50,7,50,10],[48,7,48,10],[46,11,46,12],[46,13,46,15],[17,7,17,15],[21,10,21,15],[33,11,33,12],[34,7,34,10],[34,11,34,12],[34,13,34,15],[35,7,35,10],[35,11,35,12],[35,13,35,15],[36,7,36,10],[36,11,36,12],[36,13,36,15],[40,7,40,10],[40,11,40,12],[40,13,40,15],[27,0,27,15],[42,0,42,2],[37,7,37,10],[36,0,36,2],[36,3,36,6],[52,11,52,12],[53,11,53,12],[53,13,53,15],[7,7,7,15],[33,13,33,15],[8,7,8,15],[9,7,9,15],[10,7,10,15],[20,11,20,15],[11,7,11,15],[50,0,50,2],[53,7,53,10],[52,0,52,2],[53,0,53,2],[19,8,19,10],[20,8,20,10],[33,0,33,2],[33,7,33,10],[51,3,51,6],[51,7,51,10],[47,13,47,15],[48,13,48,15],[48,11,48,12],[49,11,49,12],[54,11,54,12],[4,7,4,15],[18,7,18,15],[31,0,31,15],[22,10,22,11],[5,7,5,15],[6,7,6,15],[19,0,19,6],[16,7,16,15],[22,7,22,8],[49,0,49,2],[49,3,49,6],[49,7,49,10],[48,0,48,2],[48,3,48,6],[6,0,6,6],[5,0,5,6],[4,0,4,6],[34,0,34,2],[34,3,34,6],[35,0,35,2],[35,3,35,6],[58,11,58,12],[56,0,56,2],[56,3,56,6],[56,7,56,10],[54,3,54,6],[54,7,54,10],[55,13,55,15],[51,11,51,12],[54,13,54,15],[55,3,55,6],[55,7,55,10],[56,11,56,12],[3,0,3,6],[11,0,11,5],[1,0,1,15],[25,0,25,15],[61,11,61,12],[59,11,59,12],[60,11,60,12],[57,13,57,15],[58,13,58,15],[56,13,56,15],[59,13,59,15],[60,13,60,15],[61,13,61,15],[49,13,49,15],[47,11,47,12],[50,11,50,12],[55,11,55,12],[50,13,50,15],[51,13,51,15],[52,13,52,15],[3,7,3,15],[12,12,12,15],[12,8,12,10],[57,11,57,12],[33,3,33,6],[21,8,21,9],[12,0,12,6],[10,0,10,6],[9,0,9,6],[8,0,8,6],[7,0,7,6],[23,7,23,8],[23,10,23,11],[16,0,16,6],[13,0,13,6],[18,0,18,6],[17,0,17,6],[15,0,15,6],[14,0,14,6],[22,0,22,6],[14,7,14,15],[15,7,15,15],[13,7,13,15],[19,12,19,15],[26,0,26,15]]}
[null,null,null,null,"School Division:",null,{"$f":"'Narrative & Detail Budget'!A15","v":"ALBEMARLE COUNTY PUBLIC SCHOOLS"},null,null,null,null,null,"Division Number:",null,null,{"$f":"'Narrative & Detail Budget'!I15","v":2}]
["W.  TITLE I, PART A, EARLY CHILDHOOD PROGRAM (if applicable)"]
[]
["Number of Participating Students:",null,null,null,null,null,null,33]
["Number of Eligible Students on Waiting List:",null,null,null,null,null,null,0]
["Number of Participating Schools or Centers:",null,null,null,null,null,null,2]
["Number of Title I funded Teachers:",null,null,null,null,null,null,2]
["Number of Title I funded Paraprofessionals:",null,null,null,null,null,null,1.5]
["Average Number of Pupils Per Class/Average Class Size:",null,null,null,null,null,null,16]
["Number of Classrooms:",null,null,null,null,null,null,2]
["Title I Early Childhood Budget (Personnel and Program):",null,null,null,null,null,null,205503]
["School Year Title I, Part A, Early Childhood First Established:",null,null,null,null,null,"FY","Red Hill 2005-2006     Agnor Hurt 2016-2017"]
["Length of the Program Day (type X to left of selection):",null,null,null,null,null,null,null,"Half Day",null,null,"X","Full Day"]
["Curriculum: "]
["Primary Curriculum",null,null,null,null,null,null,"HighScope Curriculum"]
["Secondary Curriculum ( if applicable)"]
["Test/Evaluation Design:"]
["Primary Test",null,null,null,null,null,null,"Pre-K PALS"]
["Secondary Test ( if applicable)"]
["Other Early Childhood Programs with which Title I is collaborating:",null,null,null,null,null,null,"X","Virginia Preschool Initiative",null,null,"X","Head Start"]
[null,null,null,null,null,null,null,"X","Early Childhood Special Education"]
[null,null,null,null,null,null,null,null,"Others (specify)"]
["Students Must Be: ",null,null,null,null,null,null,4,null,null,"2020-09-30"]
[null,null,null,null,null,null,null,"Age",null,"by","Date"]
[]
["Describe how the local educational agency will support, coordinate, and integrate services provided under this part with early childhood education programs at the local educational agency or individual school level, including plans for the transition of participants in such programs to local elementary school programs."]
["ACPS initiated a Preschool Leadership Team which meets monthly to coordinate and collaborate regarding program needs, public awareness and continuous quality improvements; it includes coordinators and directors from Albemarle County Public Schools and Social Services, and Head Start.  There are three preschool programs in Albemarle County, in addition to Title I: Bright Stars, MACAA's Head Start, and Early Childhood Special Education (ECSE).  The four programs form the Albemarle County Preschool Network, which works to ensure that students receive equitable and excellent instruction across the programs. Collaboration includes support of professional development for teachers, parent training and workshops at individual schools, and enrichment activities that support success for all at-risk children"]
["Page 58"]
[null,null,null,null,"School Division:",null,{"$f":"'Narrative & Detail Budget'!A15","v":"ALBEMARLE COUNTY PUBLIC SCHOOLS"},null,null,null,null,null,"Division Number:",null,null,{"$f":"'Narrative & Detail Budget'!I15","v":2}]
[null,null,"TITLE I, PART A, EARLY CHILDHOOD PROGRAM (if applicable) (continued)"]
[]
["Provide a list of all schools and/or centers in your school division that house Title I, Part A, Early Childhood programs.  Indicate the eligible Title I school zone(s) served by the school or center.  In addition, include the total number of all Title I, Part A, Early Childhood teachers who are housed in each of the schools."]
["List Schools and Early Childhood Centers with Title I, Part A, Early Childhood Programs"]
["School or Early Childhood Center Name",null,null,"Principal Name and Address",null,null,null,"Eligible Title I School Zone(s) Served",null,null,null,"Number of Title I Funded Teachers",null,"Number of Title I Funded Paraprofessionals"]
[null,null,null,"     "]
["     ",null,null,"     "]
["     ",null,null,"     "]
["     ",null,null,"     "]
["     ",null,null,"     "]
["     ",null,null,"     "]
["     ",null,null,"     "]
["     ",null,null,"     "]
["     ",null,null,"     "]
["     ",null,null,"     "]
["     ",null,null,"     "]
["     ",null,null,"     "]
["     ",null,null,"     "]
["     ",null,null,"     "]
["     ",null,null,"     "]
["     ",null,null,"     "]
["     ",null,null,"     "]
["     ",null,null,"     "]
["     ",null,null,"     "]
["     ",null,null,"     "]
["     ",null,null,"     "]
["     ",null,null,"     "]
["     ",null,null,"     "]
["     ",null,null,"     "]
["     "]
[]
["     ",null,null,"     "]
["     ",null,null,"     "]
["Page 59"]

{"sheet":"General Assurances","index":13,"n_rows":47,"n_cols":16,"rows_kept":47,"cut":false,"hidden":false,"merged":[[0,3,0,5],[1,0,1,15],[3,0,3,3],[3,4,3,15],[4,0,4,3],[4,4,4,15],[5,0,5,3],[5,4,5,15],[6,0,6,3],[6,4,6,15],[7,0,7,3],[7,4,7,15],[8,0,8,3],[8,4,8,15],[9,0,9,3],[9,4,9,15],[10,0,10,3],[10,4,10,15],[22,3,22,15],[11,0,11,15],[12,1,12,15],[13,1,13,15],[14,1,14,15],[15,1,15,15],[16,2,16,15],[17,2,17,15],[18,3,18,15],[19,3,19,15],[20,3,20,15],[21,3,21,15],[34,3,34,15],[23,3,23,15],[24,3,24,15],[25,3,25,15],[26,3,26,15],[27,3,27,15],[28,0,28,15],[29,3,29,5],[30,0,30,15],[31,3,31,15],[32,3,32,15],[33,3,33,15],[48,5,48,6],[48,7,48,8],[48,9,48,10],[35,3,35,15],[36,3,36,15],[37,4,37,15],[38,4,38,15],[39,4,39,15],[40,3,40,15],[41,2,41,15],[42,2,42,15],[43,1,43,15],[44,1,44,15],[46,0,46,15],[51,5,51,6],[51,7,51,8],[51,9,51,10],[49,5,49,6],[49,7,49,8],[49,9,49,10],[50,5,50,6],[50,7,50,8],[50,9,50,10]]}
[null,null,null,"School Division:",null,null,{"$f":"'Narrative & Detail Budget'!$A$15","v":"ALBEMARLE COUNTY PUBLIC SCHOOLS"},null,null,null,null,null,"Division Number:",null,null,{"$f":"'Narrative & Detail Budget'!$I$15","v":2}]
["GENERAL ASSURANCES"]
[]
["Title I, Part A",null,null,null,"Improving Basic Programs Operated by Local Educational Agencies"]
["Title I, Part C",null,null,null,"Education of Migratory  Children"]
["Title I, Part D, Subpart 2",null,null,null,"Prevention and Intervention Programs for Children and Youth Who Are Neglected, Delinquent, or At-Risk"]
["Title II, Part A",null,null,null,"Supporting Effective Instruction"]
["Title III, Part A ",null,null,null,"Language Instruction for English Learners and Immigrant Students"]
["Title IV, Part A",null,null,null,"Student Support and Academic Enrichments Grants"]
["Title V, Part B, Subpart 2",null,null,null,"Rural and Low-Income School Program"]
[]
["The school division/grantee assures:"]
["I.","Each program will be administered in accordance with all applicable statutes, regulations, program plans, and applications;"]
["II.","The control of funds provided under each program and title to property acquired with program funds will be in a public agency, a nonprofit private agency, institution, organization, or an Indian tribe, if the law authorizing the program provides for assistance to those entities;"]
["III.","The public agency, nonprofit private agency, institution, organization, or Indian tribe, will administer the funds and property to the extent required by the authorizing statutes;"]
["IV.","It will adopt and use proper methods of administering each program, including - "]
[null,"A.","The enforcement of any obligations imposed by law on agencies, institutions, organizations, and other recipients responsible for carrying out each program;"]
[null,"B.","The correction of deficiencies in program operations that are identified through audits, monitoring, or evaluation and that:"]
[null,null,"1.","It will maintain fiscal effort in support of free public education;"]
[null,null,"2.","It will provide services with state and local funds that are at least comparable to services provided in schools and areas not receiving special federal funds; "]
[null,null,"3.","The majority of the resources in the school division are derived from nonfederal funds;"]
[null,null,"4.","It is in compliance with the requirements in Title VIII, Section 8524 and has no policy that prevents, or otherwise denies participation in, constitutionally protected prayer in public elementary and secondary schools;"]
[null,null,"5.","It will comply with the audit requirements for each program; "]
[null,null,"6.","The federal funds are used to supplement, not supplant regular nonfederal funds;"]
[null,null,"7.","It will cooperate in carrying out any evaluation of each program conducted by or for the state educational agency, the Secretary, or other federal officials;\n\n"]
[null,null,"8.","It will use such fiscal control and fund accounting procedures as will ensure proper disbursement of, and accounting for, federal funds paid to the applicant under each program;"]
[null,null,"9.","It will submit such reports to the state educational agency (which shall make the reports available to the Governor) and the Secretary of Education as the state educational agency and Secretary may require to enable the state educational agency and the Secretary to perform their duties under each program;\n"]
[null,null,"10.","It will maintain such records for five years, provide such information, and afford such access to the records as the state educational agency (after consultation with the Governor) or the Secretary may reasonably require to carry out the state educational agency’s or the Secretary’s duties; "]
["Page 60"]
[null,null,null,"School Division:",null,null,{"$f":"'Narrative & Detail Budget'!$A$15","v":"ALBEMARLE COUNTY PUBLIC SCHOOLS"},null,null,null,null,null,"Division Number:",null,null,{"$f":"'Narrative & Detail Budget'!$I$15","v":2}]
["GENERAL ASSURANCES (CONTINUED)"]
[null,null,"11.","It consulted with teachers, school administrators, parents, members of the community, nonprofit organizations and other interested parties in the development of this plan;"]
[null,null,"12.","It afforded a reasonable opportunity for public comment on the plan or application and considered such comment before the application was submitted;"]
[null,null,"13.","It will provide information in an understandable and uniform format and, to the extent practicable, be provided in a language that the parents can understand;"]
[null,null,"14.","It is in compliance with the requirement regarding equal access to public school facilities as specified in Title VIII, Section 8525;"]
[null,null,"15.","It is in compliance with the requirement regarding the prohibition on aiding and abetting sexual abuse as specified in Title VIII, Section 8546;"]
[null,null,"16.","It will comply with the other application requirements outlined in"]
[null,null,null,null,"Section 8501. Private School Children;"]
[null,null,null,null,"Section 8502. Bypass; and"]
[null,null,null,null,"Section 8521. Maintenance of Effort under Title VIII –Other Provisions;"]
[null,null,"17.","It will ensure that funds are expended in accordance with the school division’s approved application or amended application.  In the event the local division needs to expend funds in any manner other than stipulated in the approved application, the plan must be amended using the amendment process provided by the Department of Education.  The application must be amended before funds can be expended for activities not approved in the original application;"]
[null,"C.","It will collect and disseminate information collected under Section 1111 in a manner that protects the privacy of individuals;\n"]
[null,"D.","It will adhere to the provisions of the Federal Funding Transparency and Accountability Act (FFATA), and will obtain a valid DUNS number prior to applying for funds."]
["V.","It will comply with Section 22.1-277.07, of the Code of Virginia that requires the expulsion for one year of any student determined to have brought a firearm to school.  A description of each incident, the name of the school concerned, the number of students expelled from each school, and the type of firearm used in each instance of expulsion will be reported to the Virginia Department of Education in compliance with provisions under Section 8561 (Gun-Free Schools Act).  This agency has a policy that requires referral to the criminal justice or the juvenile delinquency system of any student who brings a firearm or weapon to school; and"]
["VI.","It will participate, if selected, in the state National Assessment of Educational Progress in 4th and 8th grade reading and mathematics carried out under Section 303 of the National Assessment of Educational Progress Act."]
[]
["Page 61"]

{"sheet":"Program Specific Assurances","index":14,"n_rows":43,"n_cols":16,"rows_kept":43,"cut":false,"hidden":false,"merged":[[9,2,9,15],[0,3,0,5],[1,0,1,15],[2,0,2,15],[3,1,3,15],[8,2,8,15],[42,0,42,15],[44,5,44,6],[44,7,44,8],[44,9,44,10],[28,2,28,15],[29,2,29,15],[30,2,30,15],[39,1,39,15],[40,1,40,15],[36,3,36,15],[37,3,37,15],[38,3,38,15],[31,2,31,15],[32,2,32,15],[33,2,33,15],[34,2,34,15],[47,5,47,6],[47,7,47,8],[47,9,47,10],[4,1,4,15],[5,1,5,15],[6,1,6,15],[7,1,7,15],[10,3,10,15],[11,3,11,15],[12,4,12,15],[45,5,45,6],[45,7,45,8],[45,9,45,10],[46,5,46,6],[46,7,46,8],[46,9,46,10],[13,4,13,15],[14,4,14,15],[15,1,15,15],[16,1,16,15],[17,1,17,15],[35,2,35,15],[22,0,22,15],[27,1,27,15],[18,2,18,15],[19,2,19,15],[24,2,24,15],[25,2,25,15],[20,0,20,15],[21,3,21,5],[26,2,26,15]]}
[null,null,null,"School Division:",null,null,{"$f":"'Narrative & Detail Budget'!$A$15","v":"ALBEMARLE COUNTY PUBLIC SCHOOLS"},null,null,null,null,null,"Division Number:",null,null,{"$f":"'Narrative & Detail Budget'!$I$15","v":2}]
["PROGRAM SPECIFIC ASSURANCES"]
["The school division/grantee will:"]
["I.","Ensure that migratory children and formerly migratory children who are eligible to receive services under this part are selected to receive such services on the same basis as other children who are selected to receive services under this part;"]
["II.","Provide services to eligible children attending private elementary schools and secondary schools in accordance with Section 1117, and timely and meaningful consultation with private school officials regarding such services;"]
["III.","Participate, if selected, in the National Assessment of Educational Progress in reading and mathematics in grades 4 and 8 carried out under section 303(b)(3) of the National Assessment of Educational Progress Authorization Act (20 U.S.C.9622(b)(3));"]
["IV.","Coordinate and integrate services provided under this part with other educational services at the local educational agency or individual school level, such as services for English learners, children with disabilities, migratory children, American Indian, Alaska Native, and Native Hawaiian children, and homeless children and youths, in order to increase program effectiveness, eliminate duplication, and reduce fragmentation of the instructional program;"]
["V.","Collaborate with the State or local child welfare agency to—"]
[null,"A.","Designate a point of contact if the corresponding child welfare agency notifies the local educational agency, in writing, that the agency has designated an employee to serve as a point of contact for the local educational agency; and"]
[null,"B.","Develop and implement clear written procedures governing how transportation to maintain children in foster care in their school of origin when in their best interest will be provided, arranged, and funded for the duration of the time in foster care, which procedures shall—"]
[null,null,"1.","Ensure that children in foster care needing transportation to the school of origin will promptly receive transportation in a cost-effective manner and in accordance with Section 475(4)(A) of the Social Security Act (42 U.S.C. 675(4)(A)); and"]
[null,null,"2.","Ensure that, if there are additional costs incurred in providing transportation to maintain children in foster care in their schools of origin, the local educational agency will provide transportation to the school of origin if—"]
[null,null,null,"a.","The local child welfare agency agrees to reimburse the local educational agency for the cost of such transportation;"]
[null,null,null,"b.","The local educational agency agrees to pay for the cost of such transportation; or "]
[null,null,null,"c.","The local educational agency and the local child welfare agency agree to share the cost of such transportation; "]
["VI.","Ensure that all teachers and paraprofessionals working in a program supported with funds under this part meet applicable State certification and licensure requirements, including any requirements for certification obtained through alternative routes to certification;"]
["VII.","In the case of a local educational agency that chooses to use funds under this part to provide early childhood education services to low-income children below the age of compulsory school attendance, ensure that such services comply with the performance standards established under Section 641A(a) of the Head Start Act (42 U.S.C. 9836a(a));"]
["VIII.","Develop agreements and carry out the following coordination activities with Head Start and, if feasible, other early childhood programs;"]
[null,"A.","developing and implementing a systematic procedure for receiving records regarding such children, transferred with parental consent from a Head Start program or, where applicable,"]
[null,"B.","another early childhood education program; establishing channels of communication between school staff and their counterparts (including teachers, social workers, and health staff) in such Head Start agencies or other entities carrying out early childhood education programs, as appropriate, to facilitate coordination of programs;\n"]
["Page 62"]
[null,null,null,"School Division:",null,null,{"$f":"'Narrative & Detail Budget'!$A$15","v":"ALBEMARLE COUNTY PUBLIC SCHOOLS"},null,null,null,null,null,"Division Number:",null,null,{"$f":"'Narrative & Detail Budget'!$I$15","v":2}]
["PROGRAM SPECIFIC ASSURANCES (CONTINUED)"]
[]
[null,"C.","conducting meetings involving parents, kindergarten or elementary school teachers, and Head Start teachers or, if appropriate, teachers from other early childhood education programs, to discuss the developmental and other needs of individual children;"]
[null,"D.","organizing and participating in joint transition-related training of school staff, Head Start program staff, and, where appropriate, other early childhood education program staff; and"]
[null,"E.","linking the educational services provided by such local educational agency with the services provided by local Head Start agencies."]
["IX.","For each local educational agency that uses funds under Title I, Part A, or Title III, Part A, identify all English learners within 30 days of enrollment, and, not later than 30 days after the beginning of the school year (or, for those children who have not been identified as English learners prior to the beginning of the school year but are identified as English learners during the school year, within the first two weeks of the child being placed in a language instruction educational program), the local educational agency shall notify the children’s parents of an English learner identified for participation or participating in such a program, of—"]
[null,"A.","The reasons for the identification of their child as an English learner and in need of placement in a language instruction educational program;"]
[null,"B.","The child’s level of English proficiency, how such level was assessed, and the status of the child’s academic achievement;"]
[null,"C.","The methods of instruction used in the program in which their child is, or will be, participating and the methods of instruction used in other available programs, including how such programs differ in content, instructional goals, and the use of English and a native language in instruction;"]
[null,"D.","How the program in which their child is, or will be, participating will meet the educational strengths and needs of their child;"]
[null,"E.","How such program will specifically help their child learn English and meet age-appropriate academic achievement standards for grade promotion and graduation; "]
[null,"F.","The specific exit requirements for the program, including the expected rate of transition from such program into classrooms that are not tailored for English learners, and the expected rate of graduation from high school (including four-year adjusted cohort graduation rates and extended-year adjusted cohort graduation rates for such program) if funds under this part are used for children in high schools;"]
[null,"G.","In the case of a child with a disability, how such program meets the objectives of the individualized education program of the child, as described in Section 614(d) of the Individuals with Disabilities Education Act (20 U.S.C. 1414(d));"]
[null,"H.","Information pertaining to parental rights that includes written guidance—"]
[null,null,"1.","Detailing the right that parents have to have their child immediately removed from such program upon their request;"]
[null,null,"2.","Detailing the options that parents have to decline to enroll their child in such program or to choose another program or method of instruction, if available; and"]
[null,null,"3.","Assisting parents in selecting among various programs and methods of instruction, if more than 1 program or method is offered by the eligible entity;"]
["X.","Use Virginia’s Foundation Blocks for Early Learning to align preschool and K-12 curriculum; and"]
["XI.","Use PALS Pre-K (if there is a Title I preschool program) and report data to the PALS office at the University of Virginia using the student’s State Testing Identifier (STI)."]
[]
["Page 63"]

{"sheet":"Sheet1","index":15,"n_rows":146,"n_cols":7,"rows_kept":146,"cut":false,"hidden":true,"merged":[]}
[null,null,"CSI/TSI",null,"ACCOMACK COUNTY PUBLIC SCHOOLS",null,"Yes"]
["Title II, Part A, Transferability",null,"Division",null,"ALBEMARLE COUNTY PUBLIC SCHOOLS",null,"No"]
["Title IV, Part A, Transferability",null,"Early Childhood",null,"ALEXANDRIA CITY PUBLIC SCHOOLS"]
[null,null,"Foster Care",null,"ALLEGHANY COUNTY PUBLIC SCHOOLS"]
[null,null,"Homeless",null,"AMELIA COUNTY PUBLIC SCHOOLS"]
[null,null,"Neglected/Delinquent",null,"AMHERST COUNTY PUBLIC SCHOOLS"]
[null,null,"PFE (Division)",null,"APPOMATTOX COUNTY PUBLIC SCHOOLS"]
[null,null,"PFE (School Level)",null,"ARLINGTON COUNTY PUBLIC SCHOOLS"]
[null,null,"Private School",null,"AUGUSTA COUNTY PUBLIC SCHOOLS"]
[null,null,null,null,"BATH COUNTY PUBLIC SCHOOLS"]
[null,null,null,null,"BEDFORD CITY PUBLIC SCHOOLS"]
[null,null,null,null,"BEDFORD COUNTY PUBLIC SCHOOLS"]
[null,null,null,null,"BLAND COUNTY PUBLIC SCHOOLS"]
[null,null,null,null,"BOTETOURT COUNTY PUBLIC SCHOOLS"]
[null,null,null,null,"BRISTOL CITY PUBLIC SCHOOLS"]
[null,null,null,null,"BRUNSWICK COUNTY PUBLIC SCHOOLS"]
[null,null,null,null,"BUCHANAN COUNTY PUBLIC SCHOOLS"]
[null,null,null,null,"BUCKINGHAM COUNTY PUBLIC SCHOOLS"]
[null,null,null,null,"BUENA VISTA CITY PUBLIC SCHOOLS"]
[null,null,null,null,"CAMPBELL COUNTY PUBLIC SCHOOLS"]
[null,null,null,null,"CAROLINE COUNTY PUBLIC SCHOOLS"]
[null,null,null,null,"CARROLL COUNTY PUBLIC SCHOOLS"]
[null,null,null,null,"CHARLES CITY COUNTY PUBLIC SCHOOLS"]
[null,null,null,null,"CHARLOTTE COUNTY PUBLIC SCHOOLS"]
[null,null,null,null,"CHARLOTTESVILLE CITY PUBLIC SCHOOLS"]
[null,null,null,null,"CHESAPEAKE CITY PUBLIC SCHOOLS"]
[null,null,null,null,"CHESTERFIELD COUNTY PUBLIC SCHOOLS"]
[null,null,null,null,"CLARKE COUNTY PUBLIC SCHOOLS"]
[null,null,null,null,"CLIFTON FORGE CITY"]
[null,null,null,null,"COLONIAL BEACH TOWN PUBLIC SCHOOLS"]
[null,null,null,null,"COLONIAL HEIGHTS CITY PUBLIC SCHOOLS"]
[null,null,null,null,"COVINGTON CITY PUBLIC SCHOOLS"]
[null,null,null,null,"CRAIG COUNTY PUBLIC SCHOOLS"]
[null,null,null,null,"CULPEPER COUNTY PUBLIC SCHOOLS"]
[null,null,null,null,"CUMBERLAND COUNTY PUBLIC SCHOOLS"]
[null,null,null,null,"DANVILLE CITY PUBLIC SCHOOLS"]
[null,null,null,null,"DICKENSON COUNTY PUBLIC SCHOOLS"]
[null,null,null,null,"DINWIDDIE COUNTY PUBLIC SCHOOLS"]
[null,null,null,null,"EMPORIA CITY PUBLIC SCHOOLS"]
[null,null,null,null,"ESSEX COUNTY PUBLIC SCHOOLS"]
[null,null,null,null,"FAIRFAX CITY PUBLIC SCHOOLS"]
[null,null,null,null,"FAIRFAX COUNTY PUBLIC SCHOOLS"]
[null,null,null,null,"FALLS CHURCH CITY PUBLIC SCHOOLS"]
[null,null,null,null,"FAUQUIER COUNTY PUBLIC SCHOOLS"]
[null,null,null,null,"FLOYD COUNTY PUBLIC SCHOOLS"]
[null,null,null,null,"FLUVANNA COUNTY PUBLIC SCHOOLS"]
[null,null,null,null,"FRANKLIN CITY PUBLIC SCHOOLS"]
[null,null,null,null,"FRANKLIN COUNTY PUBLIC SCHOOLS"]
[null,null,null,null,"FREDERICK COUNTY PUBLIC SCHOOLS"]
[null,null,null,null,"FREDERICKSBURG CITY PUBLIC SCHOOLS"]
[null,null,null,null,"GALAX CITY PUBLIC SCHOOLS"]
[null,null,null,null,"GILES COUNTY PUBLIC SCHOOLS"]
[null,null,null,null,"GLOUCESTER COUNTY PUBLIC SCHOOLS"]
[null,null,null,null,"GOOCHLAND COUNTY PUBLIC SCHOOLS"]
[null,null,null,null,"GRAYSON COUNTY PUBLIC SCHOOLS"]
[null,null,null,null,"GREENE COUNTY PUBLIC SCHOOLS"]
[null,null,null,null,"GREENSVILLE COUNTY PUBLIC SCHOOLS"]
[null,null,null,null,"HALIFAX COUNTY PUBLIC SCHOOLS"]
[null,null,null,null,"HAMPTON CITY PUBLIC SCHOOLS"]
[null,null,null,null,"HANOVER COUNTY PUBLIC SCHOOLS"]
[null,null,null,null,"HARRISONBURG CITY PUBLIC SCHOOLS"]
[null,null,null,null,"HENRICO COUNTY PUBLIC SCHOOLS"]
[null,null,null,null,"HENRY COUNTY PUBLIC SCHOOLS"]
[null,null,null,null,"HIGHLAND COUNTY PUBLIC SCHOOLS"]
[null,null,null,null,"HOPEWELL CITY PUBLIC SCHOOLS"]
[null,null,null,null,"ISLE OF WIGHT COUNTY PUBLIC SCHOOLS"]
[null,null,null,null,"JAMES CITY COUNTY PUBLIC SCHOOLS"]
[null,null,null,null,"JAMES MADISON UNIVERSITY"]
[null,null,null,null,"KING AND QUEEN COUNTY PUBLIC SCHOOLS"]
[null,null,null,null,"KING GEORGE COUNTY PUBLIC SCHOOLS"]
[null,null,null,null,"KING WILLIAM COUNTY PUBLIC SCHOOLS"]
[null,null,null,null,"LANCASTER COUNTY PUBLIC SCHOOLS"]
[null,null,null,null,"LEE COUNTY PUBLIC SCHOOLS"]
[null,null,null,null,"LEXINGTON CITY PUBLIC SCHOOLS"]
[null,null,null,null,"LOUDOUN COUNTY PUBLIC SCHOOLS"]
[null,null,null,null,"LOUISA COUNTY PUBLIC SCHOOLS"]
[null,null,null,null,"LUNENBURG COUNTY PUBLIC SCHOOLS"]
[null,null,null,null,"LYNCHBURG CITY PUBLIC SCHOOLS"]
[null,null,null,null,"MADISON COUNTY PUBLIC SCHOOLS"]
[null,null,null,null,"MANASSAS CITY PUBLIC SCHOOLS"]
[null,null,null,null,"MANASSAS PARK CITY PUBLIC SCHOOLS"]
[null,null,null,null,"MARTINSVILLE CITY PUBLIC SCHOOLS"]
[null,null,null,null,"MATHEWS COUNTY PUBLIC SCHOOLS"]
[null,null,null,null,"MCVH AUTHORITY"]
[null,null,null,null,"MECKLENBURG COUNTY PUBLIC SCHOOLS"]
[null,null,null,null,"MIDDLESEX COUNTY PUBLIC SCHOOLS"]
[null,null,null,null,"MONTGOMERY COUNTY PUBLIC SCHOOLS"]
[null,null,null,null,"NELSON COUNTY PUBLIC SCHOOLS"]
[null,null,null,null,"NEW KENT COUNTY PUBLIC SCHOOLS"]
[null,null,null,null,"NEWPORT NEWS CITY PUBLIC SCHOOLS"]
[null,null,null,null,"NORFOLK CITY PUBLIC SCHOOLS"]
[null,null,null,null,"NORTHAMPTON COUNTY PUBLIC SCHOOLS"]
[null,null,null,null,"NORTHUMBERLAND COUNTY PUBLIC SCHOOLS"]
[null,null,null,null,"NORTON CITY PUBLIC SCHOOLS"]
[null,null,null,null,"NOTTOWAY COUNTY PUBLIC SCHOOLS"]
[null,null,null,null,"OLD DOMINION UNIVERSITY"]
[null,null,null,null,"ORANGE COUNTY PUBLIC SCHOOLS"]
[null,null,null,null,"PAGE COUNTY PUBLIC SCHOOLS"]
[null,null,null,null,"PATRICK COUNTY PUBLIC SCHOOLS"]
[null,null,null,null,"PETERSBURG CITY PUBLIC SCHOOLS"]
[null,null,null,null,"PITTSYLVANIA COUNTY PUBLIC SCHOOLS"]
[null,null,null,null,"POQUOSON CITY PUBLIC SCHOOLS"]
[null,null,null,null,"PORTSMOUTH CITY PUBLIC SCHOOLS"]
[null,null,null,null,"POWHATAN COUNTY PUBLIC SCHOOLS"]
[null,null,null,null,"PRINCE EDWARD COUNTY PUBLIC SCHOOLS"]
[null,null,null,null,"PRINCE GEORGE COUNTY PUBLIC SCHOOLS"]
[null,null,null,null,"PRINCE WILLIAM COUNTY PUBLIC SCHOOLS"]
[null,null,null,null,"PULASKI COUNTY PUBLIC SCHOOLS"]
[null,null,null,null,"RADFORD CITY PUBLIC SCHOOLS"]
[null,null,null,null,"RAPPAHANNOCK COUNTY PUBLIC SCHOOLS"]
[null,null,null,null,"RICHMOND CITY PUBLIC SCHOOLS"]
[null,null,null,null,"RICHMOND COUNTY PUBLIC SCHOOLS"]
[null,null,null,null,"ROANOKE CITY PUBLIC SCHOOLS"]
[null,null,null,null,"ROANOKE COUNTY PUBLIC SCHOOLS"]
[null,null,null,null,"ROCKBRIDGE COUNTY PUBLIC SCHOOLS"]
[null,null,null,null,"ROCKINGHAM COUNTY PUBLIC SCHOOLS"]
[null,null,null,null,"RUSSELL COUNTY PUBLIC SCHOOLS"]
[null,null,null,null,"SALEM CITY PUBLIC SCHOOLS"]
[null,null,null,null,"SCOTT COUNTY PUBLIC SCHOOLS"]
[null,null,null,null,"SHENANDOAH COUNTY PUBLIC SCHOOLS"]
[null,null,null,null,"SMYTH COUNTY PUBLIC SCHOOLS"]
[null,null,null,null,"SOUTHAMPTON COUNTY PUBLIC SCHOOLS"]
[null,null,null,null,"SOUTHWESTERN VA TRAINING CENTER"]
[null,null,null,null,"SPOTSYLVANIA COUNTY PUBLIC SCHOOLS"]
[null,null,null,null,"STAFFORD COUNTY PUBLIC SCHOOLS"]
[null,null,null,null,"STAUNTON CITY PUBLIC SCHOOLS"]
[null,null,null,null,"SUFFOLK CITY PUBLIC SCHOOLS"]
[null,null,null,null,"SURRY COUNTY PUBLIC SCHOOLS"]
[null,null,null,null,"SUSSEX COUNTY PUBLIC SCHOOLS"]
[null,null,null,null,"TAZEWELL COUNTY PUBLIC SCHOOLS"]
[null,null,null,null,"VA BEACH CITY PUBLIC SCHOOLS"]
[null,null,null,null,"VA DEPT OF CORRECTIONAL EDUCATION"]
[null,null,null,null,"VIRGINIA COMMONWEALTH UNIVERSITY"]
[null,null,null,null,"VSDB HAMPTON"]
[null,null,null,null,"VSDB STAUNTON"]
[null,null,null,null,"WARREN COUNTY PUBLIC SCHOOLS"]
[null,null,null,null,"WASHINGTON COUNTY PUBLIC SCHOOLS"]
[null,null,null,null,"WAYNESBORO CITY PUBLIC SCHOOLS"]
[null,null,null,null,"WEST POINT TOWN PUBLIC SCHOOLS"]
[null,null,null,null,"WESTMORELAND COUNTY PUBLIC SCHOOLS"]
[null,null,null,null,"WILLIAMSBURG CITY PUBLIC SCHOOLS"]
[null,null,null,null,"WINCHESTER CITY PUBLIC SCHOOLS"]
[null,null,null,null,"WISE COUNTY PUBLIC SCHOOLS"]
[null,null,null,null,"WOODROW WILSON REHABILITATION CTR"]
[null,null,null,null,"WYTHE COUNTY PUBLIC SCHOOLS"]
[null,null,null,null,"YORK COUNTY PUBLIC SCHOOLS"]

{"sheet":"DIVISION SCHOOLS","index":16,"n_rows":1855,"n_cols":10,"rows_kept":1855,"cut":false,"hidden":true,"merged":[]}
["ed","School Name ","s"]
[1,"Accawmacke Elementary","PK - 05"]
[1,"Arcadia High","09 - 12"]
[1,"Arcadia Middle","06 - 08"]
[1,"Chincoteague Elementary","PK - 05"]
[1,"Chincoteague High","06 - 12"]
[1,"Kegotank Elementary","PK - 05"]
[1,"Metompkin Elementary","PK - 05"]
[1,"Nandua High","09 - 12"]
[1,"Nandua Middle","06 - 08"]
[1,"Pungoteague Elementary","PK - 05"]
[1,"Tangier Combined","KG - 12"]
[2,"Agnor-Hurt Elementary","PK - 05"]
[2,"Albemarle County Community Public Charter School","06 - 08"]
[2,"Albemarle High","09 - 12"]
[2,"Baker-Butler Elementary","PK - 05"]
[2,"Broadus Wood Elementary","PK - 05"]
[2,"Brownsville Elementary","PK - 05"]
[2,"Crozet Elementary","KG - 05"]
[2,"Hollymead Elementary","PK - 05"]
[2,"Jack Jouett Middle","06 - 08"]
[2,"Jackson P. Burley Middle","06 - 08"]
[2,"Joseph T. Henley Middle","06 - 08"]
[2,"Leslie H. Walton Middle","06 - 08"]
[2,"Mary Carr Greer Elementary","PK - 05"]
[2,"Meriwether Lewis Elementary","KG - 05"]
[2,"Monticello High","09 - 12"]
[2,"Mortimer Y. Sutherland Middle","06 - 08"]
[2,"Murray High","09 - 12"]
[2,"Paul H. Cale Elementary","PK - 05"]
[2,"Red Hill Elementary","PK - 05"]
[2,"Scottsville Elementary","PK - 05"]
[2,"Stone Robinson Elementary","PK - 05"]
[2,"Stony Point Elementary","KG - 05"]
[2,"Virginia L. Murray Elementary","PK - 05"]
[2,"Western Albemarle High","09 - 12"]
[2,"Woodbrook Elementary","PK - 05"]
[3,"Alleghany High","09 - 12"]
[3,"Callaghan Elementary","KG - 05"]
[3,"Clifton Middle","06 - 08"]
[3,"Mountain View Elementary","KG - 05"]
[3,"Sharon Elementary","KG - 05"]
[4,"Amelia County Elementary","PK - 04"]
[4,"Amelia County High","09 - 12"]
[4,"Amelia County Middle","05 - 08"]
[5,"Amelon Elementary","PK - 05"]
[5,"Amherst County High","09 - 12"]
[5,"Amherst Elementary","PK - 05"]
[5,"Amherst Middle","06 - 08"]
[5,"Central Elementary","PK - 05"]
[5,"Elon Elementary","PK - 05"]
[5,"Madison Heights Elementary","PK - 05"]
[5,"Monelison Middle","06 - 08"]
[5,"Temperance Elementary","PK - 05"]
[6,"Appomattox County High","09 - 12"]
[6,"Appomattox Elementary","03 - 05"]
[6,"Appomattox Middle","06 - 08"]
[6,"Appomattox Primary","PK - 02"]
[7,"Abingdon Elementary","PK - 05"]
[7,"Arlington Community High","09 - 12"]
[7,"Arlington Science Focus School","PK - 05"]
[7,"Arlington Traditional","PK - 05"]
[7,"Ashlawn Elementary","PK - 05"]
[7,"Barcroft Elementary","PK - 05"]
[7,"Barrett Elementary","PK - 05"]
[7,"Campbell Elementary","PK - 05"]
[7,"Carlin Springs Elementary","PK - 05"]
[7,"Claremont Immersion","PK - 05"]
[7,"Discovery Elementary","PK - 05"]
[7,"Drew Model Elementary","PK - 05"]
[7,"Francis Scott Key Elementary","PK - 05"]
[7,"Glebe Elementary","PK - 05"]
[7,"Gunston Middle","06 - 08"]
[7,"Henry Elementary","PK - 05"]
[7,"Hoffman-Boston Elementary","PK - 05"]
[7,"Jamestown Elementary","PK - 05"]
[7,"Jefferson Middle","06 - 08"]
[7,"Kenmore Middle","06 - 08"]
[7,"Long Branch Elementary","PK - 05"]
[7,"McKinley Elementary","PK - 05"]
[7,"Nottingham Elementary","KG - 05"]
[7,"Oakridge Elementary","PK - 05"]
[7,"Randolph Elementary","PK - 05"]
[7,"Swanson Middle","06 - 08"]
[7,"Taylor Elementary","PK - 05"]
[7,"Tuckahoe Elementary","PK - 05"]
[7,"Wakefield High","09 - 12"]
[7,"Washington-Lee High","09 - 12"]
[7,"Williamsburg Middle","06 - 08"]
[7,"Yorktown High","09 - 12"]
[8,"Beverley Manor Middle","06 - 08"]
[8,"Buffalo Gap High","09 - 12"]
[8,"Cassell Elementary","PK - 05"]
[8,"Churchville Elementary","PK - 05"]
[8,"Craigsville Elementary","PK - 05"]
[8,"Edward G. Clymore Elementary","PK - 05"]
[8,"Fort Defiance High","09 - 12"]
[8,"Guy K. Stump Elementary","PK - 05"]
[8,"North River Elementary","PK - 05"]
[8,"Riverheads Elementary","PK - 05"]
[8,"Riverheads High","09 - 12"]
[8,"S. Gordon Stewart Middle","06 - 08"]
[8,"Stuarts Draft Elementary","PK - 05"]
[8,"Stuarts Draft High","09 - 12"]
[8,"Stuarts Draft Middle","06 - 08"]
[8,"Wilson Elementary","PK - 05"]
[8,"Wilson Memorial High","09 - 12"]
[8,"Wilson Middle","06 - 08"]
[9,"Bath County High","08 - 12"]
[9,"Millboro Elementary","PK - 07"]
[9,"Valley Elementary","PK - 07"]
[10,"Bedford Elementary","02 - 05"]
[10,"Bedford Primary","PK - 01"]
[10,"Big Island Elementary","PK - 05"]
[10,"Boonsboro Elementary","KG - 05"]
[10,"Forest Elementary","KG - 05"]
[10,"Forest Middle","06 - 08"]
[10,"Goodview Elementary","PK - 05"]
[10,"Huddleston Elementary","PK - 05"]
[10,"Jefferson Forest High","09 - 12"]
[10,"Liberty High","09 - 12"]
[10,"Liberty Middle","06 - 08"]
[10,"Moneta Elementary","PK - 05"]
[10,"Montvale Elementary","PK - 05"]
[10,"New London Academy Elementary","PK - 05"]
[10,"Otter River Elementary","PK - 05"]
[10,"Staunton River High","09 - 12"]
[10,"Staunton River Middle","06 - 08"]
[10,"Stewartsville Elementary","PK - 05"]
[10,"Thomas Jefferson Elementary","PK - 05"]
[11,"Bland County Elementary","PK - 06"]
[11,"Bland County High","07 - 12"]
[12,"Breckinridge Elementary","PK - 05"]
[12,"Buchanan Elementary","PK - 05"]
[12,"Central Academy Middle","06 - 08"]
[12,"Cloverdale Elementary","KG - 05"]
[12,"Colonial Elementary","PK - 05"]
[12,"Eagle Rock Elementary","PK - 05"]
[12,"Greenfield Elementary","PK - 05"]
[12,"James River High","09 - 12"]
[12,"Lord Botetourt High","09 - 12"]
[12,"Read Mountain Middle","06 - 08"]
[12,"Troutville Elementary","PK - 05"]
[13,"Brunswick High","09 - 12"]
[13,"James S. Russell Middle","06 - 08"]
[13,"Meherrin Powellton Elementary","PK - 05"]
[13,"Red Oak-Sturgeon Elementary","PK - 05"]
[13,"Totaro Elementary","PK - 05"]
[14,"Council Elementary/Middle","PK - 07"]
[14,"Council High","08 - 12"]
[14,"Grundy High","09 - 12"]
[14,"Hurley Elementary/Middle","PK - 07"]
[14,"Hurley High","08 - 12"]
[14,"Riverview Elementary/Middle","PK - 08"]
[14,"Twin Valley Elementary/Middle","PK - 07"]
[14,"Twin Valley High","08 - 12"]
[15,"Buckingham County Elementary","03 - 05"]
[15,"Buckingham County High","09 - 12"]
[15,"Buckingham County Middle","06 - 08"]
[15,"Buckingham County Prekindergarten Center","PK - PK"]
[15,"Buckingham County Primary","KG - 02"]
[16,"Altavista Elementary","PK - 05"]
[16,"Altavista High","06 - 12"]
[16,"Brookneal Elementary","PK - 05"]
[16,"Brookville High","09 - 12"]
[16,"Brookville Middle","06 - 08"]
[16,"Concord Elementary","PK - 05"]
[16,"Leesville Road Elementary","PK - 05"]
[16,"Rustburg Elementary","PK - 05"]
[16,"Rustburg High","09 - 12"]
[16,"Rustburg Middle","06 - 08"]
[16,"Tomahawk Elementary","PK - 05"]
[16,"William Campbell High","06 - 12"]
[16,"Yellow Branch Elementary","PK - 05"]
[17,"Bowling Green Elementary","PK - 05"]
[17,"Caroline High","09 - 12"]
[17,"Caroline Middle","06 - 08"]
[17,"Lewis & Clark Elementary","PK - 05"]
[17,"Madison Elementary","PK - 05"]
[18,"Carroll County High","09 - 12"]
[18,"Carroll County Middle School","06 - 08"]
[18,"Fancy Gap Elementary","PK - 05"]
[18,"Gladesboro Elementary School","PK - 05"]
[18,"Gladeville Elementary School","PK - 05"]
[18,"Hillsville Elementary School","PK - 05"]
[18,"Laurel Elementary School","PK - 05"]
[18,"Oakland Elementary","PK - 05"]
[18,"St. Paul","PK - 07"]
[19,"Charles City County Elementary","PK - 06"]
[19,"Charles City County High","07 - 12"]
[20,"Bacon District Elementary","PK - 05"]
[20,"Central Middle","06 - 08"]
[20,"Eureka Elementary","PK - 05"]
[20,"Phenix Elementary","PK - 05"]
[20,"Randolph Henry High","09 - 12"]
[21,"A.M. Davis Elementary","PK - 05"]
[21,"Alberta Smith Elementary","PK - 05"]
[21,"Bailey Bridge Middle","06 - 08"]
[21,"Bellwood Elementary","PK - 05"]
[21,"Bensley Elementary","PK - 05"]
[21,"Bettie Weaver Elementary","PK - 05"]
[21,"Beulah Elementary","PK - 05"]
[21,"Bon Air Elementary","PK - 05"]
[21,"C.C. Wells Elementary","PK - 05"]
[21,"C.E. Curtis Elementary","PK - 05"]
[21,"Carver College and Career Academy","09 - 12"]
[21,"Carver Middle","06 - 08"]
[21,"Clover Hill Elementary","PK - 05"]
[21,"Clover Hill High","09 - 12"]
[21,"Cosby High","09 - 12"]
[21,"Crestwood Elementary","PK - 05"]
[21,"Ecoff Elementary","PK - 05"]
[21,"Elizabeth Davis Middle","06 - 08"]
[21,"Elizabeth Scott Elementary","PK - 05"]
[21,"Enon Elementary","PK - 05"]
[21,"Ettrick Elementary","PK - 05"]
[21,"Evergreen Elementary","PK - 05"]
[21,"Falling Creek Elementary","PK - 05"]
[21,"Falling Creek Middle","06 - 08"]
[21,"Grange Hall Elementary","PK - 05"]
[21,"Greenfield Elementary","PK - 05"]
[21,"Harrowgate Elementary","PK - 05"]
[21,"Hopkins Road Elementary","PK - 05"]
[21,"J.A. Chalkley Elementary","PK - 05"]
[21,"J.B. Watkins Elementary","PK - 05"]
[21,"J.G. Hening Elementary","PK - 05"]
[21,"Jacobs Road Elementary","PK - 05"]
[21,"James River High","09 - 12"]
[21,"Lloyd C. Bird High","09 - 12"]
[21,"Manchester High","09 - 12"]
[21,"Manchester Middle","06 - 08"]
[21,"Marguerite F. Christian Elementary","PK - 05"]
[21,"Matoaca Elementary","PK - 05"]
[21,"Matoaca High","09 - 12"]
[21,"Matoaca Middle","06 - 08"]
[21,"Meadowbrook High","09 - 12"]
[21,"Midlothian High","09 - 12"]
[21,"Midlothian Middle","06 - 08"]
[21,"Monacan High","09 - 12"]
[21,"O.B. Gates Elementary","PK - 05"]
[21,"Providence Elementary","PK - 05"]
[21,"Providence Middle","06 - 08"]
[21,"Reams Road Elementary","PK - 05"]
[21,"Robious Elementary","PK - 05"]
[21,"Robious Middle","06 - 08"]
[21,"Salem Church Elementary","PK - 05"]
[21,"Salem Church Middle","06 - 08"]
[21,"Spring Run Elementary","PK - 05"]
[21,"Swift Creek Elementary","PK - 05"]
[21,"Swift Creek Middle","06 - 08"]
[21,"Thelma Crenshaw Elementary","PK - 05"]
[21,"Thomas Dale High","09 - 12"]
[21,"Tomahawk Creek Middle","06 - 08"]
[21,"W.W. Gordon Elementary","PK - 05"]
[21,"Winterpock Elementary","PK - 05"]
[21,"Woolridge Elementary","PK - 05"]
[22,"Boyce Elementary","KG - 05"]
[22,"Clarke County High","09 - 12"]
[22,"D.G. Cooley Elementary","PK - 05"]
[22,"Johnson-Williams Middle","06 - 08"]
[23,"Craig County High","06 - 12"]
[23,"McCleary Elementary","PK - 05"]
[24,"A.G. Richardson Elementary","PK - 05"]
[24,"Culpeper County High","09 - 12"]
[24,"Culpeper Middle","06 - 08"]
[24,"Eastern View High","09 - 12"]
[24,"Emerald Hill Elementary","PK - 05"]
[24,"Farmington Elementary","PK - 05"]
[24,"Floyd T. Binns Middle","06 - 08"]
[24,"Galbreath-Marshall Building","PK - PK"]
[24,"Pearl Sample Elementary","PK - 05"]
[24,"Sycamore Park Elementary","PK - 05"]
[24,"Yowell Elementary","PK - 05"]
[25,"Cumberland Elementary","PK - 04"]
[25,"Cumberland High","09 - 12"]
[25,"Cumberland Middle","05 - 08"]
[26,"Clintwood Elementary","PK - 05"]
[26,"Ervinton Elementary","PK - 05"]
[26,"Ridgeview High","09 - 12"]
[26,"Ridgeview Middle","06 - 08"]
[26,"Sandlick Elementary","PK - 05"]
[27,"Dinwiddie County High","09 - 12"]
[27,"Dinwiddie County Middle","06 - 08"]
[27,"Dinwiddie Elementary","KG - 05"]
[27,"Midway Elementary","KG - 05"]
[27,"Southside Elementary","KG - 05"]
[27,"Sunnyside Elementary","KG - 05"]
[27,"Sutherland Elementary","KG - 05"]
[28,"Essex High","08 - 12"]
[28,"Essex Intermediate","04 - 07"]
[28,"Tappahannock Elementary","PK - 03"]
[29,"Aldrin Elementary","PK - 06"]
[29,"Annandale High","09 - 12"]
[29,"Annandale Terrace Elementary","PK - 05"]
[29,"Archer Elementary","PK - 06"]
[29,"Armstrong Elementary","PK - 06"]
[29,"Bailey's Elementary School for the Arts and Sciences","PK - 02"]
[29,"Bailey's Upper Elementary for the Arts and Sciences","03 - 05"]
[29,"Beech Tree Elementary","PK - 05"]
[29,"Belle View Elementary","PK - 06"]
[29,"Belvedere Elementary","PK - 05"]
[29,"Bonnie Brae Elementary","PK - 06"]
[29,"Braddock Elementary","PK - 05"]
[29,"Bren Mar Park Elementary","PK - 05"]
[29,"Brookfield Elementary","PK - 06"]
[29,"Bryant High","07 - 12"]
[29,"Bucknell Elementary","PK - 06"]
[29,"Bull Run E.C. Resource Ctr","PK - PK"]
[29,"Bull Run Elementary","PK - 06"]
[29,"Bush Hill Elementary","PK - 06"]
[29,"Camelot Elementary","PK - 06"]
[29,"Cameron Elementary","PK - 06"]
[29,"Canterbury Woods Elementary","PK - 06"]
[29,"Cardinal Forest Elementary","PK - 06"]
[29,"Carson Middle","07 - 08"]
[29,"Centre Ridge Elementary","PK - 06"]
[29,"Centreville Elementary","PK - 06"]
[29,"Centreville High","09 - 12"]
[29,"Chantilly High","09 - 12"]
[29,"Cherry Run Elementary","PK - 06"]
[29,"Chesterbrook Elementary","PK - 06"]
[29,"Churchill Road Elementary","PK - 06"]
[29,"Clearview Elementary","PK - 06"]
[29,"Clermont Elementary","PK - 06"]
[29,"Coates Elementary","PK - 06"]
[29,"Columbia Elementary","PK - 05"]
[29,"Colvin Run Elementary","PK - 06"]
[29,"Cooper Middle","07 - 08"]
[29,"Crestwood Elementary","PK - 06"]
[29,"Crossfield Elementary","PK - 06"]
[29,"Cub Run Elementary","PK - 06"]
[29,"Cunningham Park Elementary","PK - 06"]
[29,"Daniels Run Elementary","PK - 06"]
[29,"Deer Park Elementary","PK - 06"]
[29,"Dogwood Elementary","PK - 06"]
[29,"Dranesville Elementary","PK - 06"]
[29,"Dunn Loring E.C. Resource Ctr.","PK - PK"]
[29,"Eagle View Elementary","PK - 06"]
[29,"Edison High","09 - 12"]
[29,"Fairfax County Adult High","09 - 12"]
[29,"Fairfax High","09 - 12"]
[29,"Fairfax Villa Elementary","PK - 06"]
[29,"Fairhill Elementary","PK - 06"]
[29,"Fairview Elementary","PK - 06"]
[29,"Falls Church High","09 - 12"]
[29,"Flint Hill Elementary","PK - 06"]
[29,"Floris Elementary","PK - 06"]
[29,"Forest Edge Elementary","PK - 06"]
[29,"Forestdale Elementary","PK - 06"]
[29,"Forestville Elementary","PK - 06"]
[29,"Fort Belvoir Elementary","PK - 03"]
[29,"Fort Belvoir Upper","04 - 06"]
[29,"Fort Hunt Elementary","PK - 06"]
[29,"Fox Mill Elementary","PK - 06"]
[29,"Franconia Elementary","PK - 06"]
[29,"Franklin Middle","07 - 08"]
[29,"Freedom Hill Elementary","PK - 06"]
[29,"Frost Middle","07 - 08"]
[29,"Garfield Elementary","PK - 06"]
[29,"Glasgow Middle","06 - 08"]
[29,"Glen Forest Elementary","PK - 05"]
[29,"Graham Road Elementary","PK - 06"]
[29,"Great Falls Elementary","PK - 06"]
[29,"Greenbriar East Elementary","PK - 06"]
[29,"Greenbriar West Elementary","PK - 06"]
[29,"Groveton Elementary","PK - 06"]
[29,"Gunston Elementary","PK - 06"]
[29,"Halley Elementary","PK - 06"]
[29,"Haycock Elementary","PK - 06"]
[29,"Hayfield Elementary","PK - 06"]
[29,"Hayfield Secondary","07 - 12"]
[29,"Herndon Elementary","PK - 06"]
[29,"Herndon High","09 - 12"]
[29,"Herndon Middle","07 - 08"]
[29,"Hollin Meadows Elementary","PK - 06"]
[29,"Holmes Middle","06 - 08"]
[29,"Hughes Middle","07 - 08"]
[29,"Hunt Valley Elementary","PK - 06"]
[29,"Hunters Woods Elementary School for the Arts and Sciences","PK - 06"]
[29,"Hutchison Elementary","PK - 06"]
[29,"Hybla Valley Elementary","PK - 06"]
[29,"Irving Middle","07 - 08"]
[29,"Island Creek Elementary","PK - 06"]
[29,"Jackson Middle","07 - 08"]
[29,"Justice High","09 - 12"]
[29,"Keene Mill Elementary","PK - 06"]
[29,"Kent Gardens Elementary","PK - 06"]
[29,"Key Center ","PK - 12"]
[29,"Key Middle","07 - 08"]
[29,"Kilmer Center","PK - 12"]
[29,"Kilmer Middle","07 - 08"]
[29,"Kings Glen Elementary","04 - 06"]
[29,"Kings Park Elementary","PK - 03"]
[29,"Lake Anne Elementary","PK - 06"]
[29,"Lake Braddock Secondary","07 - 12"]
[29,"Lane Elementary","PK - 06"]
[29,"Langley High","09 - 12"]
[29,"Lanier Middle","07 - 08"]
[29,"Laurel Hill Elementary","PK - 06"]
[29,"Laurel Ridge Elementary","PK - 06"]
[29,"Lee High","09 - 12"]
[29,"Lees Corner Elementary","PK - 06"]
[29,"Lemon Road Elementary","PK - 06"]
[29,"Liberty Middle","07 - 08"]
[29,"Little Run Elementary","PK - 06"]
[29,"London Towne Elementary","PK - 06"]
[29,"Longfellow Middle","07 - 08"]
[29,"Lorton Station Elementary","PK - 06"]
[29,"Lynbrook Elementary","PK - 06"]
[29,"Madison High","09 - 12"]
[29,"Mantua Elementary","PK - 06"]
[29,"Marshall High","09 - 12"]
[29,"Marshall Road Elementary","PK - 06"]
[29,"Mason Crest Elementary","PK - 05"]
[29,"McLean High","09 - 12"]
[29,"McNair Elementary","PK - 06"]
[29,"Mosby Woods Elementary","PK - 06"]
[29,"Mount Eagle Elementary","PK - 06"]
[29,"Mount Vernon High","09 - 12"]
[29,"Mount Vernon Woods Elementary","PK - 06"]
[29,"Mountain View High","09 - 12"]
[29,"Navy Elementary","PK - 06"]
[29,"Newington Forest Elementary","PK - 06"]
[29,"North Springfield Elementary","PK - 05"]
[29,"Oak Hill Elementary","PK - 06"]
[29,"Oak View Elementary","PK - 06"]
[29,"Oakton Elementary","PK - 06"]
[29,"Oakton High","09 - 12"]
[29,"Olde Creek Elementary","PK - 06"]
[29,"Orange Hunt Elementary","PK - 06"]
[29,"Parklawn Elementary","PK - 05"]
[29,"Pimmit E.C. Resource Ctr.","PK - PK"]
[29,"Pine Spring Elementary","PK - 06"]
[29,"Poe Middle","06 - 08"]
[29,"Poplar Tree Elementary","PK - 06"]
[29,"Powell Elementary","PK - 06"]
[29,"Providence Elementary","PK - 06"]
[29,"Ravensworth Elementary","PK - 06"]
[29,"Riverside Elementary","PK - 06"]
[29,"Robinson Secondary","07 - 12"]
[29,"Rocky Run Middle","07 - 08"]
[29,"Rolling Valley Elementary","PK - 06"]
[29,"Rose Hill Elementary","PK - 06"]
[29,"Sandburg Middle","07 - 08"]
[29,"Sangster Elementary","PK - 06"]
[29,"Saratoga Elementary","PK - 06"]
[29,"Sherman Elementary","PK - 06"]
[29,"Shrevewood Elementary","PK - 06"]
[29,"Silverbrook Elementary","PK - 06"]
[29,"Sleepy Hollow Elementary","PK - 05"]
[29,"South County High","09 - 12"]
[29,"South County Middle","07 - 08"]
[29,"South Lakes High","09 - 12"]
[29,"Spring Hill Elementary","PK - 06"]
[29,"Springfield Estates Elementary","PK - 06"]
[29,"Stenwood Elementary","PK - 06"]
[29,"Stone Middle","07 - 08"]
[29,"Stratford Landing Elementary","PK - 06"]
[29,"Sunrise Valley Elementary","PK - 06"]
[29,"Terra Centre Elementary","PK - 06"]
[29,"Terraset Elementary","PK - 06"]
[29,"Thomas Jefferson High for Science and Technology","09 - 12"]
[29,"Thoreau Middle","07 - 08"]
[29,"Timber Lane Elementary","PK - 06"]
[29,"Twain Middle","07 - 08"]
[29,"Union Mill Elementary","PK - 06"]
[29,"Vienna Elementary","PK - 06"]
[29,"Virginia Hills E.C. Resource Ctr.","PK - PK"]
[29,"Virginia Run Elementary","PK - 06"]
[29,"Wakefield Forest Elementary","PK - 06"]
[29,"Waples Mill Elementary","PK - 06"]
[29,"Washington Mill Elementary","PK - 06"]
[29,"Waynewood Elementary","PK - 06"]
[29,"West Potomac High","09 - 12"]
[29,"West Springfield Elementary","PK - 06"]
[29,"West Springfield High","09 - 12"]
[29,"Westbriar Elementary","PK - 06"]
[29,"Westfield High","09 - 12"]
[29,"Westgate Elementary","PK - 06"]
[29,"Westlawn Elementary","PK - 06"]
[29,"Weyanoke Elementary","PK - 05"]
[29,"White Oaks Elementary","PK - 06"]
[29,"Whitman Middle","07 - 08"]
[29,"Willow Springs Elementary","PK - 06"]
[29,"Wolftrap Elementary","PK - 06"]
[29,"Woodburn Elementary","PK - 06"]
[29,"Woodlawn Elementary","PK - 06"]
[29,"Woodley Hills Elementary","PK - 06"]
[29,"Woodson High","09 - 12"]
[30,"Auburn Middle","06 - 08"]
[30,"C. Hunter Ritchie Elementary","PK - 05"]
[30,"C.M. Bradley Elementary","PK - 05"]
[30,"Cedar Lee Middle","06 - 08"]
[30,"Claude Thompson Elementary","PK - 05"]
[30,"Fauquier High","09 - 12"]
[30,"Grace Miller Elementary","PK - 05"]
[30,"Greenville Elementary","PK - 05"]
[30,"H.M. Pearson Elementary","PK - 05"]
[30,"James G. Brumfield Elementary","PK - 05"]
[30,"Kettle Run High","09 - 12"]
[30,"Liberty High","09 - 12"]
[30,"Margaret M. Pierce Elementary","PK - 05"]
[30,"Marshall Middle","06 - 08"]
[30,"Mary Walter Elementary","PK - 05"]
[30,"P.B. Smith Elementary","PK - 05"]
[30,"W.C. Taylor Middle","06 - 08"]
[30,"W.G. Coleman Elementary","PK - 05"]
[30,"Warrenton Middle","06 - 08"]
[31,"Check Elementary","PK - 07"]
[31,"Floyd County High","08 - 12"]
[31,"Floyd Elementary","PK - 07"]
[31,"Indian Valley Elementary","KG - 07"]
[31,"Willis Elementary","PK - 07"]
[32,"Carysbrook Elementary","03 - 04"]
[32,"Central Elementary","01 - 02"]
[32,"Fluvanna County High","08 - 12"]
[32,"Fluvanna Middle","05 - 07"]
[32,"West Central Primary School","PK - KG"]
[33,"Benjamin Franklin Middle-East","06 - 06"]
[33,"Benjamin Franklin Middle-West","07 - 08"]
[33,"Boones Mill Elementary","PK - 05"]
[33,"Burnt Chimney Elementary","PK - 05"]
[33,"Callaway Elementary","PK - 05"]
[33,"Dudley Elementary","PK - 05"]
[33,"Ferrum Elementary","PK - 05"]
[33,"Franklin County High","09 - 12"]
[33,"Gereau Center for Applied Technology & Career Exploration","08 - 08"]
[33,"Glade Hill Elementary","PK - 05"]
[33,"Henry Elementary","PK - 05"]
[33,"Lee M. Waid Elementary","PK - 05"]
[33,"Rocky Mount Elementary","PK - 05"]
[33,"Snow Creek Elementary","PK - 05"]
[33,"Sontag Elementary","PK - 05"]
[33,"Windy Gap Elementary","PK - 05"]
[34,"Admiral Richard E. Byrd Middle","06 - 08"]
[34,"Apple Pie Ridge Elementary","KG - 05"]
[34,"Armel Elementary","KG - 05"]
[34,"Bass-Hoover Elementary","KG - 05"]
[34,"Evendale Elementary","KG - 05"]
[34,"Frederick County Middle","06 - 08"]
[34,"Gainesboro Elementary","KG - 05"]
[34,"Greenwood Mill Elementary","KG - 05"]
[34,"Indian Hollow Elementary","KG - 05"]
[34,"James Wood High","09 - 12"]
[34,"James Wood Middle","06 - 08"]
[34,"Middletown Elementary","KG - 05"]
[34,"Millbrook High","09 - 12"]
[34,"Orchard View Elementary","KG - 05"]
[34,"Redbud Run Elementary","KG - 05"]
[34,"Robert E. Aylor Middle","06 - 08"]
[34,"Sherando High","09 - 12"]
[34,"Stonewall Elementary","KG - 05"]
[35,"Eastern Elementary/Middle","PK - 07"]
[35,"Giles High","08 - 12"]
[35,"Macy Mcclaugherty Elementary/Middle","PK - 07"]
[35,"Narrows Elementary/Middle","PK - 07"]
[35,"Narrows High","08 - 12"]
[36,"Abingdon Elementary","PK - 05"]
[36,"Achilles Elementary","PK - 05"]
[36,"Bethel Elementary","PK - 05"]
[36,"Botetourt Elementary","PK - 05"]
[36,"Gloucester High","09 - 12"]
[36,"Page Middle","06 - 08"]
[36,"Peasley Middle","06 - 08"]
[36,"Petsworth Elementary","PK - 05"]
[37,"Byrd Elementary","PK - 05"]
[37,"Goochland Elementary","PK - 05"]
[37,"Goochland High","09 - 12"]
[37,"Goochland Middle","06 - 08"]
[37,"Randolph Elementary","PK - 05"]
[38,"Fairview Elementary","KG - 05"]
[38,"Fries School","PK - 07"]
[38,"Grayson County High","09 - 12"]
[38,"Grayson Highlands School","PK - 07"]
[38,"Independence Elementary","KG - 05"]
[38,"Independence Middle","06 - 08"]
[39,"Nathanael Greene Elementary","03 - 05"]
[39,"Nathanael Greene Primary","PK - 02"]
[39,"Ruckersville Elementary","KG - 05"]
[39,"William Monroe High","09 - 12"]
[39,"William Monroe Middle","06 - 08"]
[40,"Belfield Elementary","05 - 05"]
[40,"Edward W. Wyatt Middle","05 - 08"]
[40,"Greensville County High","09 - 12"]
[40,"Greensville Elementary","PK - 05"]
[41,"Clays Mill Elementary","KG - 05"]
[41,"Cluster Springs Elementary","KG - 05"]
[41,"Halifax County High","09 - 12"]
[41,"Halifax County Middle","06 - 08"]
[41,"Meadville Elementary","KG - 05"]
[41,"Scottsburg Elementary","KG - 05"]
[41,"Sinai Elementary","KG - 05"]
[41,"South Boston Elementary","KG - 05"]
[41,"South Boston/Halifax Early Learning Center","PK - PK"]
[41,"Sydnor Jennings Elementary","KG - 05"]
[42,"Atlee High","09 - 12"]
[42,"Battlefield Park Elementary","PK - 05"]
[42,"Beaverdam Elementary","PK - 05"]
[42,"Chickahominy Middle","06 - 08"]
[42,"Cold Harbor Elementary","PK - 05"]
[42,"Cool Spring Elementary","PK - 05"]
[42,"Elmont Elementary","PK - 05"]
[42,"Hanover High","09 - 12"]
[42,"Henry Clay Elementary","PK - 02"]
[42,"John M. Gandy Elementary","03 - 05"]
[42,"Kersey Creek Elementary","PK - 05"]
[42,"Laurel Meadow Elementary","PK - 05"]
[42,"Lee Davis High","09 - 12"]
[42,"Liberty Middle","06 - 08"]
[42,"Mechanicsville Elementary","PK - 05"]
[42,"Oak Knoll Middle","06 - 08"]
[42,"Patrick Henry High","09 - 12"]
[42,"Pearson's Corner Elementary","PK - 05"]
[42,"Pole Green Elementary","PK - 05"]
[42,"Rural Point Elementary","PK - 05"]
[42,"South Anna Elementary","PK - 05"]
[42,"Stonewall Jackson Middle","06 - 08"]
[42,"Washington-Henry Elementary","PK - 05"]
[43,"Anthony P. Mehfoud Elementary","PK - 02"]
[43,"Arthur Ashe Jr. Elementary","PK - 05"]
[43,"Brookland Middle","06 - 08"]
[43,"Cashell Donahoe Elementary","PK - 05"]
[43,"Chamberlayne Elementary","PK - 05"]
[43,"Charles M. Johnson Elementary","PK - 05"]
[43,"Colonial Trail Elementary","KG - 05"]
[43,"Crestview Elementary","PK - 05"]
[43,"David A. Kaechele Elementary","PK - 05"]
[43,"Deep Run High","09 - 12"]
[43,"Douglas S. Freeman High","09 - 12"]
[43,"Dumbarton Elementary","PK - 05"]
[43,"Echo Lake Elementary","PK - 05"]
[43,"Elizabeth Holladay Elementary","PK - 05"]
[43,"Elko Middle","06 - 08"]
[43,"Fair Oaks Elementary","PK - 05"]
[43,"Fairfield Middle","06 - 08"]
[43,"Gayton Elementary","PK - 05"]
[43,"George F. Baker Elementary","PK - 05"]
[43,"George H. Moody Middle","06 - 08"]
[43,"Glen Allen Elementary","PK - 05"]
[43,"Glen Allen High","09 - 12"]
[43,"Glen Lea Elementary","PK - 05"]
[43,"Greenwood Elementary","PK - 05"]
[43,"Harold Macon Ratcliffe Elementary","PK - 05"]
[43,"Harvie Elementary","KG - 05"]
[43,"Henrico High","09 - 12"]
[43,"Henry D. Ward Elementary","PK - 05"]
[43,"Hermitage High","09 - 12"]
[43,"Highland Springs Elementary","PK - 05"]
[43,"Highland Springs High","09 - 12"]
[43,"Holman Middle","06 - 08"]
[43,"Hungary Creek Middle","06 - 08"]
[43,"Jackson Davis Elementary","PK - 05"]
[43,"Jacob L. Adams Elementary","PK - 05"]
[43,"John Randolph Tucker High","09 - 12"]
[43,"John Rolfe Middle","06 - 08"]
[43,"L. Douglas Wilder Middle","06 - 08"]
[43,"Laburnum Elementary","PK - 05"]
[43,"Lakeside Elementary","PK - 05"]
[43,"Longdale Elementary","PK - 05"]
[43,"Maude Trevvett Elementary","PK - 05"]
[43,"Maybeury Elementary","PK - 05"]
[43,"Mills E. Godwin High","09 - 12"]
[43,"Montrose Elementary","PK - 05"]
[43,"Nuckols Farm Elementary","PK - 05"]
[43,"Pemberton Elementary","PK - 05"]
[43,"Pinchbeck Elementary","PK - 05"]
[43,"Pocahontas Middle","06 - 08"]
[43,"Quioccasin Middle","06 - 08"]
[43,"R.C. Longan Elementary","PK - 05"]
[43,"Ridge Elementary","PK - 05"]
[43,"Rivers Edge Elementary","PK - 05"]
[43,"Ruby F. Carver Elementary","PK - 05"]
[43,"Sandston Elementary","PK - 05"]
[43,"Seven Pines Elementary","PK - 05"]
[43,"Shady Grove Elementary","PK - 05"]
[43,"Short Pump Elementary","PK - 05"]
[43,"Short Pump Middle","06 - 08"]
[43,"Skipwith Elementary","PK - 05"]
[43,"Springfield Park Elementary","PK - 05"]
[43,"Three Chopt Elementary","PK - 05"]
[43,"Tuckahoe Elementary","PK - 05"]
[43,"Tuckahoe Middle","06 - 08"]
[43,"Twin Hickory Elementary","PK - 05"]
[43,"Varina Elementary","03 - 05"]
[43,"Varina High","09 - 12"]
[44,"Axton Elementary","PK - 05"]
[44,"Bassett High","09 - 12"]
[44,"Campbell Court Elementary","PK - 05"]
[44,"Drewry Mason Elementary","PK - 05"]
[44,"Fieldale-Collinsville Middle","06 - 08"]
[44,"G. W. Carver Elementary","PK - 05"]
[44,"Laurel Park Middle","06 - 08"]
[44,"Magna Vista High","09 - 12"]
[44,"Meadow View Elementary","PK - 05"]
[44,"Mount Olivet Elementary","PK - 05"]
[44,"Rich Acres Elementary","PK - 05"]
[44,"Sanville Elementary","PK - 05"]
[44,"Stanleytown Elementary","PK - 05"]
[45,"Highland Elementary","PK - 05"]
[45,"Highland High","06 - 12"]
[46,"Carrollton Elementary","PK - 03"]
[46,"Carrsville Elementary","PK - 05"]
[46,"Georgie D. Tyler Middle","06 - 08"]
[46,"Hardy Elementary","PK - 04"]
[46,"Smithfield High","09 - 12"]
[46,"Smithfield Middle","07 - 08"]
[46,"Westside Elementary","04 - 06"]
[46,"Windsor Elementary","PK - 05"]
[46,"Windsor High","09 - 12"]
[48,"King George Elementary","KG - 06"]
[48,"King George High","09 - 12"]
[48,"King George Middle","07 - 08"]
[48,"Potomac Elementary","KG - 06"]
[48,"Sealston Elementary","KG - 06"]
[49,"Central High","08 - 12"]
[49,"King & Queen Elementary","PK - 07"]
[49,"Lawson-Marriott Elementary","PK - 07"]
[50,"Acquinton Elementary","03 - 05"]
[50,"Cool Spring Primary","PK - 02"]
[50,"Hamilton Holmes Middle","06 - 08"]
[50,"King William High","09 - 12"]
[51,"Lancaster High","09 - 12"]
[51,"Lancaster Middle","04 - 08"]
[51,"Lancaster Primary","PK - 03"]
[52,"Dryden Elementary","PK - 04"]
[52,"Elk Knob Elementary","PK - 04"]
[52,"Elydale Elementary","05 - 07"]
[52,"Flatwoods Elementary","PK - 04"]
[52,"Jonesville Middle","05 - 07"]
[52,"Lee High","08 - 12"]
[52,"Pennington Middle","05 - 07"]
[52,"Rose Hill Elementary","PK - 04"]
[52,"St. Charles Elementary","PK - 04"]
[52,"Thomas Walker High","08 - 12"]
[53,"Aldie Elementary","PK - 05"]
[53,"Algonkian Elementary","PK - 05"]
[53,"Arcola Elementary","PK - 05"]
[53,"Ashburn Elementary","PK - 05"]
[53,"Ball's Bluff Elementary","PK - 05"]
[53,"Banneker Elementary","PK - 05"]
[53,"Belmont Ridge Middle","06 - 08"]
[53,"Belmont Station Elementary","PK - 05"]
[53,"Blue Ridge Middle","06 - 08"]
[53,"Brambleton Middle","06 - 08"]
[53,"Briar Woods High","09 - 12"]
[53,"Broad Run High","09 - 12"]
[53,"Buffalo Trail Elementary","PK - 05"]
[53,"Cardinal Ridge Elementary","PK - 05"]
[53,"Catoctin Elementary","PK - 05"]
[53,"Cedar Lane Elementary","PK - 05"]
[53,"Cool Spring Elementary","PK - 05"]
[53,"Countryside Elementary","PK - 05"]
[53,"Creighton's Corner Elementary","PK - 05"]
[53,"Discovery Elementary School","PK - 05"]
[53,"Dominion High","PK - 12"]
[53,"Dominion Trail Elementary","PK - 05"]
[53,"Eagle Ridge Middle","06 - 08"]
[53,"Emerick Elementary","PK - 05"]
[53,"Evergreen Mill Elementary","PK - 05"]
[53,"Farmwell Station Middle","06 - 08"]
[53,"Forest Grove Elementary","PK - 05"]
[53,"Frances Hazel Reid Elementary","PK - 05"]
[53,"Frederick Douglass Elementary","PK - 05"]
[53,"Freedom High","09 - 12"]
[53,"Goshen Post Elementary","PK - 05"]
[53,"Guilford Elementary","PK - 05"]
[53,"Hamilton Elementary","PK - 05"]
[53,"Harmony Middle","06 - 08"]
[53,"Harper Park Middle","06 - 08"]
[53,"Heritage High","PK - 12"]
[53,"Hillsboro Charter Academy","PK - 05"]
[53,"Hillside Elementary","PK - 05"]
[53,"Horizon Elementary","PK - 05"]
[53,"Hutchison Farm Elementary","PK - 05"]
[53,"J. Lupton Simpson Middle","06 - 08"]
[53,"J. Michael Lunsford Middle","06 - 08"]
[53,"John Champe High School","10 - 12"]
[53,"John W. Tolbert Jr. Elementary","PK - 05"]
[53,"Kenneth W.Culbert Elementary","PK - 05"]
[53,"Leesburg Elementary","PK - 05"]
[53,"Legacy Elementary","PK - 05"]
[53,"Liberty Elementary","PK - 05"]
[53,"Lincoln Elementary","PK - 05"]
[53,"Little River Elementary","PK - 05"]
[53,"Loudoun County High","09 - 12"]
[53,"Loudoun Valley High","09 - 12"]
[53,"Lovettsville Elementary","PK - 05"]
[53,"Lowes Island Elementary","PK - 05"]
[53,"Lucketts Elementary","PK - 05"]
[53,"Madison's Trust Elementary","PK - 05"]
[53,"Meadowland Elementary","PK - 05"]
[53,"Mercer Middle","06 - 07"]
[53,"Middleburg Community Charter","KG - 05"]
[53,"Mill Run Elementary","PK - 05"]
[53,"Moorefield Station Elementary ","PK - 05"]
[53,"Mountain View Elementary","PK - 05"]
[53,"Newton-Lee Elementary","PK - 05"]
[53,"Park View High","09 - 12"]
[53,"Pinebrook Elementary","PK - 05"]
[53,"Potomac Falls High","09 - 12"]
[53,"Potowmack Elementary","PK - 05"]
[53,"River Bend Middle","06 - 08"]
[53,"Riverside High","09 - 12"]
[53,"Rock Ridge High","PK - 12"]
[53,"Rolling Ridge Elementary","PK - 05"]
[53,"Rosa Lee Carter Elementary","PK - 05"]
[53,"Round Hill Elementary","PK - 05"]
[53,"Sanders Corner Elementary","PK - 05"]
[53,"Seldens Landing Elementary","PK - 05"]
[53,"Seneca Ridge Middle","06 - 08"]
[53,"Smart's Mill Middle","06 - 08"]
[53,"Sterling Elementary","PK - 05"]
[53,"Sterling Middle","06 - 08"]
[53,"Steuart W. Weller Elementary","PK - 05"]
[53,"Stone Bridge High","09 - 12"]
[53,"Stone Hill Middle","06 - 08"]
[53,"Sugarland Elementary","PK - 05"]
[53,"Sully Elementary","PK - 05"]
[53,"Sycolin Creek Elementary","PK - 05"]
[53,"Trailside Middle","06 - 08"]
[53,"Tuscarora High","PK- 12"]
[53,"Waterford Elementary","PK - 05"]
[53,"Willard Intermediate School","08 - 09"]
[53,"Woodgrove High","PK- 12"]
[54,"Jouett Elementary","PK - 05"]
[54,"Louisa County High","09 - 12"]
[54,"Louisa County Middle","06 - 08"]
[54,"Moss-Nuckols Elementary","PK - 05"]
[54,"Thomas Jefferson Elementary","PK - 05"]
[54,"Trevilians Elementary","PK - 05"]
[55,"Central High","09 - 12"]
[55,"Kenbridge Elementary","PK - 05"]
[55,"Lunenburg Middle","06 - 08"]
[55,"Victoria Elementary","KG - 05"]
[56,"Madison County High","09 - 12"]
[56,"Madison Primary","PK - 02"]
[56,"Waverly Yowell Elementary","03 - 05"]
[56,"William H. Wetsel Middle","06 - 08"]
[57,"Lee-Jackson Elementary","KG - 04"]
[57,"Mathews High","09 - 12"]
[57,"Thomas Hunter Middle","05 - 08"]
[58,"Bluestone  High","09 - 12"]
[58,"Bluestone Middle","06 - 08"]
[58,"Chase City Elementary","PK - 05"]
[58,"Clarksville Elementary","PK - 05"]
[58,"LaCrosse Elementary","PK - 05"]
[58,"Park View High","09 - 12"]
[58,"Park View Middle","06 - 08"]
[58,"South Hill Elementary","PK - 05"]
[59,"Middlesex Elementary","PK - 05"]
[59,"Middlesex High","09 - 12"]
[59,"St. Clare Walker Middle","06 - 08"]
[60,"Auburn Elementary","PK - 05"]
[60,"Auburn High","09 - 12"]
[60,"Auburn Middle","06 - 08"]
[60,"Belview Elementary","PK - 05"]
[60,"Blacksburg High","09 - 12"]
[60,"Blacksburg Middle","06 - 08"]
[60,"Christiansburg Elementary","03 - 05"]
[60,"Christiansburg High","09 - 12"]
[60,"Christiansburg Middle","06 - 08"]
[60,"Christiansburg Primary","PK - 02"]
[60,"Eastern Montgomery Elementary","PK - 05"]
[60,"Eastern Montgomery High","09 - 12"]
[60,"Falling Branch Elementary","PK - 05"]
[60,"Gilbert Linkous Elementary","PK - 05"]
[60,"Harding Avenue Elementary","KG - 05"]
[60,"Kipps Elementary","KG - 05"]
[60,"Margaret Beeks Elementary","PK - 05"]
[60,"Prices Fork Elementary","PK - 05"]
[60,"Shawsville Middle","06 - 08"]
[62,"Nelson County High","09 - 12"]
[62,"Nelson Middle","06 - 08"]
[62,"Rockfish River Elementary","PK - 05"]
[62,"Tye River Elementary","PK - 05"]
[63,"George W. Watkins Elementary","PK - 05"]
[63,"New Kent Elementary","PK - 05"]
[63,"New Kent High","09 - 12"]
[63,"New Kent Middle","06 - 08"]
[65,"Kiptopeke Elementary","PK - 06"]
[65,"Northampton High","09 - 12"]
[65,"Northampton Middle","07 - 08"]
[65,"Occohannock Elementary","PK - 06"]
[66,"Northumberland Elementary","PK - 05"]
[66,"Northumberland High","09 - 12"]
[66,"Northumberland Middle","06 - 08"]
[67,"Blackstone Primary","PK - 04"]
[67,"Crewe Primary","PK - 04"]
[67,"Nottoway High","09 - 12"]
[67,"Nottoway Intermediate","05 - 06"]
[67,"Nottoway Middle","07 - 08"]
[68,"Gordon Barbour Elementary","KG - 05"]
[68,"Lightfoot Elementary","03 - 05"]
[68,"Locust Grove Elementary","03 - 05"]
[68,"Locust Grove Middle","06 - 08"]
[68,"Locust Grove Primary School","KG - 02"]
[68,"Orange County High","09 - 12"]
[68,"Orange Elementary","KG - 05"]
[68,"Prospect Heights Middle","06 - 08"]
[68,"Unionville Elementary","KG - 02"]
[69,"Luray Elementary","PK - 05"]
[69,"Luray High","09 - 12"]
[69,"Luray Middle","06 - 08"]
[69,"Page County High","09 - 12"]
[69,"Page County Middle","06 - 08"]
[69,"Shenandoah Elementary","PK - 05"]
[69,"Springfield Elementary","PK - 05"]
[69,"Stanley Elementary","PK - 05"]
[70,"Blue Ridge Elementary","PK - 07"]
[70,"Hardin Reynolds Elementary","04 - 07"]
[70,"Meadows of Dan Elementary","KG - 07"]
[70,"Patrick County High","08 - 12"]
[70,"Patrick Springs Elementary","PK - 03"]
[70,"Stuart Elementary","PK - 07"]
[70,"Woolwine Elementary","PK - 07"]
[71,"Brosville Elementary","PK - 05"]
[71,"Chatham Elementary","PK - 05"]
[71,"Chatham High","09 - 12"]
[71,"Chatham Middle","06 - 08"]
[71,"Dan River High","09 - 12"]
[71,"Dan River Middle","06 - 08"]
[71,"Gretna Elementary","PK - 05"]
[71,"Gretna High","09 - 12"]
[71,"Gretna Middle","06 - 08"]
[71,"John L. Hurt Elementary","PK - 05"]
[71,"Kentuck Elementary","PK - 05"]
[71,"Mount Airy Elementary","PK - 05"]
[71,"Southside Elementary","PK - 05"]
[71,"Stony Mill Elementary","PK - 05"]
[71,"Tunstall High","09 - 12"]
[71,"Tunstall Middle","06 - 08"]
[71,"Twin Springs Elementary","PK - 05"]
[71,"Union Hall Elementary","PK - 05"]
[72,"Flat Rock Elementary","PK - 05"]
[72,"Pocahontas Elementary","KG - 05"]
[72,"Powhatan Elementary","KG - 05"]
[72,"Powhatan High","09 - 12"]
[72,"Powhatan Middle","06 - 08"]
[73,"Prince Edward County High","09 - 12"]
[73,"Prince Edward Elementary","PK - 04"]
[73,"Prince Edward Middle","05 - 08"]
[74,"David A. Harrison Elementary","PK - 05"]
[74,"J.E.J. Moore Middle","06 - 08"]
[74,"L.L. Beazley Elementary","PK - 05"]
[74,"North Elementary","PK - 05"]
[74,"Prince George High","09 - 12"]
[74,"South Elementary","PK - 05"]
[74,"William A. Walton Elementary","PK - 05"]
[75,"A. Henderson Elementary","PK - 05"]
[75,"Antietam Elementary","PK - 05"]
[75,"Ashland Elementary","PK - 05"]
[75,"Battlefield High","09 - 12"]
[75,"Bel Air Elementary","PK - 05"]
[75,"Belmont Elementary","PK - 05"]
[75,"Bennett Elementary","PK - 05"]
[75,"Brentsville District High","09 - 12"]
[75,"Bristow Run Elementary","PK - 05"]
[75,"Buckland Mills Elementary","PK - 05"]
[75,"Bull Run Middle","06 - 08"]
[75,"C.A. Sinclair Elementary","PK - 05"]
[75,"C.D. Hylton High","09 - 12"]
[75,"Cedar Point Elementary","PK - 05"]
[75,"Charles J. Colgan Sr. High","09 - 12"]
[75,"Chris Yung Elementary","PK - 05"]
[75,"Coles Elementary","PK - 05"]
[75,"Covington-Harper Elementary","PK - 05"]
[75,"Dale City Elementary","PK - 05"]
[75,"Dumfries Elementary","PK - 05"]
[75,"E.H. Marsteller Middle","06 - 08"]
[75,"Elizabeth Vaughan Elementary","PK - 05"]
[75,"Enterprise Elementary","PK - 05"]
[75,"Fannie W. Fitzgerald Elementary","PK - 05"]
[75,"Featherstone Elementary","PK - 05"]
[75,"Forest Park High","09 - 12"]
[75,"Fred M. Lynn Middle","06 - 08"]
[75,"Freedom High","09 - 12"]
[75,"Gainesville Middle","06 - 08"]
[75,"Gar-Field High","09 - 12"]
[75,"George G. Tyler Elementary","PK - 05"]
[75,"George M. Hampton Middle","06 - 08"]
[75,"George P. Mullen Elementary","PK - 05"]
[75,"Glenkirk Elementary","PK - 05"]
[75,"Graham Park Middle","06 - 08"]
[75,"Haymarket Elementary","PK - 05"]
[75,"Herbert J. Saunders Middle","06 - 08"]
[75,"J.W. Alvey Elementary","PK - 05"]
[75,"John F. Pattie Sr. Elementary","PK - 05"]
[75,"Kerrydale Elementary","PK - 05"]
[75,"Kyle R. Wilson Elementary","PK - 05"]
[75,"Lake Ridge Elementary","PK - 05"]
[75,"Lake Ridge Middle","06 - 08"]
[75,"Leesylvania Elementary","PK - 05"]
[75,"Loch Lomond Elementary","PK - 05"]
[75,"Louise A. Benton Middle","06 - 08"]
[75,"Martin Luther King Jr. Elementary","PK - 05"]
[75,"Marumsco Hills Elementary","PK - 05"]
[75,"Mary G. Porter Traditional","01 - 08"]
[75,"Mary Williams Elementary","PK - 05"]
[75,"Minnieville Elementary","PK - 05"]
[75,"Montclair Elementary","PK - 05"]
[75,"Mountain View Elementary","PK - 05"]
[75,"Neabsco Elementary","PK - 05"]
[75,"Occoquan Elementary","PK - 05"]
[75,"Old Bridge Elementary","PK - 05"]
[75,"Osbourn Park High","09 - 12"]
[75,"Parkside Middle","06 - 08"]
[75,"Patriot High","09 - 12"]
[75,"Pennington School","01 - 08"]
[75,"Piney Branch Elementary","PK - 05"]
[75,"Potomac High","09 - 12"]
[75,"Potomac Middle","06 - 08"]
[75,"Potomac View Elementary","PK - 05"]
[75,"R. Dean Kilby Elementary","PK - 05"]
[75,"Rippon Middle","06 - 08"]
[75,"River Oaks Elementary","PK - 05"]
[75,"Rockledge Elementary","PK - 05"]
[75,"Ronald Wilson Reagan Middle","06 - 08"]
[75,"Rosa Parks Elementary","PK - 05"]
[75,"Samuel L. Gravely Jr. Elementary","PK - 05"]
[75,"Sharon C. McAuliffe Elementary","PK - 05"]
[75,"Signal Hill Elementary","PK - 05"]
[75,"Sonnie Penn Elementary","PK - 05"]
[75,"Springwoods Elementary","PK - 05"]
[75,"Stonewall Jackson High","09 - 12"]
[75,"Stonewall Middle","06 - 08"]
[75,"Stuart M. Beville Middle","06 - 08"]
[75,"Sudley Elementary","PK - 05"]
[75,"Suella G. Ellis Elementary","PK - 05"]
[75,"Swans Creek Elementary","PK - 05"]
[75,"T. Clay Wood Elementary","PK - 05"]
[75,"The Nokesville School","KG - 08"]
[75,"Thurgood Marshall Elementary","PK - 05"]
[75,"Triangle Elementary","PK - 05"]
[75,"Victory Elementary","PK - 05"]
[75,"West Gate Elementary","PK - 05"]
[75,"Westridge Elementary","PK - 05"]
[75,"Woodbine Pre-School Center","PK - PK"]
[75,"Woodbridge High","09 - 12"]
[75,"Woodbridge Middle","06 - 08"]
[75,"Yorkshire Elementary","PK - 05"]
[77,"Critzer Elementary","PK - 05"]
[77,"Dublin Elementary","PK - 05"]
[77,"Dublin Middle","06 - 08"]
[77,"Pulaski County Senior High","09 - 12"]
[77,"Pulaski Elementary","PK - 05"]
[77,"Pulaski Middle","06 - 08"]
[77,"Riverlawn Elementary","PK - 05"]
[77,"Snowville Elementary","PK - 05"]
[78,"Rappahannock County Elementary","PK - 07"]
[78,"Rappahannock County High","08 - 12"]
[79,"Rappahannock High","08 - 12"]
[79,"Richmond County Elementary","KG - 07"]
[80,"Back Creek Elementary","PK - 05"]
[80,"Bonsack Elementary","PK - 05"]
[80,"Burlington Elementary","PK - 05"]
[80,"Cave Spring Elementary","PK - 05"]
[80,"Cave Spring High","09 - 12"]
[80,"Cave Spring Middle","06 - 08"]
[80,"Clearbrook Elementary","PK - 05"]
[80,"Fort Lewis Elementary","PK - 05"]
[80,"Glen Cove Elementary","PK - 05"]
[80,"Glenvar Elementary","PK - 05"]
[80,"Glenvar High","09 - 12"]
[80,"Glenvar Middle","06 - 08"]
[80,"Green Valley Elementary","PK - 05"]
[80,"Herman L. Horn Elementary","PK - 05"]
[80,"Hidden Valley High","09 - 12"]
[80,"Hidden Valley Middle","06 - 08"]
[80,"Mason's Cove Elementary","PK - 05"]
[80,"Mount Pleasant Elementary","PK - 05"]
[80,"Mountain View Elementary","PK - 05"]
[80,"Northside High","09 - 12"]
[80,"Northside Middle","06 - 08"]
[80,"Oak Grove Elementary","PK - 05"]
[80,"Penn Forest Elementary","PK - 05"]
[80,"W.E. Cundiff Elementary","PK - 05"]
[80,"William Byrd High","09 - 12"]
[80,"William Byrd Middle","06 - 08"]
[81,"Central Elementary","PK - 05"]
[81,"Fairfield Elementary","PK - 05"]
[81,"Maury River Middle","06 - 08"]
[81,"Mountain View Elementary","KG - 05"]
[81,"Natural Bridge Elementary","PK - 05"]
[81,"Rockbridge County High","09 - 12"]
[82,"Broadway High","09 - 12"]
[82,"Cub Run Elementary","PK - 05"]
[82,"East Rockingham High","09 - 12"]
[82,"Elkton Elementary","PK - 05"]
[82,"Elkton Middle","06 - 08"]
[82,"Fulks Run Elementary","PK - 05"]
[82,"J. Frank Hillyard Middle","06 - 08"]
[82,"John C. Myers Elementary","PK - 05"]
[82,"John W. Wayland Elementary","PK - 05"]
[82,"Lacey Spring Elementary","PK - 05"]
[82,"Linville-Edom Elementary","PK - 05"]
[82,"McGaheysville Elementary","PK - 05"]
[82,"Montevideo Middle","06 - 08"]
[82,"Mountain View Elementary","PK - 05"]
[82,"Ottobine Elementary","PK - 05"]
[82,"Peak View Elementary","PK - 05"]
[82,"Plains Elementary","PK - 05"]
[82,"Pleasant Valley Elementary","PK - 05"]
[82,"River Bend Elementary","PK - 05"]
[82,"South River Elementary","PK - 05"]
[82,"Spotswood High","09 - 12"]
[82,"Turner Ashby High","09 - 12"]
[82,"Wilbur S. Pence Middle","06 - 08"]
[83,"Belfast Elk Garden Elementary","KG - 05"]
[83,"Castlewood Elementary","01 - 07"]
[83,"Castlewood High","08 - 12"]
[83,"Copper Creek Elementary","PK - KG"]
[83,"Honaker Elementary","PK - 07"]
[83,"Honaker High","08 - 12"]
[83,"Lebanon Elementary","02 - 04"]
[83,"Lebanon High","08 - 12"]
[83,"Lebanon Middle","05 - 07"]
[83,"Lebanon Primary","PK - 01"]
[83,"Swords Creek Elementary","PK - 07"]
[84,"Duffield-Pattonsville Primary","KG - 04"]
[84,"Dungannon Intermediate","04 - 07"]
[84,"Fort Blackmore Primary","KG - 03"]
[84,"Gate City High","09 - 12"]
[84,"Gate City Middle","07 - 08"]
[84,"Hilton Elementary","KG - 06"]
[84,"Nickelsville Elementary","KG - 07"]
[84,"Rye Cove High","08 - 12"]
[84,"Rye Cove Intermediate","05 - 07"]
[84,"Shoemaker Elementary","KG - 06"]
[84,"Twin Springs High","08 - 12"]
[84,"Weber City Elementary","KG - 06"]
[84,"Yuma Elementary","KG - 06"]
[85,"Ashby Lee Elementary","PK - 04"]
[85,"Central High","09 - 12"]
[85,"North Fork Middle","05 - 07"]
[85,"Peter Muhlenberg Middle","06 - 08"]
[85,"Sandy Hook Elementary","PK - 05"]
[85,"Signal Knob Middle","06 - 08"]
[85,"Stonewall Jackson High","08 - 12"]
[85,"Strasburg High","09 - 12"]
[85,"W.W. Robinson Elementary","PK - 05"]
[86,"Atkins Elementary","PK - 05"]
[86,"Chilhowie Elementary","PK - 05"]
[86,"Chilhowie High","09 - 12"]
[86,"Chilhowie Middle","06 - 08"]
[86,"Marion Intermediate","PK - 05"]
[86,"Marion Middle","06 - 08"]
[86,"Marion Senior High","09 - 12"]
[86,"Northwood High","09 - 12"]
[86,"Northwood Middle","06 - 08"]
[86,"Oak Point Elementary School","PK - 05"]
[86,"Rich Valley Elementary","PK - 05"]
[86,"Saltville Elementary","PK - 05"]
[86,"Sugar Grove Combined","PK - 05"]
[87,"Capron Elementary","PK - 05"]
[87,"Meherrin Elementary","PK - 05"]
[87,"Nottoway Elementary","PK - 05"]
[87,"Riverdale Elementary","PK - 05"]
[87,"Southampton High","09 - 12"]
[87,"Southampton Middle","06 - 08"]
[88,"Battlefield Elementary","PK - 05"]
[88,"Battlefield Middle","06 - 08"]
[88,"Berkeley Elementary","PK - 05"]
[88,"Brock Road Elementary","PK - 05"]
[88,"Cedar Forest Elementary","PK - 05"]
[88,"Chancellor Elementary","PK - 05"]
[88,"Chancellor High","09 - 12"]
[88,"Chancellor Middle","06 - 08"]
[88,"Courthouse Road Elementary","PK - 05"]
[88,"Courtland Elementary","PK - 05"]
[88,"Courtland High","09 - 12"]
[88,"Freedom Middle","06 - 08"]
[88,"Harrison Road Elementary","PK - 05"]
[88,"Lee Hill Elementary","PK - 05"]
[88,"Livingston Elementary","PK - 05"]
[88,"Massaponax High","09 - 12"]
[88,"Ni River Middle","06 - 08"]
[88,"Parkside Elementary","PK - 05"]
[88,"Post Oak Middle","06 - 08"]
[88,"Riverbend High","09 - 12"]
[88,"Riverview Elementary","PK - 05"]
[88,"Robert E. Lee Elementary","PK - 05"]
[88,"Salem Elementary","PK - 05"]
[88,"Smith Station Elementary","PK - 05"]
[88,"Spotswood Elementary","PK - 05"]
[88,"Spotsylvania High","09 - 12"]
[88,"Spotsylvania Middle","06 - 08"]
[88,"Thornburg Middle","06 - 08"]
[88,"Wilderness Elementary","PK - 05"]
[89,"Andrew G. Wright Middle","06 - 08"]
[89,"Anne E. Moncure Elementary","PK - 05"]
[89,"Anthony Burns Elementary","KG - 05"]
[89,"Brooke Point High","09 - 12"]
[89,"Colonial Forge High","09 - 12"]
[89,"Conway Elementary","PK - 05"]
[89,"Donald B. Dixon-Lyle R. Smith Middle","06 - 08"]
[89,"Edward E. Drew Jr. Middle","06 - 08"]
[89,"Falmouth Elementary","PK - 05"]
[89,"Ferry Farm Elementary","PK - 05"]
[89,"Garrisonville Elementary","PK - 05"]
[89,"Grafton Village Elementary","PK - 05"]
[89,"H.H. Poole Middle","06 - 08"]
[89,"Hampton Oaks Elementary","PK - 05"]
[89,"Hartwood Elementary","PK - 05"]
[89,"Kate Waller Barrett Elementary","PK - 05"]
[89,"Margaret Brent Elementary","PK - 05"]
[89,"Mountain View High","09 - 12"]
[89,"North Stafford High","09 - 12"]
[89,"Park Ridge Elementary","PK - 05"]
[89,"Rockhill Elementary","PK - 05"]
[89,"Rocky Run Elementary","PK - 05"]
[89,"Rodney E. Thompson Middle","06 - 08"]
[89,"Shirley C. Heim Middle","06 - 08"]
[89,"Stafford Elementary","PK - 05"]
[89,"Stafford Middle","06 - 08"]
[89,"Stafford Senior High","09 - 12"]
[89,"T. Benton Gayle Middle","06 - 08"]
[89,"Widewater Elementary","PK - 05"]
[89,"Winding Creek Elementary","PK - 05"]
[90,"Luther P. Jackson Middle","05 - 08"]
[90,"Surry County High","09 - 12"]
[90,"Surry Elementary","PK - 04"]
[91,"Sussex Central Elementary","PK - 05"]
[91,"Sussex Central High","09 - 12"]
[91,"Sussex Central Middle","06 - 08"]
[92,"Abb's Valley-Boissevain Elementary","PK - 05"]
[92,"Cedar Bluff Elementary","PK - 05"]
[92,"Dudley Primary","PK - 02"]
[92,"Graham High","09 - 12"]
[92,"Graham Intermediate","03 - 05"]
[92,"Graham Middle","06 - 08"]
[92,"North Tazewell Elementary","PK - 05"]
[92,"Richlands Elementary","PK - 05"]
[92,"Richlands High","09 - 12"]
[92,"Richlands Middle","06 - 08"]
[92,"Tazewell Elementary","PK - 05"]
[92,"Tazewell High","09 - 12"]
[92,"Tazewell Middle","06 - 08"]
[93,"A.S. Rhodes Elementary","KG - 05"]
[93,"E. Wilson Morrison Elementary","KG - 05"]
[93,"Hilda J. Barbour Elementary","KG - 05"]
[93,"Leslie Fox Keyser Elementary","KG - 05"]
[93,"Ressie Jeffries Elementary","KG - 05"]
[93,"Skyline High","09 - 12"]
[93,"Skyline Middle","06 - 08"]
[93,"Warren County High","09 - 12"]
[93,"Warren County Middle","06 - 08"]
[94,"Abingdon Elementary","PK - 05"]
[94,"Abingdon High","09 - 12"]
[94,"Damascus Middle","06 - 08"]
[94,"E.B. Stanley Middle","06 - 08"]
[94,"Glade Spring Middle","06 - 08"]
[94,"Greendale Elementary","PK - 05"]
[94,"High Point Elementary","PK - 05"]
[94,"Holston High","09 - 12"]
[94,"John S. Battle High","09 - 12"]
[94,"Meadowview Elementary","PK - 05"]
[94,"Patrick Henry High","09 - 12"]
[94,"Rhea Valley Elementary","PK - 05"]
[94,"Valley Institute Elementary","PK - 05"]
[94,"Wallace Middle","06 - 08"]
[94,"Watauga Elementary","PK - 05"]
[95,"Cople Elementary","PK - 05"]
[95,"Montross Middle","06 - 08"]
[95,"Washington & Lee High","09 - 12"]
[95,"Washington District Elementary","PK - 05"]
[96,"Central High","09 - 12"]
[96,"Coeburn Middle","05 - 08"]
[96,"Coeburn Primary","PK - 04"]
[96,"Eastside High","09 - 12"]
[96,"J.W. Adams Combined","PK - 08"]
[96,"L.F. Addington Middle","05 - 08"]
[96,"St. Paul Elementary","PK - 08"]
[96,"Union High","09 - 12"]
[96,"Union Middle","05 - 08"]
[96,"Union Primary","PK - 04"]
[96,"Wise Primary","PK - 04"]
[97,"Fort Chiswell High","09 - 12"]
[97,"Fort Chiswell Middle","06 - 08"]
[97,"George Wythe High","09 - 12"]
[97,"Jackson Memorial Elementary","PK - 05"]
[97,"Max Meadows Elementary","PK - 05"]
[97,"Rural Retreat Elementary","PK - 05"]
[97,"Rural Retreat High","09 - 12"]
[97,"Rural Retreat Middle","06 - 08"]
[97,"Scott Memorial Middle","06 - 08"]
[97,"Sheffey Elementary","PK - 05"]
[97,"Speedwell Elementary","PK - 05"]
[97,"Spiller Elementary","PK - 05"]
[98,"Bethel Manor Elementary","KG - 05"]
[98,"Bruton High","09 - 12"]
[98,"Coventry Elementary","KG - 05"]
[98,"Dare Elementary","KG - 05"]
[98,"Grafton Bethel Elementary","KG - 05"]
[98,"Grafton High","09 - 12"]
[98,"Grafton Middle","06 - 08"]
[98,"Magruder Elementary","KG - 05"]
[98,"Mount Vernon Elementary","PK - 05"]
[98,"Queens Lake Middle","06 - 08"]
[98,"Seaford Elementary","KG - 05"]
[98,"Tabb Elementary","KG - 05"]
[98,"Tabb High","09 - 12"]
[98,"Tabb Middle","06 - 08"]
[98,"Waller Mill Elementary","KG - 05"]
[98,"York High","09 - 12"]
[98,"York River Academy","09 - 12"]
[98,"Yorktown Elementary","KG - 05"]
[98,"Yorktown Middle","06 - 08"]
[101,"Charles Barrett Elementary","PK - 05"]
[101,"Cora Kelly Magnet Elementary","PK - 05"]
[101,"Douglas Macarthur Elementary","KG - 05"]
[101,"Early Childhood Center","PK - PK"]
[101,"Ferdinand T. Day Elementary","KG - 05"]
[101,"Francis C. Hammond Middle","06 - 08"]
[101,"George Mason Elementary","KG - 05"]
[101,"George Washington Middle","06 - 08"]
[101,"James K. Polk Elementary","KG - 05"]
[101,"Jefferson-Houston Elementary","PK - 08"]
[101,"John Adams Elementary","PK - 05"]
[101,"Lyles-Crouch Elementary","KG - 05"]
[101,"Maury Elementary","KG - 05"]
[101,"Mount Vernon Elementary","PK - 05"]
[101,"Patrick Henry Elementary","KG - 07"]
[101,"Samuel W. Tucker Elementary","KG - 05"]
[101,"T.C. Williams High","09 - 12"]
[101,"William Ramsay Elementary","KG - 05"]
[102,"Highland View Elementary","PK - 05"]
[102,"Joseph Van Pelt Elementary","PK - 05"]
[102,"Stonewall Jackson Elementary","PK - 05"]
[102,"Virginia High","09 - 12"]
[102,"Virginia Middle","06 - 08"]
[102,"Washington-Lee Elementary","PK - 05"]
[103,"Enderly Heights Elementary","03 - 05"]
[103,"F.W. Kling Jr. Elementary","PK - 02"]
[103,"Parry McCluer High","08 - 12"]
[103,"Parry McCluer Middle","06 - 07"]
[104,"Buford Middle","07 - 08"]
[104,"Burnley-Moran Elementary","PK - 04"]
[104,"Charlottesville High","09 - 12"]
[104,"Clark Elementary","PK - 04"]
[104,"Greenbrier Elementary","PK - 04"]
[104,"Jackson-Via Elementary","PK - 04"]
[104,"Johnson Elementary","PK - 04"]
[104,"Venable Elementary","PK - 04"]
[104,"Walker Upper Elementary","05 - 06"]
[106,"Colonial Heights High","09 - 12"]
[106,"Colonial Heights Middle","06 - 08"]
[106,"Lakeview Elementary","PK - 05"]
[106,"North Elementary","PK - 05"]
[106,"Tussing Elementary","PK - 05"]
[107,"Covington High","08 - 12"]
[107,"Edgemont Primary","PK - 03"]
[107,"Jeter-Watson Intermediate","04 - 07"]
[108,"Edwin A. Gibson Elementary School","KG - 05"]
[108,"Forest Hills Elementary","KG - 05"]
[108,"G.L.H. Johnson Elementary","KG - 03"]
[108,"Galileo Magnet High","09 - 12"]
[108,"George Washington High","09 - 12"]
[108,"Grove Park Preschool","PK - PK"]
[108,"O. Trent Bonner Middle","06 - 08"]
[108,"Park Avenue Elementary","KG - 05"]
[108,"Schoolfield Elementary","KG - 05"]
[108,"The Northside Preschool","PK - PK"]
[108,"Westwood Middle","06 - 08"]
[108,"Woodberry Hills Elementary","KG - 03"]
[108,"Woodrow Wilson Intermediate","04 - 05"]
[109,"George Mason High","09 - 12"]
[109,"Jessie Thackrey Preschool","PK - PK"]
[109,"Mary Ellen Henderson Middle","06 - 08"]
[109,"Mount Daniel School","KG - 01"]
[109,"Thomas Jefferson Elementary","02 - 05"]
[110,"Hugh Mercer Elementary","KG - 02"]
[110,"James Monroe High","09 - 12"]
[110,"Lafayette Upper Elementary","03 - 05"]
[110,"Walker-Grant Early Childhood Center","PK - PK"]
[110,"Walker-Grant Middle","06 - 08"]
[111,"Galax Elementary","KG - 04"]
[111,"Galax High","08 - 12"]
[111,"Galax Middle","05 - 07"]
[112,"A.W.E. Bassette Elementary","PK - 05"]
[112,"Aberdeen Elementary","PK - 05"]
[112,"Alfred S. Forrest Elementary","KG - 05"]
[112,"Armstrong Elementary","KG - 05"]
[112,"Barron Elementary","PK - 05"]
[112,"Benjamin Syms Middle","06 - 08"]
[112,"Bethel High","09 - 12"]
[112,"Booker Elementary","KG - 05"]
[112,"C. Alton Lindsay Middle","06 - 08"]
[112,"Captain John Smith Elementary","PK - 05"]
[112,"Cesar Tarrant Middle","06 - 08"]
[112,"Christopher C. Kraft Elementary","KG - 05"]
[112,"Francis Asbury Elementary","KG - 05"]
[112,"Francis W. Jones Magnet Middle","06 - 08"]
[112,"George P. Phenix Elementary","PK - 08"]
[112,"Hampton High","09 - 12"]
[112,"Hunter B. Andrews","PK - 08"]
[112,"Jane H. Bryan Elementary","PK - 05"]
[112,"John B. Cary Elementary","PK - 05"]
[112,"John Tyler Elementary","PK - 05"]
[112,"Kecoughtan High","09 - 12"]
[112,"Luther W. Machen Elementary","PK - 05"]
[112,"Moton Early Childhood Center","PK - PK"]
[112,"Paul Burbank Elementary","KG - 05"]
[112,"Phillips Elementary","KG - 05"]
[112,"Phoebus High","09 - 12"]
[112,"Samuel P. Langley Elementary","KG - 05"]
[112,"Thomas Eaton Middle","06 - 08"]
[112,"Tucker-Capps Elementary","PK - 05"]
[112,"William Mason Cooper Elementary","PK - 05"]
[113,"Bluestone Elementary","KG - 05"]
[113,"Harrisonburg High","09 - 12"]
[113,"Keister Elementary","KG - 05"]
[113,"Skyline Middle","06 - 08"]
[113,"Smithland Elementary","KG - 05"]
[113,"Spotswood Elementary","KG - 05"]
[113,"Stone Spring Elementary","KG - 05"]
[113,"Thomas Harrison Middle","06 - 08"]
[113,"Waterman Elementary","KG - 05"]
[114,"Carter G. Woodson Middle","06 - 08"]
[114,"Dupont Elementary","KG - 05"]
[114,"Harry E. James Elementary","KG - 05"]
[114,"Hopewell High","09 - 12"]
[114,"Patrick Copeland Elementary","KG - 05"]
[114,"Woodlawn Pre-School Learning Center","PK - PK"]
[115,"Bedford Hills Elementary","KG - 05"]
[115,"Dearington Elementary/Innovation","KG - 05"]
[115,"E.C. Glass High","09 - 12"]
[115,"Heritage Elementary","PK - 05"]
[115,"Heritage High","09 - 12"]
[115,"Linkhorne Elementary","KG - 05"]
[115,"Linkhorne Middle","06 - 08"]
[115,"Paul Laurence Dunbar Middle for Innovation","06 - 08"]
[115,"Paul Munro Elementary","PK - 05"]
[115,"Perrymont Elementary","KG - 05"]
[115,"Robert S. Payne Elementary","PK - 05"]
[115,"Sandusky Elementary","KG - 05"]
[115,"Sandusky Middle","06 - 08"]
[115,"Sheffield Elementary","KG - 05"]
[115,"T.C. Miller Elementary for Innovation","KG - 05"]
[115,"William M. Bass Elementary","KG - 05"]
[116,"Albert Harris Elementary","KG - 05"]
[116,"Clearview Early Childhood Center","PK - PK"]
[116,"Martinsville High","09 - 12"]
[116,"Martinsville Middle","06 - 08"]
[116,"Patrick Henry Elementary","KG - 05"]
[117,"Achievable Dream Academy","PK - 05"]
[117,"Achievable Dream Middle/High","06 - 12"]
[117,"B.C. Charles Elementary","PK - 05"]
[117,"B.T. Washington Middle","06 - 08"]
[117,"Carver Elementary","PK - 05"]
[117,"Crittenden Middle","06 - 08"]
[117,"David A. Dutrow Elementary","PK - 05"]
[117,"Deer Park Elementary","PK - 05"]
[117,"Denbigh Early Childhood Center","PK - PK"]
[117,"Denbigh High","09 - 12"]
[117,"Discovery STEM Academy","KG - 05"]
[117,"Ethel M. Gildersleeve Middle","06 - 08"]
[117,"Gatewood Academy","PK - PK"]
[117,"General Stanford Elementary","PK - 05"]
[117,"George J. McIntosh Elementary","PK - 05"]
[117,"Heritage High","09 - 12"]
[117,"Hidenwood Elementary","PK - 05"]
[117,"Hilton Elementary","PK - 05"]
[117,"Homer L. Hines Middle","06 - 08"]
[117,"Horace H. Epes Elementary","PK - 05"]
[117,"Huntington Middle","07 - 08"]
[117,"J.M. Dozier Middle","06 - 08"]
[117,"John Marshall Early Childhood Center","PK - KG"]
[117,"Joseph H. Saunders Elementary","PK - 05"]
[117,"Kiln Creek Elementary","PK - 05"]
[117,"L.F. Palmer Elementary","PK - 05"]
[117,"Lee Hall Early Childhood Center","PK - PK"]
[117,"Lee Hall Elementary","PK - 05"]
[117,"Mary Passage Middle","06 - 08"]
[117,"Menchville High","09 - 12"]
[117,"Newsome Park Elementary","PK - 05"]
[117,"Oliver C. Greenwood Elementary","PK - 05"]
[117,"R.O. Nelson Elementary","PK - 05"]
[117,"Richard T. Yates Elementary","PK - 05"]
[117,"Richneck Elementary","PK - 05"]
[117,"Riverside Elementary","PK - 05"]
[117,"Sedgefield Elementary","PK - 05"]
[117,"T. Ryland Sanford Elementary","PK - 05"]
[117,"Warwick High","09 - 12"]
[117,"Watkins Early Childhood Center","PK - PK"]
[117,"Willis A. Jenkins Elementary","PK - 05"]
[117,"Woodside High","09 - 12"]
[118,"Academy for Discovery at Lakewood","03 - 08"]
[118,"Azalea Gardens Middle","06 - 08"]
[118,"Bay View Elementary","PK - 05"]
[118,"Berkley/Campostella Early Childhood Education Center","PK - PK"]
[118,"Blair Middle","06 - 08"]
[118,"Booker T. Washington High ","09 - 12"]
[118,"Camp Allen Elementary","PK - 05"]
[118,"Chesterfield Academy Elementary","PK - 05"]
[118,"Coleman Place Elementary","PK - 05"]
[118,"Crossroads Elementary","PK - 08"]
[118,"Easton Preschool","PK - PK"]
[118,"Fairlawn Elementary","PK - 02"]
[118,"Ghent K-8","KG - 08"]
[118,"Granby Elementary","PK - 05"]
[118,"Granby High","09 - 12"]
[118,"Ingleside Elementary","PK - 05"]
[118,"Jacox Elementary","PK - 05"]
[118,"James Monroe Elementary","PK - 05"]
[118,"Lake Taylor High","09 - 12"]
[118,"Lake Taylor Middle","03 - 08"]
[118,"Larchmont Elementary","PK - 05"]
[118,"Larrymore Elementary","PK - 05"]
[118,"Lindenwood Elementary","PK - 05"]
[118,"Little Creek Elementary","PK - 05"]
[118,"Mary Calcott Elementary","PK - 05"]
[118,"Matthew Fontaine Maury High","09 - 12"]
[118,"Northside Middle","06 - 08"]
[118,"Norview Elementary","PK - 05"]
[118,"Norview High","09 - 12"]
[118,"Norview Middle","06 - 08"]
[118,"Ocean View Elementary","KG - 05"]
[118,"Oceanair Elementary","PK - 05"]
[118,"P.B. Young Sr. Elementary","PK - 02"]
[118,"Richard Bowling Elementary","PK - 05"]
[118,"Sewells Point Elementary","PK - 05"]
[118,"Sherwood Forest Elementary","PK - 05"]
[118,"Southside STEM Academy at Campostella","KG - 08"]
[118,"St. Helena Elementary","PK - 05"]
[118,"Suburban Park Elementary","PK - 05"]
[118,"Tanners Creek Elementary","PK - 05"]
[118,"Tarrallton Elementary","PK - 05"]
[118,"Tidewater Park Elementary","03 - 05"]
[118,"Walter Herron Taylor Elementary","PK - 05"]
[118,"Willard Model Elementary","PK - 05"]
[118,"William H. Ruffner Middle","06 - 08"]
[118,"Willoughby Early Childhood Center","PK - PK"]
[119,"J.I. Burton High","08 - 12"]
[119,"Norton Elementary","PK - 07"]
[120,"Cool Spring Elementary","KG - 05"]
[120,"Lakemont Elementary","KG - 05"]
[120,"Peabody Middle","06 - 07"]
[120,"Petersburg High","09 - 12"]
[120,"Pleasants Lane Elementary","KG - 05"]
[120,"Vernon Johns Middle","06 - 08"]
[120,"Walnut Hill Elementary","KG - 05"]
[120,"Westview Early Childhood Education Center","PK - PK"]
[121,"Brighton Elementary","KG - 06"]
[121,"Churchland Academy Elementary","KG - 06"]
[121,"Churchland Elementary","PKKG"]
[121,"Churchland High","09 - 12"]
[121,"Churchland Middle","07 - 08"]
[121,"Churchland Preschool Center","PK - PK"]
[121,"Churchland Primary & Intermediate","KG - 06"]
[121,"Cradock Middle","07 - 08"]
[121,"Douglass Park Elementary","KG - 06"]
[121,"Hodges Manor Elementary","KG - 06"]
[121,"I.C. Norcom High","09 - 12"]
[121,"James Hurst Elementary","KG - 06"]
[121,"John Tyler Elementary","KG - 06"]
[121,"Lakeview Elementary","KG - 06"]
[121,"Mount Hermon Preschool Center","PK - PK"]
[121,"Olive Branch Preschool Center","PK - PK"]
[121,"Park View Elementary","KG - 06"]
[121,"Simonsdale Elementary","KG - 06"]
[121,"Victory Elementary","KG - 06"]
[121,"Westhaven Elementary","KG - 06"]
[121,"William E. Waters Middle","07 - 08"]
[121,"Woodrow Wilson High","09 - 12"]
[122,"Belle Heth Elementary","03 - 06"]
[122,"John N. Dalton Intermediate","07 - 08"]
[122,"McHarg Elementary","PK - 02"]
[122,"Radford High","09 - 12"]
[123,"Albert Hill Middle","06 - 08"]
[123,"Amelia Street Special Education","PK - 12"]
[123,"Armstrong High","09 - 12"]
[123,"Barack Obama Elementary","PK - 05"]
[123,"Bellevue Elementary","PK - 05"]
[123,"Binford Middle","06 - 08"]
[123,"Blackwell Elementary","PK - 05"]
[123,"Broad Rock Elementary","PK - 05"]
[123,"Chimborazo Elementary","PK - 05"]
[123,"E.S.H. Greene Elementary","PK - 05"]
[123,"Elizabeth D. Redd Elementary","PK - 05"]
[123,"Elkhardt-Thompson Middle","06 - 08"]
[123,"Fairfield Court Elementary","PK - 05"]
[123,"Franklin Military Academy","06 - 12"]
[123,"G.H. Reid Elementary","PK - 05"]
[123,"George Mason Elementary","PK - 05"]
[123,"George W. Carver Elementary","PK - 05"]
[123,"George Wythe High","09 - 12"]
[123,"Ginter Park Elementary","PK - 05"]
[123,"Henderson Middle","06 - 08"]
[123,"Huguenot High","09 - 12"]
[123,"J.B. Fisher Elementary","PK - 05"]
[123,"J.L. Francis Elementary","PK - 05"]
[123,"John B. Cary Elementary","PK - 05"]
[123,"John Marshall High","09 - 12"]
[123,"Linwood Holton Elementary","PK - 05"]
[123,"Lucille M. Brown Middle","06 - 08"]
[123,"Martin Luther King Jr Early Learning Center","PK - PK"]
[123,"Martin Luther King Jr. Middle","06 - 08"]
[123,"Mary Munford Elementary","PK - 05"]
[123,"Maymont Pre-K Center","PK - PK"]
[123,"Miles Jones Elementary","PK - 05"]
[123,"Oak Grove/Bellemeade Elementary","PK - 05"]
[123,"Open High","09 - 12"]
[123,"Overby-Sheppard Elementary","PK - 05"]
[123,"Patrick Henry School of Science and Arts","KG - 05"]
[123,"Richmond Alternative","06 - 12"]
[123,"Richmond Career Education and Employment (Charter School)","09 - 12"]
[123,"Richmond Community High","09 - 12"]
[123,"Southampton Elementary","PK - 05"]
[123,"Summer Hill Preschool Center ","PK - PK"]
[123,"Swansboro Elementary","PK - 05"]
[123,"Thomas C. Boushall Middle","06 - 08"]
[123,"Thomas Jefferson High","09 - 12"]
[123,"Westover Hills Elementary","PK - 05"]
[123,"William Fox Elementary","PK - 05"]
[123,"Woodville Elementary","PK - 05"]
[124,"Addison Aerospace Magnet Middle","06 - 08"]
[124,"Breckinridge Middle","06 - 08"]
[124,"Crystal Spring Elementary","PK - 05"]
[124,"Fairview Elementary","PK - 05"]
[124,"Fallon Park Elementary","PK - 05"]
[124,"Fishburn Park Elementary","PK - 05"]
[124,"Garden City Elementary","PK - 05"]
[124,"Grandin Court Elementary","KG - 05"]
[124,"Highland Park Elementary","PK - 05"]
[124,"Hurt Park Elementary","PK - 05"]
[124,"James Madison Middle","06 - 08"]
[124,"John P. Fishwick Middle","06 - 08"]
[124,"Lincoln Terrace Elementary","PK - 05"]
[124,"Monterey Elementary","KG - 05"]
[124,"Morningside Elementary","PK - 05"]
[124,"Patrick Henry High","09 - 12"]
[124,"Preston Park Elementary","PK - 05"]
[124,"Roanoke Academy For Mathematics & Science Elementary","PK - 05"]
[124,"Round Hill Elementary","PK - 05"]
[124,"Virginia Heights Elementary","PK - 05"]
[124,"Wasena Elementary","KG - 05"]
[124,"Westside Elementary","PK - 05"]
[124,"William Fleming High","09 - 12"]
[124,"Woodrow Wilson Middle","06 - 08"]
[126,"Arthur R. Ware Elementary","KG - 05"]
[126,"Bessie Weller Elementary","KG - 05"]
[126,"Staunton High","09 - 12"]
[126,"Shelburne Middle","06 - 08"]
[126,"Staunton City School PreSchool Programs","PK - PK"]
[126,"Thomas C. McSwain Elementary","KG - 05"]
[127,"Booker T. Washington Elementary","PK - 05"]
[127,"Colonel Fred Cherry Middle","06 - 08"]
[127,"Creekside Elementary","PK - 05"]
[127,"Elephant's Fork Elementary","PK - 05"]
[127,"Florence Bowser Elementary","PK - 01"]
[127,"Forest Glen Middle","06 - 08"]
[127,"Hillpoint Elementary","PK - 05"]
[127,"John F. Kennedy Middle","06 - 08"]
[127,"John Yeates Middle","06 - 08"]
[127,"Kilby Shores Elementary","PK - 05"]
[127,"King's Fork High","09 - 12"]
[127,"King's Fork Middle","06 - 08"]
[127,"Lakeland High","09 - 12"]
[127,"Mack Benn Jr. Elementary","PK - 05"]
[127,"Nansemond Parkway Elementary","PK - 05"]
[127,"Nansemond River High","09 - 12"]
[127,"Northern Shores Elementary","PK - 05"]
[127,"Oakland Elementary","PK - 05"]
[127,"Pioneer Elementary","PK - 05"]
[128,"Alanton Elementary","PK - 05"]
[128,"Arrowhead Elementary","PK - 05"]
[128,"Bayside 6th Grade Campus","06 - 06"]
[128,"Bayside Elementary","PK - 05"]
[128,"Bayside High","09 - 12"]
[128,"Bayside Middle","06 - 08"]
[128,"Birdneck Elementary","PK - 05"]
[128,"Brandon Middle","06 - 08"]
[128,"Brookwood Elementary","PK - 05"]
[128,"Centerville Elementary","PK - 05"]
[128,"Christopher Farms Elementary","PK - 05"]
[128,"College Park Elementary","PK - 05"]
[128,"Corporate Landing Elementary","PK - 05"]
[128,"Corporate Landing Middle","06 - 08"]
[128,"Creeds Elementary","PK - 05"]
[128,"Diamond Springs Elementary","PK - 01"]
[128,"Fairfield Elementary","PK - 05"]
[128,"First Colonial High","09 - 12"]
[128,"Floyd Kellam High","09 - 12"]
[128,"Frank W. Cox High","09 - 12"]
[128,"Glenwood Elementary","PK - 05"]
[128,"Great Neck Middle","06 - 08"]
[128,"Green Run Collegiate","09 - 12"]
[128,"Green Run Elementary","PK - 05"]
[128,"Green Run High","09 - 12"]
[128,"Hermitage Elementary","PK - 05"]
[128,"Holland Elementary","PK - 05"]
[128,"Independence Middle","06 - 08"]
[128,"Indian Lakes Elementary","PK - 05"]
[128,"John B. Dey Elementary","PK - 05"]
[128,"Kempsville Elementary","PK - 05"]
[128,"Kempsville High","09 - 12"]
[128,"Kempsville Meadows Elementary","PK - 05"]
[128,"Kempsville Middle","06 - 08"]
[128,"King's Grant Elementary","PK - 05"]
[128,"Kingston Elementary","PK - 05"]
[128,"Landstown Elementary","PK - 05"]
[128,"Landstown High","09 - 12"]
[128,"Landstown Middle","06 - 08"]
[128,"Larkspur Middle","06 - 08"]
[128,"Linkhorn Park Elementary","PK - 05"]
[128,"Luxford Elementary","PK - 05"]
[128,"Lynnhaven Elementary","PK - 05"]
[128,"Lynnhaven Middle","06 - 08"]
[128,"Malibu Elementary","PK - 05"]
[128,"New Castle Elementary","PK - 05"]
[128,"Newtown Elementary","02 - 03"]
[128,"North Landing Elementary","PK - 05"]
[128,"Ocean Lakes Elementary","PK - 05"]
[128,"Ocean Lakes High","09 - 12"]
[128,"Old Donation School","02 - 08"]
[128,"Parkway Elementary","PK - 05"]
[128,"Pembroke Elementary","PK - 05"]
[128,"Pembroke Meadows Elementary","PK - 05"]
[128,"Plaza Middle","06 - 08"]
[128,"Point O' View Elementary","PK - 05"]
[128,"Princess Anne Elementary","PK - 05"]
[128,"Princess Anne High","09 - 12"]
[128,"Princess Anne Middle","06 - 08"]
[128,"Providence Elementary","PK - 05"]
[128,"Red Mill Elementary","PK - 05"]
[128,"Rosemont Elementary","PK - 05"]
[128,"Rosemont Forest Elementary","PK - 05"]
[128,"Salem Elementary","PK - 05"]
[128,"Salem High","09 - 12"]
[128,"Salem Middle","06 - 08"]
[128,"Seatack Elementary an Achievable Dream Academy","KG - 05"]
[128,"Shelton Park Elementary","PK - 05"]
[128,"Strawbridge Elementary","PK - 05"]
[128,"Tallwood Elementary","PK - 05"]
[128,"Tallwood High","09 - 12"]
[128,"Thalia Elementary","PK - 05"]
[128,"Thoroughgood Elementary","PK - 05"]
[128,"Three Oaks Elementary","PK - 05"]
[128,"Trantwood Elementary","PK - 05"]
[128,"Virginia Beach Middle","06 - 08"]
[128,"W.T. Cooke Elementary","PK - 05"]
[128,"White Oaks Elementary","PK - 05"]
[128,"Williams Elementary","PK - 05"]
[128,"Windsor Oaks Elementary","PK - 05"]
[128,"Windsor Woods Elementary","PK - 05"]
[128,"Woodstock Elementary","PK - 05"]
[130,"Berkeley Glenn Elementary","KG - 05"]
[130,"Kate Collins Middle","06 - 08"]
[130,"Wayne Hills Center","PK - PK"]
[130,"Waynesboro High","09 - 12"]
[130,"Wenonah Elementary","KG - 05"]
[130,"Westwood Hills Elementary","KG - 05"]
[130,"William Perry Elementary","KG - 05"]
[131,"Berkeley Middle","06 - 08"]
[131,"Clara Byrd Baker Elementary","PK - 05"]
[131,"D.J. Montague Elementary","KG - 05"]
[131,"J. Blaine Blayton Elementary","PK - 05"]
[131,"James Blair Middle","06 - 08"]
[131,"James River Elementary","KG - 05"]
[131,"Jamestown High","09 - 12"]
[131,"Lafayette High","09 - 12"]
[131,"Laurel Lane Elementary ","PK - 05"]
[131,"Lois Hornsby Middle","06 - 08"]
[131,"Matoaka Elementary","KG - 05"]
[131,"Matthew Whaley Elementary","KG - 05"]
[131,"Norge Elementary","PK - 05"]
[131,"Stonehouse Elementary","KG - 05"]
[131,"Toano Middle","06 - 08"]
[131,"Warhill High","09 - 12"]
[132,"Daniel Morgan Intermediate","05 - 06"]
[132,"Daniel Morgan Middle","07 - 08"]
[132,"Frederick Douglass Elementary","PK - 04"]
[132,"Garland R. Quarles Elementary","PK - 04"]
[132,"John Handley High","09 - 12"]
[132,"John Kerr Elementary","PK - 04"]
[132,"Virginia Avenue Charlotte Dehart Elementary","PK - 04",null,"West Point Public Schools",null,8888,"Special Situation Schools"]
[135,"Franklin High","09 - 12",null,"West Point Public Schools",510395001762,280,"West Point Elementary","PK",5]
[135,"Joseph P. King Jr. Middle","06 - 08",null,"West Point Public Schools",510395001763,290,"West Point High",9,12]
[135,"S.P. Morton Elementary","PK - 05",null,"West Point Public Schools",510395001502,391,"West Point Middle",6,8]
[136,"B.M. Williams Primary","PK - 02"]
[136,"Butts Road Intermediate","03 - 05"]
[136,"Butts Road Primary","PK - 02"]
[136,"Camelot Elementary","PK - 05"]
[136,"Cedar Road Elementary","PK - 05"]
[136,"Crestwood Intermediate","03 - 05"]
[136,"Crestwood Middle","06 - 08"]
[136,"Deep Creek Central Elementary","PK - 05"]
[136,"Deep Creek Elementary","PK - 05"]
[136,"Deep Creek High","09 - 12"]
[136,"Deep Creek Middle","06 - 08"]
[136,"Edwin W. Chittum Elementary","PK - 05"]
[136,"G.A. Treakle Elementary","PK - 05"]
[136,"George W. Carver Intermediate","03 - 05"]
[136,"Georgetown Primary","PK - 03"]
[136,"Grassfield Elementary","PK - 05"]
[136,"Grassfield High","09 - 12"]
[136,"Great Bridge High","09 - 12"]
[136,"Great Bridge Intermediate","03 - 05"]
[136,"Great Bridge Middle","06 - 08"]
[136,"Great Bridge Primary","PK - 02"]
[136,"Greenbrier Intermediate","03 - 05"]
[136,"Greenbrier Middle","06 - 08"]
[136,"Greenbrier Primary","PK - 02"]
[136,"Hickory Elementary","PK - 05"]
[136,"Hickory High","09 - 12"]
[136,"Hickory Middle","06 - 08"]
[136,"Hugo A. Owens Middle","06 - 08"]
[136,"Indian River High","09 - 12"]
[136,"Indian River Middle","06 - 08"]
[136,"Jolliff Middle","06 - 08"]
[136,"Norfolk Highlands Primary","PK - 03"]
[136,"Oscar F. Smith High","09 - 12"]
[136,"Oscar Smith Middle","06 - 08"]
[136,"Portlock Primary","PK - 02"]
[136,"Rena B. Wright Primary","PK - 02"]
[136,"Southeastern Elementary","PK - 05"]
[136,"Southwestern Elementary","PK - 05"]
[136,"Sparrow Road Intermediate","04 - 05"]
[136,"Thurgood Marshall Elementary","PK - 05"]
[136,"Truitt Intermediate","03 - 05"]
[136,"Western Branch High","09 - 12"]
[136,"Western Branch Intermediate","03 - 05"]
[136,"Western Branch Middle","06 - 08"]
[136,"Western Branch Primary","PK - 02"]
[137,"Harrington Waddell Elementary","KG - 05"]
[137,"Lylburn Downing Middle","06 - 08"]
[139,"Andrew Lewis Middle","06 - 08"]
[139,"East Salem Elementary","PK - 05"]
[139,"G.W. Carver Elementary","PK - 05"]
[139,"Salem High","09 - 12"]
[139,"South Salem Elementary","KG - 05"]
[139,"West Salem Elementary","KG - 05"]
[142,"Poquoson Elementary","03 - 05"]
[142,"Poquoson High","09 - 12"]
[142,"Poquoson Middle","06 - 08"]
[142,"Poquoson Primary","PK - 02"]
[143,"Baldwin Elementary","PK - 04"]
[143,"Baldwin Intermediate","05 - 06"]
[143,"George Carr Round Elementary","PK - 04"]
[143,"Grace E. Metz Middle","07 - 08"]
[143,"Jennie Dean Elementary","PK - 04"]
[143,"Mayfield Intermediate","05 - 06"]
[143,"Osbourn High","09 - 12"]
[143,"Richard C. Haydon Elementary","PK - 04"]
[143,"Weems Elementary","PK - 04"]
[144,"Cougar Elementary","PK - 02"]
[144,"Manassas Park Elementary","03 - 05"]
[144,"Manassas Park High","09 - 12"]
[144,"Manassas Park Middle","06 - 08"]
[202,"Colonial Beach Elementary","PK - 07"]
[202,"Colonial Beach High","08 - 12"]
[207,"West Point Elementary","PK - 05"]
[207,"West Point High","09 - 12"]
[207,"West Point Middle","06 - 08"]
[917,"Yvonne B. Miller High","07 - 12"]

{"sheet":"Prefills","index":17,"n_rows":288,"n_cols":64,"rows_kept":288,"cut":false,"hidden":true,"merged":[]}
[null,"Code",null,null,null,null,null,null,"INNOVATIVE ASSISTANCE PROGRAM AREAS",null,null,null,null,null,null,null,null,null,null,null,"Yes",null,"Yes",null,null,"Title I A",null,null,null,"Title I C",null,null,null,"Title ID",null,null,null,"Title IIA",null,null,null,"Title IID",null,null,null,"Title III",null,null,null,"Title IV",null,null,null,"Title V",null,null,null,"Title VI"]
["ACCOMACK COUNTY PUBLIC SCHOOLS",1,null,null,null,null,null,null,null,null,null,null,null,null,null,null,null,null,null,null,"No",null,"No",null,null,"Payee","ProjectGroupID","CONoSOLIDATED_APP_FLAG","Allocation","Payee","ProjectGroupID","CONoSOLIDATED_APP_FLAG","Allocation","Payee","ProjectGroupID","CONoSOLIDATED_APP_FLAG","Allocation","Payee","ProjectGroupID","CONoSOLIDATED_APP_FLAG","Allocation","Payee","ProjectGroupID","CONoSOLIDATED_APP_FLAG","Allocation","Payee","ProjectGroupID","CONoSOLIDATED_APP_FLAG","Allocation","Payee","ProjectGroupID","CONoSOLIDATED_APP_FLAG","Allocation","Payee","ProjectGroupID","CONoSOLIDATED_APP_FLAG","Allocation","Payee","ProjectGroupID","CONoSOLIDATED_APP_FLAG","Allocation",null,"Payee","Neglected Count"]
["ALBEMARLE COUNTY PUBLIC SCHOOLS",2,null,null,null,null,null," "," ",null,null,null,null,null,null,null,null,null,null,null,null,null,"Shared Services Only",null,null,1,1,"Yes",2020310.89,1,2,"Yes",274686.67,1,3,"Yes",null,1,4,"Yes",291765.78999999998,null,null,null,null,1,6,"Yes",97040.22,1,97,null,null,null,null,null,null,1,9,"Yes",94384.84,null,1]
["ALEXANDRIA CITY PUBLIC SCHOOLS",101,null,null,null,null,null,"1. ","1. Recruiting, training, and hiring highly qualified teachers to reduce class size",null,null,null,null,null,null,null,null,null,null,null,null,null,null,null,null,2,1,"No",1494988.23,2,2,"No",84026.79,2,3,"No",null,2,4,"No",316179.34000000003,null,null,null,null,2,6,"No",103428.7,2,97,null,null,null,null,null,null,2,9,"No",null,null,2]
["ALLEGHANY COUNTY PUBLIC SCHOOLS",3,null,null,null,null,null,"2. ","2. Technology activities, including professional development",null,null,null,null,null,null,null,null,null,null,null,null,null,null,null,null,3,1,"Yes",597714.31999999995,3,2,"Yes",null,3,3,"Yes",null,3,4,"Yes",108836.84,null,null,null,null,3,6,"Yes",2476.63,3,97,null,null,null,null,null,null,3,9,"Yes",null,null,3,53]
["AMELIA COUNTY PUBLIC SCHOOLS",4,null,null,null,null,null,"3a.","3a. Development or acquisition and use of: computer software and hardware",null,null,null,null,null,null,null,null,null,null,null,null,null,"Yes",null,null,4,1,"Yes",340478.7,4,2,"Yes",null,4,3,"Yes",null,4,4,"Yes",66723.360000000001,null,null,null,null,4,6,"Yes",4599.45,4,97,null,null,null,null,null,null,4,9,"Yes",null,null,4]
["AMHERST COUNTY PUBLIC SCHOOLS",5,null,null,null,null,null,"3b.","3b. Development or acquisition and use of: instructional/reference materials and academic assessments",null,null,null,null,null,null,null,null,null,null,null,null,null,"No",null,null,5,1,"No",968506.87,5,2,"No",null,5,3,"No",null,5,4,"No",162116.93,null,null,null,null,5,6,"No",943.48,5,97,null,null,null,null,null,null,5,9,"No",null,null,5]
["APPOMATTOX COUNTY PUBLIC SCHOOLS",6,null,null,null,null,null,"3c.","3c. Development or acquisition and use of: library/media services and materials",null,null,null,null,null,null,null,null,null,null,null,null,null,null,null,null,6,1,"No",530822.75,6,2,"No",null,6,3,"No",null,6,4,"No",90073.64,null,null,null,null,6,6,"No",353.8,6,97,null,null,null,null,null,null,6,9,"No",42396.28,null,6]
["ARLINGTON COUNTY PUBLIC SCHOOLS",7,null,null,null,null,null,"4. ","4. Educational reform projects, including magnet schools",null,null,null,null,null,null,null,null,null,null,null,null,null,null,null,null,7,1,"Yes",2434753.2599999998,7,2,"Yes",null,7,3,"Yes",null,7,4,"Yes",578776.99,null,null,null,null,7,6,"Yes",588170.92000000004,7,97,null,null,null,null,null,null,7,9,"Yes",null,null,7]
["AUGUSTA COUNTY PUBLIC SCHOOLS",8,null,null,null,null,null,"5. ","5. Programs to improve the academic achievement of educationally disadvantaged elementary and secondary students, including dropout prevention",null,null,null,null,null,null,null,null,null,null,null,null,null,null,null,null,8,1,"No",1320589.3799999999,8,2,"No",null,8,3,"No",null,8,4,"No",273200.46999999997,null,null,null,null,8,6,"No",20756.5,8,97,null,null,null,null,null,null,8,9,"No",null,null,8]
["BATH COUNTY PUBLIC SCHOOLS",9,null,null,null,null,null,"6. ","6. Programs to improve the literacy skills of adults, including adult education and family literacy programs",null,null,null,null,null,null,null,null,null,null,null,null,null,null,null,null,9,1,"No",87120.37,9,2,"No",null,9,3,"No",null,9,4,"No",23069.45,null,null,null,null,9,6,"No",1297.28,9,97,null,null,null,null,null,null,9,9,"No",null,null,9]
["BEDFORD CITY PUBLIC SCHOOLS",140,null,null,null,null,null,"7. ","7. Programs for gifted and talented children",null,null,null,null,null,null,null,null,null,null,null,null,null,null,null,null,10,1,"No",1519458.18,10,2,"No",null,10,3,"No",null,10,4,"No",289537.68,null,null,null,null,10,6,"No",14623.9,10,97,null,null,null,null,null,null,10,9,"No",null,null,10]
["BEDFORD COUNTY PUBLIC SCHOOLS",10,null,null,null,null,null,"8. ","8. Planning, design, and initial implementation of charter schools under Title V, Part B",null,null,null,null,null,null,null,null,null,null,null,null,null,null,null,null,11,1,"Yes",139864.63,11,2,"Yes",null,11,3,"Yes",null,11,4,"Yes",29073.03,null,null,null,null,11,6,"Yes",0,11,97,null,null,null,null,null,null,11,9,"Yes",null,null,11]
["BLAND COUNTY PUBLIC SCHOOLS",11,null,null,null,null,null,"9. ","9. School improvement programs or activities under Sections 1116 and 1117 of Title I, Part A",null,null,null,null,null,null,null,null,null,null,null,null,null,null,null,null,12,1,"No",390451.3,12,2,"No",null,12,3,"No",null,12,4,"No",102008.92,null,null,null,null,12,6,"No",5795.58,12,97,null,null,null,null,null,null,12,9,"No",null,null,12]
["BOTETOURT COUNTY PUBLIC SCHOOLS",12,null,null,null,null,null,"10.","10. Community service programs",null,null,null,null,null,null,null,null,null,null,null,null,null,null,null,null,13,1,"Yes",782994.19,13,2,"Yes",null,13,3,"Yes",null,13,4,"Yes",141614.94,null,null,null,null,13,6,"Yes",3773.91,13,97,null,null,null,null,null,null,13,9,"Yes",35353.839999999997,null,13]
["BRISTOL CITY PUBLIC SCHOOLS",102,null,null,null,null,null,"11.","11. Consumer, economic, and personal finance education",null,null,null,null,null,null,null,null,null,null,null,null,null,null,null,null,14,1,"Yes",1426430.57,14,2,"Yes",null,14,3,"Yes",null,14,4,"Yes",288212.45,null,null,null,null,14,6,"Yes",117.93,14,97,null,null,null,null,null,null,14,9,"Yes",59901.19,null,14]
["BRUNSWICK COUNTY PUBLIC SCHOOLS",13,null,null,null,null,null,"12.","12. Public school choice",null,null,null,null,null,null,null,null,null,null,null,null,null,1000,null,null,15,1,"Yes",683921.31,15,2,"Yes",null,15,3,"Yes",null,15,4,"Yes",117055.64,null,null,null,null,15,6,"Yes",117.93,15,97,null,null,null,null,null,null,15,9,"Yes",38227.480000000003,null,15]
["BUCHANAN COUNTY PUBLIC SCHOOLS",14,null,null,null,null,null,"13.","13. Programs to hire and support school nurses",null,null,null,null,null,null,null,null,null,null,null,null,null,2000,null,null,16,1,"No",1556355.76,16,2,"No",null,16,3,"No",null,16,4,"No",286448.53000000003,null,null,null,null,16,6,"No",15921.18,16,97,null,null,null,null,null,null,16,9,"No",null,null,16,2]
["BUCKINGHAM COUNTY PUBLIC SCHOOLS",15,null,null,null,null,null,"14.","14. School-based mental health services",null,null,null,null,null,null,null,null,null,null,null,null,null,3000,null,null,17,1,"Yes",885508.1,17,2,"Yes",null,17,3,"Yes",null,17,4,"Yes",148001.87,null,null,null,null,17,6,"Yes",6722.28,17,97,null,null,null,null,null,null,17,9,"Yes",null,null,17]
["BUENA VISTA CITY PUBLIC SCHOOLS",103,null,null,null,null,null,"15.","15. Alternative educational programs",null,null,null,null,null,null,null,null,null,null,null,null,null,4000,null,null,18,1,"No",1048225,18,2,"No",44652.04,18,3,"No",null,18,4,"No",175016.18,null,null,null,null,18,6,"No",12501.07,18,97,null,null,null,null,null,null,18,9,"No",81089.210000000006,null,18,10]
["CAMPBELL COUNTY PUBLIC SCHOOLS",16,null,null,null,null,null,"16.","16. Prekindergarten programs",null,null,null,null,null,null,null,null,null,null,null,null,null,5000,null,null,19,1,"Yes",174742.95,19,2,"Yes",null,19,3,"Yes",null,19,4,"Yes",41615.81,null,null,null,null,19,6,"Yes",2122.8200000000002,19,97,null,null,null,null,null,null,19,9,"Yes",null,null,19]
["CAROLINE COUNTY PUBLIC SCHOOLS",17,null,null,null,null,null,"17.","17. Academic intervention programs jointly operated with community-based organizations ",null,null,null,null,null,null,null,null,null,null,null,null,null,6000,null,null,20,1,"Yes",718269.47,20,2,"Yes",null,20,3,"Yes",null,20,4,"Yes",100384.89,null,null,null,null,20,6,"Yes",1179.3499999999999,20,97,null,null,null,null,null,null,20,9,"Yes",37438.239999999998,null,20]
["CARROLL COUNTY PUBLIC SCHOOLS",18,null,null,null,null,null,"18.","18. CPR training",null,null,null,null,null,null,null,null,null,null,null,null,null,8000,null,null,21,1,"No",6644383.5199999996,21,2,"No",null,21,3,"No",null,21,4,"No",1115942.77,null,null,null,null,21,6,"No",380345.9,21,97,null,null,null,null,null,null,21,9,"No",null,null,21,5]
["CHARLES CITY COUNTY PUBLIC SCHOOLS",19,null,null,null,null,null,"19.","19. Smaller learning communities",null,null,null,null,null,null,null,null,null,null,null,null,null,null,null,null,22,1,"No",177305.53,22,2,"No",null,22,3,"No",null,22,4,"No",55133.09,null,null,null,null,22,6,"No",1651.09,22,97,null,null,null,null,null,null,22,9,"No",null,null,22]
["CHARLOTTE COUNTY PUBLIC SCHOOLS",20,null,null,null,null,null,"20.","20. Activities that encourage and expand improvements throughout the LEA area that  are designed to advance student academic achievement",null,null,null,null,null,null,null,null,null,null,null,null,null,null,null,null,23,1,"Yes",177621.13,23,2,"Yes",null,23,3,"Yes",null,23,4,"Yes",23564.46,null,null,null,null,23,6,"Yes",707.61,23,97,null,null,null,null,null,null,23,9,"Yes",null,null,23]
["CHARLOTTESVILLE CITY PUBLIC SCHOOLS",104,null,null,null,null,null,"21.","21. Parental and community involvement",null,null,null,null,null,null,null,null,null,null,null,null,null,null,null,null,24,1,"No",1460772.15,24,2,"No",null,24,3,"No",60972.77,24,4,"No",201224.25,null,null,null,null,24,6,"No",54485.81,24,97,null,null,null,null,null,null,24,9,"No",null,null,24,61]
["CHESAPEAKE CITY PUBLIC SCHOOLS",136,null,null,null,null,null,"22.","22. Activities that expand learning through best-practice models",null,null,null,null,null,null,null,null,null,null,null,null,null,null,null,null,25,1,"Yes",460495.23,25,2,"Yes",null,25,3,"Yes",null,25,4,"Yes",68531.73,null,null,null,null,25,6,"Yes",3420.11,25,97,null,null,null,null,null,null,25,9,"Yes",24871.14,null,25]
["CHESTERFIELD COUNTY PUBLIC SCHOOLS",21,null,null,null,null,null,"23.","23. Same-gender schools and classrooms (consistent with applicable law)**",null,null,null,null,null,null,null,null,null,null,null,null,"Local Neglected Facility",null,null,null,26,1,"No",901422.07,26,2,"No",null,26,3,"No",null,26,4,"No",190725.7,null,null,null,null,26,6,"No",0,26,97,null,null,null,null,null,null,26,9,"No",42396.28,null,26]
["CLARKE COUNTY PUBLIC SCHOOLS",22,null,null,null,null,null,"24.","24. Service learning activities",null,null,null,null,null,null,null,null,null,null,null,null,"Local School Division",null,null,null,27,1,"Yes",787895.89,27,2,"Yes",null,27,3,"Yes",null,27,4,"Yes",150710.04,null,null,null,null,27,6,"Yes",7901.62,27,97,null,null,null,null,null,null,27,9,"Yes",null,null,27]
["CLIFTON FORGE CITY",105,null,null,null,null,null,"25.","25. School safety programs",null,null,null,null,null,null,null,null,null,null,null,null,null,null,null,null,28,1,"No",487642.05,28,2,"No",null,28,3,"No",null,28,4,"No",64231.8,null,null,null,null,28,6,"No",4127.71,28,97,null,null,null,null,null,null,28,9,"No",29444.67,null,28]
["COLONIAL BEACH TOWN PUBLIC SCHOOLS",202,null,null,null,null,null,"26.","26. Programs that use research-based cognitive and perceptual development approaches",null,null,null,null,null,null,null,null,null,null,null,null,null,null,null,null,29,1,"No",{"$f":"24575769.41+284520.17","v":24860289.580000002},29,2,"No",null,29,3,"No",null,29,4,"No",3103436.61,null,null,null,null,29,6,"No",4500516.1899999995,29,97,null,null,null,null,null,null,29,9,"No",null,null,29]
["COLONIAL HEIGHTS CITY PUBLIC SCHOOLS",106,null,null,null,null,null,"27.","27. Supplemental educational services as defined in Section 1116(e) of Title I, Part A",null,null,null,null,null,null,null,null,null,null,null,null,null,null,null,null,30,1,"Yes",820211.67,30,2,"Yes",null,30,3,"Yes",null,30,4,"Yes",231857.94,null,null,null,null,30,6,"Yes",58023.85,30,97,null,null,null,null,null,null,30,9,"Yes",null,null,30]
["COVINGTON CITY PUBLIC SCHOOLS",107,null,null,null,null,null,null,"Program Administration",null,null,null,null,null,null,null,null,null,null,null,null,null,null,null,null,31,1,"Yes",464194.11,31,2,"Yes",null,31,3,"Yes",null,31,4,"Yes",78309.009999999995,null,null,null,null,31,6,"Yes",6014.67,31,97,null,null,null,null,null,null,31,9,"Yes",null,null,31]
["CRAIG COUNTY PUBLIC SCHOOLS",23,null,null,null,null,null,null,"Indirect Costs (not to exceed approved rate)",null,null,null,null,null,null,null,null,null,null,null,null,null,null,null,null,32,1,"Yes",356780.34,32,2,"Yes",null,32,3,"Yes",null,32,4,"Yes",91767.55,null,null,null,null,32,6,"Yes",6132.6,32,97,null,null,null,null,null,null,32,9,"Yes",null,null,32,6]
["CULPEPER COUNTY PUBLIC SCHOOLS",24,null,null,null,null,null,null,null,null,null,null,null,null,null,null,null,null,null,null,null,null,null,null,null,33,1,"Yes",1759637.77,33,2,"Yes",null,33,3,"Yes",null,33,4,"Yes",259741.73,null,null,null,null,33,6,"Yes",11085.86,33,97,null,null,null,null,null,null,33,9,"Yes",null,null,33]
["CUMBERLAND COUNTY PUBLIC SCHOOLS",25,null,null,null,null,null,null,null,null,null,null,null,null,null,null,null,null,null,null,null,null,null,null,null,34,1,"No",1369997.08,34,2,"No",null,34,3,"No",52398.47,34,4,"No",267006.27,null,null,null,null,34,6,"No",64274.39,34,97,null,null,null,null,null,null,34,9,"No",null,null,34]
["DANVILLE CITY PUBLIC SCHOOLS",108,null,null,null,null,null,null,null,null,null,null,null,null,null,null,null,null,null,null,null,null,null,null,null,35,1,"No",458807.33,35,2,"No",null,35,3,"No",null,35,4,"No",95220.4,null,null,null,null,35,6,"No",471.74,35,97,null,null,null,null,null,null,35,9,"No",null,null,35]
["DEPARTMENT OF JUVENILE JUSTICE",917,null,null,null,null,null,null,null,null,null,null,null,null,null,null,null,null,null,null,null,null,null,null,null,36,1,"Yes",746961.08,36,2,"Yes",null,36,3,"Yes",null,36,4,"Yes",205487.34,null,null,null,null,36,6,"Yes",5626.14,36,97,null,null,null,null,null,null,36,9,"Yes",null,null,36]
["DICKENSON COUNTY PUBLIC SCHOOLS",26,null,null,null,null,null,null,null,null,null,null,null,null,null,null,null,null,null,null,null,null,null,null,null,37,1,"No",300854.99,37,2,"No",null,37,3,"No",93364.55,37,4,"No",57140.37,null,null,null,null,37,6,"No",4481.5200000000004,37,97,null,null,null,null,null,null,37,9,"No",null,null,37,76]
["DINWIDDIE COUNTY PUBLIC SCHOOLS",27,null,null,null,null,null,null,null,null,null,null,null,null,null,null,null,null,null,null,null,null,null,null,null,38,1,"No",682408.09,38,2,"No",null,38,3,"No",null,38,4,"No",105453.79,null,null,null,null,38,6,"No",2948.37,38,97,null,null,null,null,null,null,38,9,"No",34261.050000000003,null,38]
["EMPORIA CITY PUBLIC SCHOOLS",138,null,null,null,null,null,null,null,null,null,null,null,null,null,null,null,null,null,null,null,null,null,null,null,39,1,"Yes",427791.7,39,2,"Yes",null,39,3,"Yes",null,39,4,"Yes",92085.32,null,null,null,null,39,6,"Yes",10732.05,39,97,null,null,null,null,null,null,39,9,"Yes",null,null,39]
["ESSEX COUNTY PUBLIC SCHOOLS",28,null,null,null,null,null,null,null,null,null,null,null,null,null,null,null,null,null,null,null,null,null,null,null,40,1,"Yes",{"$f":"467171.47+500744.1","v":967915.57},40,2,"Yes",null,40,3,"Yes",null,40,4,"Yes",143292.89000000001,null,null,null,null,40,6,"Yes",11422.52,40,97,null,null,null,null,null,null,40,9,"Yes",45674.66,null,40]
["FAIRFAX CITY PUBLIC SCHOOLS",134,null,null,null,null,null,null,null,null,null,null,null,null,null,null,null,null,null,null,null,null,null,null,null,41,1,"Yes",1561797.92,41,2,"Yes",null,41,3,"Yes",null,41,4,"Yes",266692.28000000003,null,null,null,null,41,6,"Yes",4363.58,41,97,null,null,null,null,null,null,41,9,"Yes",101326.1,null,41]
["FAIRFAX COUNTY PUBLIC SCHOOLS",29,null,null,null,null,null,null,null,null,null,null,null,null,null,null,null,null,null,null,null,null,null,null,null,42,1,"No",1093552.8500000001,42,2,"No",null,42,3,"No",null,42,4,"No",281871.45,null,null,null,null,42,6,"No",18397.810000000001,42,97,null,null,null,null,null,null,42,9,"No",null,null,42]
["FALLS CHURCH CITY PUBLIC SCHOOLS",109,null,null,null,null,null,null,null,null,null,null,null,null,null,null,null,null,null,null,null,null,null,null,null,43,1,"No",10955877.199999999,43,2,"No",null,43,3,"No",null,43,4,"No",1060488.3700000001,null,null,null,null,43,6,"No",337729.78,43,97,null,null,null,null,null,null,43,9,"No",null,null,43,15]
["FAUQUIER COUNTY PUBLIC SCHOOLS",30,null,null,null,null,null,null,null,null,null,null,null,null,null,null,null,null,null,null,null,null,null,null,null,44,1,"No",2509635.1,44,2,"No",null,44,3,"No",null,44,4,"No",344135.24,null,null,null,null,44,6,"No",46820.06,44,97,null,null,null,null,null,null,44,9,"No",136862.07,null,44]
["FLOYD COUNTY PUBLIC SCHOOLS",31,null,null,null,null,null,null,null,null,null,null,null,null,null,null,null,null,null,null,null,null,null,null,null,45,1,"No",51327.25,45,2,"No",null,45,3,"No",null,45,4,"No",14288.79,null,null,null,null,45,6,"No",0,45,97,null,null,null,null,null,null,45,9,"No",null,null,45]
["FLUVANNA COUNTY PUBLIC SCHOOLS",32,null,null,null,null,null,null,null,null,null,null,null,null,null,null,null,null,null,null,null,null,null,null,null,46,1,"No",632832.9,46,2,"No",null,46,3,"No",null,46,4,"No",172646.82,null,null,null,null,46,6,"No",2830.43,46,97,null,null,null,null,null,null,46,9,"No",null,null,46]
["FRANKLIN CITY PUBLIC SCHOOLS",135,null,null,null,null,null,null,null,null,null,null,null,null,null,null,null,null,null,null,null,null,null,null,null,47,1,null,null,47,2,null,null,47,3,null,null,47,4,null,null,null,null,null,null,47,6,null,null,47,97,null,null,null,null,null,null,47,9,null,null,null,47]
["FRANKLIN COUNTY PUBLIC SCHOOLS",33,null,null,null,null,null,null,null,null,null,null,null,null,null,null,null,null,null,null,null,null,null,null,null,48,1,"No",396725.22,48,2,"No",null,48,3,"No",null,48,4,"No",91432.01,null,null,null,null,48,6,"No",2830.43,48,97,null,null,null,null,null,null,48,9,"No",null,null,48]
["FREDERICK COUNTY PUBLIC SCHOOLS",34,null,null,null,null,null,null,null,null,null,null,null,null,null,null,null,null,null,null,null,null,null,null,null,49,1,"Yes",202307.92,49,2,"Yes",null,49,3,"Yes",null,49,4,"Yes",49615.09,null,null,null,null,49,6,"Yes",1533.15,49,97,null,null,null,null,null,null,49,9,"Yes",null,null,49]
["FREDERICKSBURG CITY PUBLIC SCHOOLS",110,null,null,null,null,null,null,null,null,null,null,null,null,null,null,null,null,null,null,null,null,null,null,null,50,1,"Yes",238609.13,50,2,"Yes",null,50,3,"Yes",null,50,4,"Yes",53769.64,null,null,null,null,50,6,"Yes",1651.09,50,97,null,null,null,null,null,null,50,9,"Yes",null,null,50]
["GALAX CITY PUBLIC SCHOOLS",111,null,null,null,null,null,null,null,null,null,null,null,null,null,null,null,null,null,null,null,null,null,null,null,51,1,"Yes",401525.25,51,2,"Yes",null,51,3,"Yes",null,51,4,"Yes",77011.740000000005,null,null,null,null,51,6,"Yes",825.54,51,97,null,null,null,null,null,null,51,9,"Yes",23636.68,null,51]
["GILES COUNTY PUBLIC SCHOOLS",35,null,null,null,null,null,null,null,null,null,null,null,null,null,null,null,null,null,null,null,null,null,null,null,52,1,"Yes",1654805.16,52,2,"Yes",null,52,3,"Yes",null,52,4,"Yes",285434.21000000002,null,null,null,null,52,6,"Yes",117.93,52,97,null,null,null,null,null,null,52,9,"Yes",59860.71,null,52,33]
["GLOUCESTER COUNTY PUBLIC SCHOOLS",36,null,null,null,null,null,null,null,null,null,null,null,null,null,null,null,null,null,null,null,null,null,null,null,53,1,"Yes",1511509.44,53,2,"Yes",null,53,3,"Yes",129567.13,53,4,"Yes",506325.26,null,null,null,null,53,6,"Yes",686851.48,53,97,null,null,null,null,null,null,53,9,"Yes",null,null,53,90]
["GOOCHLAND COUNTY PUBLIC SCHOOLS",37,null,null,null,null,null,null,null,null,null,null,null,null,null,null,null,null,null,null,null,null,null,null,null,54,1,"No",923368.18,54,2,"No",null,54,3,"No",null,54,4,"No",157619.98000000001,null,null,null,null,54,6,"No",6132.6,54,97,null,null,null,null,null,null,54,9,"No",null,null,54,15]
["GRAYSON COUNTY PUBLIC SCHOOLS",38,null,null,null,null,null,null,null,null,null,null,null,null,null,null,null,null,null,null,null,null,null,null,null,55,1,"Yes",556513.6,55,2,"Yes",null,55,3,"Yes",null,55,4,"Yes",101958.14,null,null,null,null,55,6,"Yes",8373.36,55,97,null,null,null,null,null,null,55,9,"Yes",28716.14,null,55]
["GREENE COUNTY PUBLIC SCHOOLS",39,null,null,null,null,null,null,null,null,null,null,null,null,null,null,null,null,null,null,null,null,null,null,null,56,1,"No",376670.1,56,2,"No",null,56,3,"No",null,56,4,"No",78564.81,null,null,null,null,56,6,"No",471.74,56,97,null,null,null,null,null,null,56,9,"No",null,null,56]
["GREENSVILLE COUNTY PUBLIC SCHOOLS",40,null,null,null,null,null,null,null,null,null,null,null,null,null,null,null,null,null,null,null,null,null,null,null,57,1,"Yes",195078.33,57,2,"Yes",null,57,3,"Yes",null,57,4,"Yes",46207.27,null,null,null,null,57,6,"Yes",589.66999999999996,57,97,null,null,null,null,null,null,57,9,"Yes",null,null,57]
["HALIFAX COUNTY PUBLIC SCHOOLS",41,null,null,null,null,null,null,null,null,null,null,null,null,null,null,null,null,null,null,null,null,null,null,null,58,1,"Yes",1399733.98,58,2,"Yes",null,58,3,"Yes",null,58,4,"Yes",223954.11,null,null,null,null,58,6,"Yes",6840.21,58,97,null,null,null,null,null,null,58,9,"Yes",86168.67,null,58]
["HAMPTON CITY PUBLIC SCHOOLS",112,null,null,null,null,null,null,null,null,null,null,null,null,null,null,null,null,null,null,null,null,null,null,null,59,1,"Yes",347964.72,59,2,"Yes",null,59,3,"Yes",null,59,4,"Yes",58049.81,null,null,null,null,59,6,"Yes",353.8,59,97,null,null,null,null,null,null,59,9,"Yes",21774.89,null,59]
["HANOVER COUNTY PUBLIC SCHOOLS",42,null,null,null,null,null,null,null,null,null,null,null,null,null,null,null,null,null,null,null,null,null,null,null,60,1,"No",1823561.3,60,2,"No",null,60,3,"No",null,60,4,"No",344771.08,null,null,null,null,60,6,"No",31210.809999999998,60,97,null,null,null,null,null,null,60,9,"No",null,null,60]
["HARRISONBURG CITY PUBLIC SCHOOLS",113,null,null,null,null,null,null,null,null,null,null,null,null,null,null,null,null,null,null,null,null,null,null,null,62,1,"No",506833.47,62,2,"No",null,62,3,"No",null,62,4,"No",88680.4,null,null,null,null,62,6,"No",4363.58,62,97,null,null,null,null,null,null,62,9,"No",36912.080000000002,null,62]
["HENRICO COUNTY PUBLIC SCHOOLS",43,null,null,null,null,null,null,null,null,null,null,null,null,null,null,null,null,null,null,null,null,null,null,null,63,1,"Yes",256484.66,63,2,"Yes",null,63,3,"Yes",null,63,4,"Yes",51436.66,null,null,null,null,63,6,"Yes",2358.69,63,97,null,null,null,null,null,null,63,9,"Yes",null,null,63]
["HENRY COUNTY PUBLIC SCHOOLS",44,null,null,null,null,null,null,null,null,null,null,null,null,null,null,null,null,null,null,null,null,null,null,null,65,1,"Yes",701866.57,65,2,"Yes",146597.21,65,3,"Yes",null,65,4,"Yes",143027.96,null,null,null,null,65,6,"Yes",17808.13,65,97,null,null,null,null,null,null,65,9,"Yes",30092.25,null,65]
["HIGHLAND COUNTY PUBLIC SCHOOLS",45,null,null,null,null,null,null,null,null,null,null,null,null,null,null,null,null,null,null,null,null,null,null,null,66,1,"Yes",486702.75,66,2,"Yes",null,66,3,"Yes",null,66,4,"Yes",72859.09,null,null,null,null,66,6,"Yes",2476.63,66,97,null,null,null,null,null,null,66,9,"Yes",26834.11,null,66]
["HOPEWELL CITY PUBLIC SCHOOLS",114,null,null,null,null,null,null,null,null,null,null,null,null,null,null,null,null,null,null,null,null,null,null,null,67,1,"Yes",826638.12,67,2,"Yes",16791.84,67,3,"Yes",null,67,4,"Yes",123873.7,null,null,null,null,67,6,"Yes",9906.51,67,97,null,null,null,null,null,null,67,9,"Yes",41060.65,null,67]
["ISLE OF WIGHT COUNTY PUBLIC SCHOOLS",46,null,null,null,null,null,null,null,null,null,null,null,null,null,null,null,null,null,null,null,null,null,null,null,68,1,"Yes",734870.11,68,2,"Yes",null,68,3,"Yes",null,68,4,"Yes",136853.57999999999,null,null,null,null,68,6,"Yes",15657.33,68,97,null,null,null,null,null,null,68,9,"Yes",null,null,68]
["JAMES CITY COUNTY PUBLIC SCHOOLS",47,null,null,null,null,null,null,null,null,null,null,null,null,null,null,null,null,null,null,null,null,null,null,null,69,1,"Yes",868320.95,69,2,"Yes",null,69,3,"Yes",null,69,4,"Yes",140904.88,null,null,null,null,69,6,"Yes",2004.89,69,97,null,null,null,null,null,null,69,9,"Yes",null,null,69]
["JAMES MADISON UNIVERSITY",871,null,null,null,null,null,null,null,null,null,null,null,null,null,null,null,null,null,null,null,null,null,null,null,70,1,"No",669189.81999999995,70,2,"No",null,70,3,"No",null,70,4,"No",116294.58,null,null,null,null,70,6,"No",8609.23,70,97,null,null,null,null,null,null,70,9,"No",49297.06,null,70]
["KING AND QUEEN COUNTY PUBLIC SCHOOLS",49,null,null,null,null,null,null,null,null,null,null,null,null,null,null,null,null,null,null,null,null,null,null,null,71,1,"No",2272136.69,71,2,"No",null,71,3,"No",null,71,4,"No",340390.14,null,null,null,null,71,6,"No",15095.64,71,97,null,null,null,null,null,null,71,9,"No",null,null,71]
["KING GEORGE COUNTY PUBLIC SCHOOLS",48,null,null,null,null,null,null,null,null,null,null,null,null,null,null,null,null,null,null,null,null,null,null,null,72,1,"No",278782.28999999998,72,2,"No",null,72,3,"No",null,72,4,"No",76424.710000000006,null,null,null,null,72,6,"No",4000.8,72,97,null,null,null,null,null,null,72,9,"No",null,null,72]
["KING WILLIAM COUNTY PUBLIC SCHOOLS",50,null,null,null,null,null,null,null,null,null,null,null,null,null,null,null,null,null,null,null,null,null,null,null,73,1,"Yes",944300.07,73,2,"Yes",null,73,3,"Yes",null,73,4,"Yes",149716.19,null,null,null,null,73,6,"Yes",1297.28,73,97,null,null,null,null,null,null,73,9,"Yes",41607.040000000001,null,73]
["LANCASTER COUNTY PUBLIC SCHOOLS",51,null,null,null,null,null,null,null,null,null,null,null,null,null,null,null,null,null,null,null,null,null,null,null,74,1,"Yes",629583.24,74,2,"Yes",null,74,3,"Yes",null,74,4,"Yes",145758,null,null,null,null,74,6,"Yes",7901.62,74,97,null,null,null,null,null,null,74,9,"Yes",null,null,74]
["LEE COUNTY PUBLIC SCHOOLS",52,null,null,null,null,null,null,null,null,null,null,null,null,null,null,null,null,null,null,null,null,null,null,null,75,1,"No",10917135.220000001,75,2,"No",null,75,3,"No",80026.759999999995,75,4,"No",1193842.68,null,null,null,null,75,6,"No",1673669.6199999999,75,97,null,null,null,null,null,null,75,9,"No",null,null,75]
["LEXINGTON CITY PUBLIC SCHOOLS",137,null,null,null,null,null,null,null,null,null,null,null,null,null,null,null,null,null,null,null,null,null,null,null,77,1,"No",1022439.4,77,2,"No",null,77,3,"No",null,77,4,"No",210100.98,null,null,null,null,77,6,"No",2004.89,77,97,null,null,null,null,null,null,77,9,"No",null,null,77]
["LOUDOUN COUNTY PUBLIC SCHOOLS",53,null,null,null,null,null,null,null,null,null,null,null,null,null,null,null,null,null,null,null,null,null,null,null,78,1,"Yes",171114.89,78,2,"Yes",null,78,3,"Yes",null,78,4,"Yes",35529.61,null,null,null,null,78,6,"Yes",1297.28,78,97,null,null,null,null,null,null,78,9,"Yes",null,null,78]
["LOUISA COUNTY PUBLIC SCHOOLS",54,null,null,null,null,null,null,null,null,null,null,null,null,null,null,null,null,null,null,null,null,null,null,null,79,1,"Yes",294362.55,79,2,"Yes",null,79,3,"Yes",null,79,4,"Yes",55251.88,null,null,null,null,79,6,"Yes",8255.43,79,97,null,null,null,null,null,null,79,9,"Yes",22442.71,null,79]
["LUNENBURG COUNTY PUBLIC SCHOOLS",55,null,null,null,null,null,null,null,null,null,null,null,null,null,null,null,null,null,null,null,null,null,null,null,80,1,"No",1291822.28,80,2,"No",null,80,3,"No",null,80,4,"No",271412.65999999997,null,null,null,null,80,6,"No",32265.48,80,97,null,null,null,null,null,null,80,9,"No",null,null,80]
["LYNCHBURG CITY PUBLIC SCHOOLS",115,null,null,null,null,null,null,null,null,null,null,null,null,null,null,null,null,null,null,null,null,null,null,null,81,1,"Yes",533132.23,81,2,"Yes",null,81,3,"Yes",null,81,4,"Yes",105392.96000000001,null,null,null,null,81,6,"Yes",3184.24,81,97,null,null,null,null,null,null,81,9,"Yes",null,null,81]
["MADISON COUNTY PUBLIC SCHOOLS",56,null,null,null,null,null,null,null,null,null,null,null,null,null,null,null,null,null,null,null,null,null,null,null,82,1,"No",1671214.54,82,2,"No",null,82,3,"No",null,82,4,"No",305475.77,null,null,null,null,82,6,"No",73935.86,82,97,null,null,null,null,null,null,82,9,"No",null,null,82]
["MANASSAS CITY PUBLIC SCHOOLS",143,null,null,null,null,null,null,null,null,null,null,null,null,null,null,null,null,null,null,null,null,null,null,null,83,1,"No",1239051.8700000001,83,2,"No",null,83,3,"No",null,83,4,"No",250276.73,null,null,null,null,83,6,"No",471.74,83,97,null,null,null,null,null,null,83,9,"No",77628.7,null,83]
["MANASSAS PARK CITY PUBLIC SCHOOLS",144,null,null,null,null,null,null,null,null,null,null,null,null,null,null,null,null,null,null,null,null,null,null,null,84,1,"No",789605.53,84,2,"No",null,84,3,"No",null,84,4,"No",169718.44,null,null,null,null,84,6,"No",1179.3499999999999,84,97,null,null,null,null,null,null,84,9,"No",null,null,84]
["MARTINSVILLE CITY PUBLIC SCHOOLS",116,null,null,null,null,null,null,null,null,null,null,null,null,null,null,null,null,null,null,null,null,null,null,null,85,1,"Yes",1137680.75,85,2,"Yes",null,85,3,"Yes",null,85,4,"Yes",182563.88,null,null,null,null,85,6,"Yes",34554.86,85,97,null,null,null,null,null,null,85,9,"Yes",null,null,85]
["MATHEWS COUNTY PUBLIC SCHOOLS",57,null,null,null,null,null,null,null,null,null,null,null,null,null,null,null,null,null,null,null,null,null,null,null,86,1,"No",1318650.8999999999,86,2,"No",null,86,3,"No",null,86,4,"No",237420.89,null,null,null,null,86,6,"No",1415.22,86,97,null,null,null,null,null,null,86,9,"No",89163.73,null,86]
["MCVH AUTHORITY",948,null,null,null,null,null,null,null,null,null,null,null,null,null,null,null,null,null,null,null,null,null,null,null,87,1,"No",583799.62,87,2,"No",null,87,3,"No",null,87,4,"No",119981.92,null,null,null,null,87,6,"No",0,87,97,null,null,null,null,null,null,87,9,"No",null,null,87]
["MECKLENBURG COUNTY PUBLIC SCHOOLS",58,null,null,null,null,null,null,null,null,null,null,null,null,null,null,null,null,null,null,null,null,null,null,null,88,1,"No",2853169.91,88,2,"No",null,88,3,"No",null,88,4,"No",415102.86,null,null,null,null,88,6,"No",104372.18,88,97,null,null,null,null,null,null,88,9,"No",null,null,88]
["MIDDLESEX COUNTY PUBLIC SCHOOLS",59,null,null,null,null,null,null,null,null,null,null,null,null,null,null,null,null,null,null,null,null,null,null,null,89,1,"Yes",1824548.49,89,2,"Yes",null,89,3,"Yes",65468.33,89,4,"Yes",391608,null,null,null,null,89,6,"Yes",132204.76,89,97,null,null,null,null,null,null,89,9,"Yes",null,null,89,5]
["MONTGOMERY COUNTY PUBLIC SCHOOLS",60,null,null,null,null,null,null,null,null,null,null,null,null,null,null,null,null,null,null,null,null,null,null,null,90,1,"Yes",205041.79,90,2,"Yes",null,90,3,"Yes",null,90,4,"Yes",51364.37,null,null,null,null,90,6,"Yes",235.87,90,97,null,null,null,null,null,null,90,9,"Yes",null,null,90]
["NELSON COUNTY PUBLIC SCHOOLS",62,null,null,null,null,null,null,null,null,null,null,null,null,null,null,null,null,null,null,null,null,null,null,null,91,1,"Yes",507306.18,91,2,"Yes",null,91,3,"Yes",null,91,4,"Yes",87840.74,null,null,null,null,91,6,"Yes",1533.15,91,97,null,null,null,null,null,null,91,9,"Yes",21248.73,null,91]
["NEW KENT COUNTY PUBLIC SCHOOLS",63,null,null,null,null,null,null,null,null,null,null,null,null,null,null,null,null,null,null,null,null,null,null,null,92,1,"No",1734403.15,92,2,"No",null,92,3,"No",null,92,4,"No",395412.52,null,null,null,null,92,6,"No",5896.73,92,97,null,null,null,null,null,null,92,9,"No",116908.5,null,92]
["NEWPORT NEWS CITY PUBLIC SCHOOLS",117,null,null,null,null,null,null,null,null,null,null,null,null,null,null,null,null,null,null,null,null,null,null,null,93,1,"Yes",941093.19,93,2,"Yes",null,93,3,"Yes",null,93,4,"Yes",166176.79999999999,null,null,null,null,93,6,"Yes",17499.52,93,97,null,null,null,null,null,null,93,9,"Yes",null,null,93]
["NORFOLK CITY PUBLIC SCHOOLS",118,null,null,null,null,null,null,null,null,null,null,null,null,null,null,null,null,null,null,null,null,null,null,null,94,1,"Yes",1786233.7,94,2,"Yes",null,94,3,"Yes",null,94,4,"Yes",296727.14,null,null,null,null,94,6,"Yes",7929.2300000000005,94,97,null,null,null,null,null,null,94,9,"Yes",null,null,94]
["NORTHAMPTON COUNTY PUBLIC SCHOOLS",65,null,null,null,null,null,null,null,null,null,null,null,null,null,null,null,null,null,null,null,null,null,null,null,95,1,"Yes",677808.34,95,2,"Yes",58279.65,95,3,"Yes",null,95,4,"Yes",98032.21,null,null,null,null,95,6,"Yes",9434.77,95,97,null,null,null,null,null,null,95,9,"Yes",30375.57,null,95]
["NORTHUMBERLAND COUNTY PUBLIC SCHOOLS",66,null,null,null,null,null,null,null,null,null,null,null,null,null,null,null,null,null,null,null,null,null,null,null,96,1,"No",2166013.1,96,2,"No",null,96,3,"No",null,96,4,"No",396538.21,null,null,null,null,96,6,"No",2830.43,96,97,null,null,null,null,null,null,96,9,"No",111060.04,null,96]
["NORTON CITY PUBLIC SCHOOLS",119,null,null,null,null,null,null,null,null,null,null,null,null,null,null,null,null,null,null,null,null,null,null,null,97,1,"Yes",1005112.2,97,2,"Yes",null,97,3,"Yes",null,97,4,"Yes",194377.49,null,null,null,null,97,6,"Yes",1061.4100000000001,97,97,null,null,null,null,null,null,97,9,"Yes",80866.600000000006,null,97,10]
["NOTTOWAY COUNTY PUBLIC SCHOOLS",67,null,null,null,null,null,null,null,null,null,null,null,null,null,null,null,null,null,null,null,null,null,null,null,98,1,"Yes",698146.98,98,2,"Yes",null,98,3,"Yes",null,98,4,"Yes",245176.31,null,null,null,null,98,6,"Yes",46105.14,98,97,null,null,null,null,null,null,98,9,"Yes",null,null,98]
["OLD DOMINION UNIVERSITY",798,null,null,null,null,null,null,null,null,null,null,null,null,null,null,null,null,null,null,null,null,null,null,null,101,1,"No",4280605.5999999996,101,2,"No",null,101,3,"No",null,101,4,"No",468249.94,null,null,null,null,101,6,"No",467470.4,101,97,null,null,null,null,null,null,101,9,"No",null,null,101]
["ORANGE COUNTY PUBLIC SCHOOLS",68,null,null,null,null,null,null,null,null,null,null,null,null,null,null,null,null,null,null,null,null,null,null,null,102,1,"Yes",1346583.52,102,2,"Yes",null,102,3,"Yes",null,102,4,"Yes",143172.31,null,null,null,null,102,6,"Yes",4009.78,102,97,null,null,null,null,null,null,102,9,"Yes",null,null,102]
["PAGE COUNTY PUBLIC SCHOOLS",69,null,null,null,null,null,null,null,null,null,null,null,null,null,null,null,null,null,null,null,null,null,null,null,103,1,"No",248476.47,103,2,"No",null,103,3,"No",null,103,4,"No",43172.6,null,null,null,null,103,6,"No",0,103,97,null,null,null,null,null,null,103,9,"No",19569.07,null,103]
["PATRICK COUNTY PUBLIC SCHOOLS",70,null,null,null,null,null,null,null,null,null,null,null,null,null,null,null,null,null,null,null,null,null,null,null,104,1,"Yes",1420270.51,104,2,"Yes",null,104,3,"Yes",43275.68,104,4,"Yes",255988.07,null,null,null,null,104,6,"Yes",54601.119999999995,104,97,null,null,null,null,null,null,104,9,"Yes",null,null,104]
["PETERSBURG CITY PUBLIC SCHOOLS",120,null,null,null,null,null,null,null,null,null,null,null,null,null,null,null,null,null,null,null,null,null,null,null,106,1,"Yes",594611.55000000005,106,2,"Yes",null,106,3,"Yes",null,106,4,"Yes",69828.73,null,null,null,null,106,6,"Yes",9552.7099999999991,106,97,null,null,null,null,null,null,106,9,"Yes",null,null,106]
["PITTSYLVANIA COUNTY PUBLIC SCHOOLS",71,null,null,null,null,null,null,null,null,null,null,null,null,null,null,null,null,null,null,null,null,null,null,null,107,1,"No",247415.35,107,2,"No",null,107,3,"No",null,107,4,"No",50021.95,null,null,null,null,107,6,"No",471.74,107,97,null,null,null,null,null,null,107,9,"No",16938.28,null,107]
["POQUOSON CITY PUBLIC SCHOOLS",142,null,null,null,null,null,null,null,null,null,null,null,null,null,null,null,null,null,null,null,null,null,null,null,108,1,"No",3796935.14,108,2,"No",null,108,3,"No",null,108,4,"No",475518.84,null,null,null,null,108,6,"No",22171.72,108,97,null,null,null,null,null,null,108,9,"No",null,null,108]
["PORTSMOUTH CITY PUBLIC SCHOOLS",121,null,null,null,null,null,null,null,null,null,null,null,null,null,null,null,null,null,null,null,null,null,null,null,109,1,"No",44971.27,109,2,"No",null,109,3,"No",null,109,4,"No",26777.29,null,null,null,null,109,6,"No",18254.349999999999,109,97,null,null,null,null,null,null,109,9,"No",null,null,109]
["POWHATAN COUNTY PUBLIC SCHOOLS",72,null,null,null,null,null,null,null,null,null,null,null,null,null,null,null,null,null,null,null,null,null,null,null,110,1,"No",1039428.17,110,2,"No",null,110,3,"No",null,110,4,"No",126345.28,null,null,null,null,110,6,"No",47173.87,110,97,null,null,null,null,null,null,110,9,"No",null,null,110]
["PRINCE EDWARD COUNTY PUBLIC SCHOOLS",73,null,null,null,null,null,null,null,null,null,null,null,null,null,null,null,null,null,null,null,null,null,null,null,111,1,"No",582513.86,111,2,"No",null,111,3,"No",null,111,4,"No",64239.87,null,null,null,null,111,6,"No",22053.78,111,97,null,null,null,null,null,null,111,9,"No",24344.98,null,111]
["PRINCE GEORGE COUNTY PUBLIC SCHOOLS",74,null,null,null,null,null,null,null,null,null,null,null,null,null,null,null,null,null,null,null,null,null,null,null,112,1,"No",6923666.6600000001,112,2,"No",null,112,3,"No",null,112,4,"No",940652.91,null,null,null,null,112,6,"No",46199.340000000004,112,97,null,null,null,null,null,null,112,9,"No",null,null,112,30]
["PRINCE WILLIAM COUNTY PUBLIC SCHOOLS",75,null,null,null,null,null,null,null,null,null,null,null,null,null,null,null,null,null,null,null,null,null,null,null,113,1,"No",1487116.65,113,2,"No",null,113,3,"No",null,113,4,"No",168091.94,null,null,null,null,113,6,"No",215098.96,113,97,null,null,null,null,null,null,113,9,"No",null,null,113]
["PULASKI COUNTY PUBLIC SCHOOLS",77,null,null,null,null,null,null,null,null,null,null,null,null,null,null,null,null,null,null,null,null,null,null,null,114,1,"Yes",1750689.32,114,2,"Yes",null,114,3,"Yes",null,114,4,"Yes",208604.76,null,null,null,null,114,6,"Yes",12147.27,114,97,null,null,null,null,null,null,114,9,"Yes",null,null,114]
["RADFORD CITY PUBLIC SCHOOLS",122,null,null,null,null,null,null,null,null,null,null,null,null,null,null,null,null,null,null,null,null,null,null,null,115,1,"Yes",3904048.92,115,2,"Yes",null,115,3,"Yes",80979.460000000006,115,4,"Yes",538840.68000000005,null,null,null,null,115,6,"Yes",19930.96,115,97,null,null,null,null,null,null,115,9,"Yes",null,null,115,40]
["RAPPAHANNOCK COUNTY PUBLIC SCHOOLS",78,null,null,null,null,null,null,null,null,null,null,null,null,null,null,null,null,null,null,null,null,null,null,null,116,1,"Yes",1107175.44,116,2,"Yes",null,116,3,"Yes",null,116,4,"Yes",121656.14,null,null,null,null,116,6,"Yes",10967.92,116,97,null,null,null,null,null,null,116,9,"Yes",41485.620000000003,null,116]
["RICHMOND CITY PUBLIC SCHOOLS",123,null,null,null,null,null,null,null,null,null,null,null,null,null,null,null,null,null,null,null,null,null,null,null,117,1,"No",11323604.24,117,2,"No",null,117,3,"No",80026.759999999995,117,4,"No",1472911.9,null,null,null,null,117,6,"No",131809.91,117,97,null,null,null,null,null,null,117,9,"No",null,null,117]
["RICHMOND COUNTY PUBLIC SCHOOLS",79,null,null,null,null,null,null,null,null,null,null,null,null,null,null,null,null,null,null,null,null,null,null,null,118,1,"Yes",14930724.27,118,2,"Yes",null,118,3,"Yes",65736.27,118,4,"Yes",2091288.19,null,null,null,null,118,6,"Yes",75360.25,118,97,null,null,null,null,null,null,118,9,"Yes",null,null,118,51]
["ROANOKE CITY PUBLIC SCHOOLS",124,null,null,null,null,null,null,null,null,null,null,null,null,null,null,null,null,null,null,null,null,null,null,null,119,1,"Yes",259799.5,119,2,"Yes",null,119,3,"Yes",null,119,4,"Yes",42550.62,null,null,null,null,119,6,"Yes",589.66999999999996,119,97,null,null,null,null,null,null,119,9,"Yes",16472.830000000002,null,119]
["ROANOKE COUNTY PUBLIC SCHOOLS",80,null,null,null,null,null,null,null,null,null,null,null,null,null,null,null,null,null,null,null,null,null,null,null,120,1,"Yes",3087811.84,120,2,"Yes",null,120,3,"Yes",50493.07,120,4,"Yes",361057.2,null,null,null,null,120,6,"Yes",16958.7,120,97,null,null,null,null,null,null,120,9,"Yes",null,null,120,55]
["ROCKBRIDGE COUNTY PUBLIC SCHOOLS",81,null,null,null,null,null,null,null,null,null,null,null,null,null,null,null,null,null,null,null,null,null,null,null,121,1,"Yes",6291203.0499999998,121,2,"Yes",null,121,3,"Yes",89553.75,121,4,"Yes",983456.93,null,null,null,null,121,6,"Yes",6604.34,121,97,null,null,null,null,null,null,121,9,"Yes",null,null,121,6]
["ROCKINGHAM COUNTY PUBLIC SCHOOLS",82,null,null,null,null,null,null,null,null,null,null,null,null,null,null,null,null,null,null,null,null,null,null,null,122,1,"No",330764.21000000002,122,2,"No",null,122,3,"No",null,122,4,"No",58624.77,null,null,null,null,122,6,"No",2830.43,122,97,null,null,null,null,null,null,122,9,"No",null,null,122]
["RUSSELL COUNTY PUBLIC SCHOOLS",83,null,null,null,null,null,null,null,null,null,null,null,null,null,null,null,null,null,null,null,null,null,null,null,123,1,"No",15621814.720000001,123,2,"No",null,123,3,"No",46682.28,123,4,"No",1776735.68,null,null,null,null,123,6,"No",143402.03,123,97,null,null,null,null,null,null,123,9,"No",null,null,123,50]
["SALEM CITY PUBLIC SCHOOLS",139,null,null,null,null,null,null,null,null,null,null,null,null,null,null,null,null,null,null,null,null,null,null,null,124,1,"Yes",6985616.0899999999,124,2,"Yes",null,124,3,"Yes",null,124,4,"Yes",809850.07,null,null,null,null,124,6,"Yes",117109.12,124,97,null,null,null,null,null,null,124,9,"Yes",null,null,124]
["SCOTT COUNTY PUBLIC SCHOOLS",84,null,null,null,null,null,null,null,null,null,null,null,null,null,null,null,null,null,null,null,null,null,null,null,126,1,"No",829220.39,126,2,"No",null,126,3,"No",null,126,4,"No",136735.49,null,null,null,null,126,6,"No",5189.13,126,97,null,null,null,null,null,null,126,9,"No",null,null,126]
["SHENANDOAH COUNTY PUBLIC SCHOOLS",85,null,null,null,null,null,null,null,null,null,null,null,null,null,null,null,null,null,null,null,null,null,null,null,127,1,"Yes",3441053.36,127,2,"Yes",null,127,3,"Yes",null,127,4,"Yes",522740.96,null,null,null,null,127,6,"Yes",3066.3,127,97,null,null,null,null,null,null,127,9,"Yes",null,null,127]
["SMYTH COUNTY PUBLIC SCHOOLS",86,null,null,null,null,null,null,null,null,null,null,null,null,null,null,null,null,null,null,null,null,null,null,null,128,1,"No",11918401.67,128,2,"No",null,128,3,"No",184823.71,128,4,"No",2181722.7400000002,null,null,null,null,128,6,"No",132586.43,128,97,null,null,null,null,null,null,128,9,"No",null,null,128,19]
["SOUTHAMPTON COUNTY PUBLIC SCHOOLS",87,null,null,null,null,null,null,null,null,null,null,null,null,null,null,null,null,null,null,null,null,null,null,null,130,1,"Yes",1032107.78,130,2,"Yes",null,130,3,"Yes",null,130,4,"Yes",142325.97,null,null,null,null,130,6,"Yes",14859.77,130,97,null,null,null,null,null,null,130,9,"Yes",null,null,130]
["SOUTHWESTERN VA TRAINING CENTER",951,null,null,null,null,null,null,null,null,null,null,null,null,null,null,null,null,null,null,null,null,null,null,null,131,1,"Yes",{"$f":"315409.43+1056604.22","v":1372013.65},131,2,"Yes",null,131,3,"Yes",null,131,4,"Yes",239593.03,null,null,null,null,131,6,"Yes",55989.35,131,97,null,null,null,null,null,null,131,9,"Yes",null,null,131]
["SPOTSYLVANIA COUNTY PUBLIC SCHOOLS",88,null,null,null,null,null,null,null,null,null,null,null,null,null,null,null,null,null,null,null,null,null,null,null,132,1,"Yes",1130959.53,132,2,"Yes",null,132,3,"Yes",null,132,4,"Yes",146366.35999999999,null,null,null,null,132,6,"Yes",95409.14,132,97,null,null,null,null,null,null,132,9,"Yes",null,null,132,13]
["STAFFORD COUNTY PUBLIC SCHOOLS",89,null,null,null,null,null,null,null,null,null,null,null,null,null,null,null,null,null,null,null,null,null,null,null,134,1,null,null,134,2,null,null,134,3,null,null,134,4,null,null,null,null,null,null,134,6,null,null,134,97,null,null,null,null,null,null,134,9,null,null,null,134]
["STAUNTON CITY PUBLIC SCHOOLS",126,null,null,null,null,null,null,null,null,null,null,null,null,null,null,null,null,null,null,null,null,null,null,null,135,1,"Yes",738740.23,135,2,"Yes",null,135,3,"Yes",null,135,4,"Yes",93799.53,null,null,null,null,135,6,"Yes",825.54,135,97,null,null,null,null,null,null,135,9,"Yes",22726.02,null,135]
["SUFFOLK CITY PUBLIC SCHOOLS",127,null,null,null,null,null,null,null,null,null,null,null,null,null,null,null,null,null,null,null,null,null,null,null,136,1,"No",7403714.2699999996,136,2,"No",null,136,3,"No",null,136,4,"No",1146606.1299999999,null,null,null,null,136,6,"No",83615.679999999993,136,97,null,null,null,null,null,null,136,9,"No",null,null,136]
["SURRY COUNTY PUBLIC SCHOOLS",90,null,null,null,null,null,null,null,null,null,null,null,null,null,null,null,null,null,null,null,null,null,null,null,137,1,"No",61351.81,137,2,"No",null,137,3,"No",null,137,4,"No",22988.75,null,null,null,null,137,6,"No",1886.95,137,97,null,null,null,null,null,null,137,9,"No",null,null,137]
["SUSSEX COUNTY PUBLIC SCHOOLS",91,null,null,null,null,null,null,null,null,null,null,null,null,null,null,null,null,null,null,null,null,null,null,null,138,1,null,null,138,2,null,null,138,3,null,null,138,4,null,null,null,null,null,null,138,6,null,null,138,97,null,null,null,null,null,null,138,9,null,null,null,138]
["TAZEWELL COUNTY PUBLIC SCHOOLS",92,null,null,null,null,null,null,null,null,null,null,null,null,null,null,null,null,null,null,null,null,null,null,null,139,1,"Yes",535745.43000000005,139,2,"Yes",null,139,3,"Yes",null,139,4,"Yes",110906.44,null,null,null,null,139,6,"Yes",7076.08,139,97,null,null,null,null,null,null,139,9,"Yes",null,null,139,11]
["VA BEACH CITY PUBLIC SCHOOLS",128,null,null,null,null,null,null,null,null,null,null,null,null,null,null,null,null,null,null,null,null,null,null,null,140,1,null,null,140,2,null,null,140,3,null,null,140,4,null,null,null,null,null,null,140,6,null,null,140,97,null,null,null,null,null,null,140,9,null,null,null,140]
["VA DEPT OF CORRECTIONAL EDUCATION",900,null,null,null,null,null,null,null,null,null,null,null,null,null,null,null,null,null,null,null,null,null,null,null,142,1,"Yes",66120.22,142,2,"Yes",null,142,3,"Yes",null,142,4,"Yes",42657.15,null,null,null,null,142,6,"Yes",1297.28,142,97,null,null,null,null,null,null,142,9,"Yes",null,null,142]
["VIRGINIA COMMONWEALTH UNIVERSITY",881,null,null,null,null,null,null,null,null,null,null,null,null,null,null,null,null,null,null,null,null,null,null,null,143,1,"Yes",1257011.3899999999,143,2,"Yes",null,143,3,"Yes",null,143,4,"Yes",151662.18,null,null,null,null,143,6,"Yes",280566.57,143,97,null,null,null,null,null,null,143,9,"Yes",null,null,143]
["VSDB STAUNTON",218,null,null,null,null,null,null,null,null,null,null,null,null,null,null,null,null,null,null,null,null,null,null,null,144,1,"Yes",326319.2,144,2,"Yes",null,144,3,"Yes",null,144,4,"Yes",57416.91,null,null,null,null,144,6,"Yes",113806.95,144,97,null,null,null,null,null,null,144,9,"Yes",null,null,144]
["WARREN COUNTY PUBLIC SCHOOLS",93,null,null,null,null,null,null,null,null,null,null,null,null,null,null,null,null,null,null,null,null,null,null,null,202,1,"Yes",303002.57,202,2,"Yes",null,202,3,"Yes",null,202,4,"Yes",24497.49,null,null,null,null,202,6,"Yes",1061.4100000000001,202,97,null,null,null,null,null,null,202,9,"Yes",11454.09,null,202]
["WASHINGTON COUNTY PUBLIC SCHOOLS",94,null,null,null,null,null,null,null,null,null,null,null,null,null,null,null,null,null,null,null,null,null,null,null,207,1,"Yes",49890.32,207,2,"Yes",null,207,3,"Yes",null,207,4,"Yes",15968.96,null,null,null,null,207,6,"Yes",1061.4100000000001,207,97,null,null,null,null,null,null,207,9,"Yes",null,null,207]
["WAYNESBORO CITY PUBLIC SCHOOLS",130,null,null,null,null,null,null,null,null,null,null,null,null,null,null,null,null,null,null,null,null,null,null,null,218,1,"No",88872.72,218,2,"No",null,218,3,"No",null,218,4,"No",18161.310000000001,null,null,null,null,218,6,"No",null,218,97,null,null,null,null,null,null,218,9,"No",null,null,218]
["WEST POINT TOWN PUBLIC SCHOOLS",207,null,null,null,null,null,null,null,null,null,null,null,null,null,null,null,null,null,null,null,null,null,null,null,219,1,null,null,219,2,null,null,219,3,null,null,219,4,null,null,null,null,null,null,219,6,null,null,219,97,null,null,null,null,null,null,219,9,null,null,null,219]
["WESTMORELAND COUNTY PUBLIC SCHOOLS",95,null,null,null,null,null,null,null,null,null,null,null,null,null,null,null,null,null,null,null,null,null,null,null,871,1,null,null,871,2,null,151714.47,871,3,null,null,871,4,null,null,null,null,null,null,871,6,null,null,871,97,null,null,null,null,null,null,871,9,null,null,null,871]
["WILLIAMSBURG CITY PUBLIC SCHOOLS",131,null,null,null,null,null,null,null,null,null,null,null,null,null,null,null,null,null,null,null,null,null,null,null,917,1,null,168553.58,917,2,null,null,917,3,null,null,917,4,null,null,null,null,null,null,917,6,null,null,917,97,null,null,null,null,null,null,900,9,null,null,null,900]
["WINCHESTER CITY PUBLIC SCHOOLS",132]
["WISE COUNTY PUBLIC SCHOOLS",96,null,null,null,null,null,null,null,null,null,null,null,null,null,null,null,null,null,null,null,null,null,null,null,null,null,null,{"$f":"SUM(AC3:AC142)","v":253141808.68000001},null,null,null,{"$f":"SUM(AG3:AG142)","v":776748.66999999993},null,null,null,{"$f":"SUM(AK3:AK143)","v":1123368.99},null,null,null,{"$f":"SUM(AO2:AO143)","v":38258742.920000009},null,null,null,{"$f":"SUM(AS3:AS142)","v":0},null,null,null,{"$f":"SUM(AW3:AW142)","v":11670119.999999991},null,null,null,{"$f":"SUM(BA3:BA142)","v":0},null,null,null,null,null,null,null,{"$f":"SUM(BI3:BI142)","v":1952272.8000000007}]
["WOODROW WILSON REHABILITATION CTR",947,null,null,null,null,null,null,null,null,null,null,null,null,null,null,null,null,null,null,null,null,null,null,null,null,null,null,null,null,null,null,null,null,null,null,null,null,null,null,null,null,null,null,null,null,null,null,null,null,null,null,null,null,null,null,null,null,null,null,null,null,null,{"$f":"SUM(BL3:BL144)","v":656}]
["WYTHE COUNTY PUBLIC SCHOOLS",97,null,null,null,null,null,null,null,null,null,null,null,null,null,null,null,null,null,null,null,null,null,null,null,null,null,null,{"$f":"AC144-253141808.68","v":0}]
["YORK COUNTY PUBLIC SCHOOLS",98,null,null,null,null,null,null,null,null,null,null,null,null,null,null,null,null,null,null,null,null,null,null,null,null,null,null,null,null,null,null,null,null,null,null,null,null,null,null,null,null,null,null,null,null,null,null,null,null,null,null,null,null,null,null,null,null,null,null,{"$f":"SUM(BH191:BH229)","v":0},null,null,{"$f":"BL145-656","v":0}]
[]
[null,null,null,null,null,null,null,null,null,null,null,null,null,null,null,null,null,null,null,null,null,null,null,null,1]
[null,null,null,null,null,null,null,null,null,null,null,null,null,null,null,null,null,null,null,null,null,null,null,null,2]
[null,null,null,null,null,null,null,null,null,null,null,null,null,null,null,null,null,null,null,null,null,null,null,null,3]
[null,null,null,null,null,null,null,null,null,null,null,null,null,null,null,null,null,null,null,null,null,null,null,null,4]
[null,null,null,null,null,null,null,null,null,null,null,null,null,null,null,null,null,null,null,null,null,null,null,null,5]
[null,null,null,null,null,null,null,null,null,null,null,null,null,null,null,null,null,null,null,null,null,null,null,null,6]
[null,null,null,null,null,null,null,null,null,null,null,null,null,null,null,null,null,null,null,null,null,null,null,null,7]
[null,null,null,null,null,null,null,null,null,null,null,null,null,null,null,null,null,null,null,null,null,null,null,null,8]
[null,null,null,null,null,null,null,null,null,null,null,null,null,null,null,null,null,null,null,null,null,null,null,null,9]
[null,null,null,null,null,null,null,null,null,null,null,null,null,null,null,null,null,null,null,null,null,null,null,null,10]
[null,null,null,null,null,null,null,null,null,null,null,null,null,null,null,null,null,null,null,null,null,null,null,null,11]
[null,null,null,null,null,null,null,null,null,null,null,null,null,null,null,null,null,null,null,null,null,null,null,null,12]
[null,null,null,null,null,null,null,null,null,null,null,null,null,null,null,null,null,null,null,null,null,null,null,null,13]
[null,null,null,null,null,null,null,null,null,null,null,null,null,null,null,null,null,null,null,null,null,null,null,null,14]
[null,null,null,null,null,null,null,null,null,null,null,null,null,null,null,null,null,null,null,null,null,null,null,null,15]
[null,null,null,null,null,null,null,null,null,null,null,null,null,null,null,null,null,null,null,null,null,null,null,null,16]
[null,null,null,null,null,null,null,null,null,null,null,null,null,null,null,null,null,null,null,null,null,null,null,null,17]
[null,null,null,null,null,null,null,null,null,null,null,null,null,null,null,null,null,null,null,null,null,null,null,null,18]
[null,null,null,null,null,null,null,null,null,null,null,null,null,null,null,null,null,null,null,null,null,null,null,null,19]
[null,null,null,null,null,null,null,null,null,null,null,null,null,null,null,null,null,null,null,null,null,null,null,null,20]
[null,null,null,null,null,null,null,null,null,null,null,null,null,null,null,null,null,null,null,null,null,null,null,null,21]
[null,null,null,null,null,null,null,null,null,null,null,null,null,null,null,null,null,null,null,null,null,null,null,null,22]
[null,null,null,null,null,null,null,null,null,null,null,null,null,null,null,null,null,null,null,null,null,null,null,null,23]
[null,null,null,null,null,null,null,null,null,null,null,null,null,null,null,null,null,null,null,null,null,null,null,null,24]
[null,null,null,null,null,null,null,null,null,null,null,null,null,null,null,null,null,null,null,null,null,null,null,null,25]
[null,null,null,null,null,null,null,null,null,null,null,null,null,null,null,null,null,null,null,null,null,null,null,null,26]
[null,null,null,null,null,null,null,null,null,null,null,null,null,null,null,null,null,null,null,null,null,null,null,null,27]
[null,null,null,null,null,null,null,null,null,null,null,null,null,null,null,null,null,null,null,null,null,null,null,null,28]
[null,null,null,null,null,null,null,null,null,null,null,null,null,null,null,null,null,null,null,null,null,null,null,null,29]
[null,null,null,null,null,null,null,null,null,null,null,null,null,null,null,null,null,null,null,null,null,null,null,null,30]
[null,null,null,null,null,null,null,null,null,null,null,null,null,null,null,null,null,null,null,null,null,null,null,null,31]
[null,null,null,null,null,null,null,null,null,null,null,null,null,null,null,null,null,null,null,null,null,null,null,null,32]
[null,null,null,null,null,null,null,null,null,null,null,null,null,null,null,null,null,null,null,null,null,null,null,null,33]
[null,null,null,null,null,null,null,null,null,null,null,null,null,null,null,null,null,null,null,null,null,null,null,null,34]
[null,null,null,null,null,null,null,null,null,null,null,null,null,null,null,null,null,null,null,null,null,null,null,null,35]
[null,null,null,null,null,null,null,null,null,null,null,null,null,null,null,null,null,null,null,null,null,null,null,null,36]
[null,null,null,null,null,null,null,null,null,null,null,null,null,null,null,null,null,null,null,null,null,null,null,null,37]
[null,null,null,null,null,null,null,null,null,null,null,null,null,null,null,null,null,null,null,null,null,null,null,null,38]
[null,null,null,null,null,null,null,null,null,null,null,null,null,null,null,null,null,null,null,null,null,null,null,null,39]
[null,null,null,null,null,null,null,null,null,null,null,null,null,null,null,null,null,null,null,null,null,null,null,null,40]
[null,null,null,null,null,null,null,null,null,null,null,null,null,null,null,null,null,null,null,null,null,null,null,null,41]
[null,null,null,null,null,null,null,null,null,null,null,null,null,null,null,null,null,null,null,null,null,null,null,null,42]
[null,null,null,null,null,null,null,null,null,null,null,null,null,null,null,null,null,null,null,null,null,null,null,null,43]
[null,null,null,null,null,null,null,null,null,null,null,null,null,null,null,null,null,null,null,null,null,null,null,null,44]
[null,null,null,null,null,null,null,null,null,null,null,null,null,null,null,null,null,null,null,null,null,null,null,null,45]
[null,null,null,null,null,null,null,null,null,null,null,null,null,null,null,null,null,null,null,null,null,null,null,null,46]
[null,null,null,null,null,null,null,null,null,null,null,null,null,null,null,null,null,null,null,null,null,null,null,null,47]
[null,null,null,null,null,null,null,null,null,null,null,null,null,null,null,null,null,null,null,null,null,null,null,null,48]
[null,null,null,null,null,null,null,null,null,null,null,null,null,null,null,null,null,null,null,null,null,null,null,null,49]
[null,null,null,null,null,null,null,null,null,null,null,null,null,null,null,null,null,null,null,null,null,null,null,null,50]
[null,null,null,null,null,null,null,null,null,null,null,null,null,null,null,null,null,null,null,null,null,null,null,null,51]
[null,null,null,null,null,null,null,null,null,null,null,null,null,null,null,null,null,null,null,null,null,null,null,null,52]
[null,null,null,null,null,null,null,null,null,null,null,null,null,null,null,null,null,null,null,null,null,null,null,null,53]
[null,null,null,null,null,null,null,null,null,null,null,null,null,null,null,null,null,null,null,null,null,null,null,null,54]
[null,null,null,null,null,null,null,null,null,null,null,null,null,null,null,null,null,null,null,null,null,null,null,null,55]
[null,null,null,null,null,null,null,null,null,null,null,null,null,null,null,null,null,null,null,null,null,null,null,null,56]
[null,null,null,null,null,null,null,null,null,null,null,null,null,null,null,null,null,null,null,null,null,null,null,null,57]
[null,null,null,null,null,null,null,null,null,null,null,null,null,null,null,null,null,null,null,null,null,null,null,null,58]
[null,null,null,null,null,null,null,null,null,null,null,null,null,null,null,null,null,null,null,null,null,null,null,null,59]
[null,null,null,null,null,null,null,null,null,null,null,null,null,null,null,null,null,null,null,null,null,null,null,null,60]
[null,null,null,null,null,null,null,null,null,null,null,null,null,null,null,null,null,null,null,null,null,null,null,null,62]
[null,null,null,null,null,null,null,null,null,null,null,null,null,null,null,null,null,null,null,null,null,null,null,null,63]
[null,null,null,null,null,null,null,null,null,null,null,null,null,null,null,null,null,null,null,null,null,null,null,null,65]
[null,null,null,null,null,null,null,null,null,null,null,null,null,null,null,null,null,null,null,null,null,null,null,null,66]
[null,null,null,null,null,null,null,null,null,null,null,null,null,null,null,null,null,null,null,null,null,null,null,null,67]
[null,null,null,null,null,null,null,null,null,null,null,null,null,null,null,null,null,null,null,null,null,null,null,null,68]
[null,null,null,null,null,null,null,null,null,null,null,null,null,null,null,null,null,null,null,null,null,null,null,null,69]
[null,null,null,null,null,null,null,null,null,null,null,null,null,null,null,null,null,null,null,null,null,null,null,null,70]
[null,null,null,null,null,null,null,null,null,null,null,null,null,null,null,null,null,null,null,null,null,null,null,null,71]
[null,null,null,null,null,null,null,null,null,null,null,null,null,null,null,null,null,null,null,null,null,null,null,null,72]
[null,null,null,null,null,null,null,null,null,null,null,null,null,null,null,null,null,null,null,null,null,null,null,null,73]
[null,null,null,null,null,null,null,null,null,null,null,null,null,null,null,null,null,null,null,null,null,null,null,null,74]
[null,null,null,null,null,null,null,null,null,null,null,null,null,null,null,null,null,null,null,null,null,null,null,null,75]
[null,null,null,null,null,null,null,null,null,null,null,null,null,null,null,null,null,null,null,null,null,null,null,null,77]
[null,null,null,null,null,null,null,null,null,null,null,null,null,null,null,null,null,null,null,null,null,null,null,null,78]
[null,null,null,null,null,null,null,null,null,null,null,null,null,null,null,null,null,null,null,null,null,null,null,null,79]
[null,null,null,null,null,null,null,null,null,null,null,null,null,null,null,null,null,null,null,null,null,null,null,null,80]
[null,null,null,null,null,null,null,null,null,null,null,null,null,null,null,null,null,null,null,null,null,null,null,null,81]
[null,null,null,null,null,null,null,null,null,null,null,null,null,null,null,null,null,null,null,null,null,null,null,null,82]
[null,null,null,null,null,null,null,null,null,null,null,null,null,null,null,null,null,null,null,null,null,null,null,null,83]
[null,null,null,null,null,null,null,null,null,null,null,null,null,null,null,null,null,null,null,null,null,null,null,null,84]
[null,null,null,null,null,null,null,null,null,null,null,null,null,null,null,null,null,null,null,null,null,null,null,null,85]
[null,null,null,null,null,null,null,null,null,null,null,null,null,null,null,null,null,null,null,null,null,null,null,null,86]
[null,null,null,null,null,null,null,null,null,null,null,null,null,null,null,null,null,null,null,null,null,null,null,null,87]
[null,null,null,null,null,null,null,null,null,null,null,null,null,null,null,null,null,null,null,null,null,null,null,null,88]
[null,null,null,null,null,null,null,null,null,null,null,null,null,null,null,null,null,null,null,null,null,null,null,null,89]
[null,null,null,null,null,null,null,null,null,null,null,null,null,null,null,null,null,null,null,null,null,null,null,null,90]
[null,null,null,null,null,null,null,null,null,null,null,null,null,null,null,null,null,null,null,null,null,null,null,null,91]
[null,null,null,null,null,null,null,null,null,null,null,null,null,null,null,null,null,null,null,null,null,null,null,null,92]
[null,null,null,null,null,null,null,null,null,null,null,null,null,null,null,null,null,null,null,null,null,null,null,null,93]
[null,null,null,null,null,null,null,null,null,null,null,null,null,null,null,null,null,null,null,null,null,null,null,null,94]
[null,null,null,null,null,null,null,null,null,null,null,null,null,null,null,null,null,null,null,null,null,null,null,null,95]
[null,null,null,null,null,null,null,null,null,null,null,null,null,null,null,null,null,null,null,null,null,null,null,null,96]
[null,null,null,null,null,null,null,null,null,null,null,null,null,null,null,null,null,null,null,null,null,null,null,null,97]
[null,null,null,null,null,null,null,null,null,null,null,null,null,null,null,null,null,null,null,null,null,null,null,null,98]
[null,null,null,null,null,null,null,null,null,null,null,null,null,null,null,null,null,null,null,null,null,null,null,null,101]
[null,null,null,null,null,null,null,null,null,null,null,null,null,null,null,null,null,null,null,null,null,null,null,null,102]
[null,null,null,null,null,null,null,null,null,null,null,null,null,null,null,null,null,null,null,null,null,null,null,null,103]
[null,null,null,null,null,null,null,null,null,null,null,null,null,null,null,null,null,null,null,null,null,null,null,null,104]
[null,null,null,null,null,null,null,null,null,null,null,null,null,null,null,null,null,null,null,null,null,null,null,null,106]
[null,null,null,null,null,null,null,null,null,null,null,null,null,null,null,null,null,null,null,null,null,null,null,null,107]
[null,null,null,null,null,null,null,null,null,null,null,null,null,null,null,null,null,null,null,null,null,null,null,null,108]
[null,null,null,null,null,null,null,null,null,null,null,null,null,null,null,null,null,null,null,null,null,null,null,null,109]
[null,null,null,null,null,null,null,null,null,null,null,null,null,null,null,null,null,null,null,null,null,null,null,null,110]
[null,null,null,null,null,null,null,null,null,null,null,null,null,null,null,null,null,null,null,null,null,null,null,null,111]
[null,null,null,null,null,null,null,null,null,null,null,null,null,null,null,null,null,null,null,null,null,null,null,null,112]
[null,null,null,null,null,null,null,null,null,null,null,null,null,null,null,null,null,null,null,null,null,null,null,null,113]
[null,null,null,null,null,null,null,null,null,null,null,null,null,null,null,null,null,null,null,null,null,null,null,null,114]
[null,null,null,null,null,null,null,null,null,null,null,null,null,null,null,null,null,null,null,null,null,null,null,null,115]
[null,null,null,null,null,null,null,null,null,null,null,null,null,null,null,null,null,null,null,null,null,null,null,null,116]
[null,null,null,null,null,null,null,null,null,null,null,null,null,null,null,null,null,null,null,null,null,null,null,null,117]
[null,null,null,null,null,null,null,null,null,null,null,null,null,null,null,null,null,null,null,null,null,null,null,null,118]
[null,null,null,null,null,null,null,null,null,null,null,null,null,null,null,null,null,null,null,null,null,null,null,null,119]
[null,null,null,null,null,null,null,null,null,null,null,null,null,null,null,null,null,null,null,null,null,null,null,null,120]
[null,null,null,null,null,null,null,null,null,null,null,null,null,null,null,null,null,null,null,null,null,null,null,null,121]
[null,null,null,null,null,null,null,null,null,null,null,null,null,null,null,null,null,null,null,null,null,null,null,null,122]
[null,null,null,null,null,null,null,null,null,null,null,null,null,null,null,null,null,null,null,null,null,null,null,null,123]
[null,null,null,null,null,null,null,null,null,null,null,null,null,null,null,null,null,null,null,null,null,null,null,null,124]
[null,null,null,null,null,null,null,null,null,null,null,null,null,null,null,null,null,null,null,null,null,null,null,null,126]
[null,null,null,null,null,null,null,null,null,null,null,null,null,null,null,null,null,null,null,null,null,null,null,null,127]
[null,null,null,null,null,null,null,null,null,null,null,null,null,null,null,null,null,null,null,null,null,null,null,null,128]
[null,null,null,null,null,null,null,null,null,null,null,null,null,null,null,null,null,null,null,null,null,null,null,null,130]
[null,null,null,null,null,null,null,null,null,null,null,null,null,null,null,null,null,null,null,null,null,null,null,null,131]
[null,null,null,null,null,null,null,null,null,null,null,null,null,null,null,null,null,null,null,null,null,null,null,null,132]
[null,null,null,null,null,null,null,null,null,null,null,null,null,null,null,null,null,null,null,null,null,null,null,null,134]
[null,null,null,null,null,null,null,null,null,null,null,null,null,null,null,null,null,null,null,null,null,null,null,null,135]
[null,null,null,null,null,null,null,null,null,null,null,null,null,null,null,null,null,null,null,null,null,null,null,null,136]
[null,null,null,null,null,null,null,null,null,null,null,null,null,null,null,null,null,null,null,null,null,null,null,null,137]
[null,null,null,null,null,null,null,null,null,null,null,null,null,null,null,null,null,null,null,null,null,null,null,null,138]
[null,null,null,null,null,null,null,null,null,null,null,null,null,null,null,null,null,null,null,null,null,null,null,null,139]
[null,null,null,null,null,null,null,null,null,null,null,null,null,null,null,null,null,null,null,null,null,null,null,null,140]
[null,null,null,null,null,null,null,null,null,null,null,null,null,null,null,null,null,null,null,null,null,null,null,null,142]
[null,null,null,null,null,null,null,null,null,null,null,null,null,null,null,null,null,null,null,null,null,null,null,null,143]
[null,null,null,null,null,null,null,null,null,null,null,null,null,null,null,null,null,null,null,null,null,null,null,null,144]
[null,null,null,null,null,null,null,null,null,null,null,null,null,null,null,null,null,null,null,null,null,null,null,null,202]
[null,null,null,null,null,null,null,null,null,null,null,null,null,null,null,null,null,null,null,null,null,null,null,null,207]
[null,null,null,null,null,null,null,null,null,null,null,null,null,null,null,null,null,null,null,null,null,null,null,null,218]
[null,null,null,null,null,null,null,null,null,null,null,null,null,null,null,null,null,null,null,null,null,null,null,null,219]
[null,null,null,null,null,null,null,null,null,null,null,null,null,null,null,null,null,null,null,null,null,null,null,null,871]
[null,null,null,null,null,null,null,null,null,null,null,null,null,null,null,null,null,null,null,null,null,null,null,null,917]